{
  "_data_files": [
    {
      "filename": "dataset.arrow"
    }
  ],
  "_fingerprint": "20ec3a15a306c8ae",
  "_format_columns": null,
  "_format_kwargs": {},
  "_format_type": null,
  "_indexes": {},
  "_output_all_columns": false,
  "_split": null
}