-- Merging decision tree log ---
manifest
ADDED from F:\norIONIC\test\myApp\platforms\android\app\src\main\AndroidManifest.xml:2:1-24:12
INJECTED from F:\norIONIC\test\myApp\platforms\android\app\src\main\AndroidManifest.xml:2:1-24:12
INJECTED from F:\norIONIC\test\myApp\platforms\android\app\src\main\AndroidManifest.xml:2:1-24:12
INJECTED from F:\norIONIC\test\myApp\platforms\android\app\src\main\AndroidManifest.xml:2:1-24:12
MERGED from [:barcodescanner-release-2.1.5:] C:\Users\Norman\.gradle\caches\transforms-1\files-1.1\barcodescanner-release-2.1.5.aar\0886b21b64992e8c36c835fb3ba8c2d9\AndroidManifest.xml:2:1-14:12
MERGED from [com.android.support:support-v4:27.1.1] C:\Users\Norman\.gradle\caches\transforms-1\files-1.1\support-v4-27.1.1.aar\5f39cb2559528927ee7bfb4db10466b5\AndroidManifest.xml:17:1-22:12
MERGED from [com.android.support:support-media-compat:27.1.1] C:\Users\Norman\.gradle\caches\transforms-1\files-1.1\support-media-compat-27.1.1.aar\20ed90039c86eddaa7cc43678d867920\AndroidManifest.xml:17:1-22:12
MERGED from [com.android.support:support-fragment:27.1.1] C:\Users\Norman\.gradle\caches\transforms-1\files-1.1\support-fragment-27.1.1.aar\f140f36c5c4c1de8a40a75945db5d6f8\AndroidManifest.xml:17:1-22:12
MERGED from [com.android.support:support-core-ui:27.1.1] C:\Users\Norman\.gradle\caches\transforms-1\files-1.1\support-core-ui-27.1.1.aar\b5aa1e69608deea75fa206cbc62114cb\AndroidManifest.xml:17:1-22:12
MERGED from [com.android.support:support-core-utils:27.1.1] C:\Users\Norman\.gradle\caches\transforms-1\files-1.1\support-core-utils-27.1.1.aar\1b64ef8e4b59ecac670b4c3fe11f79c5\AndroidManifest.xml:17:1-22:12
MERGED from [com.android.support:support-compat:27.1.1] C:\Users\Norman\.gradle\caches\transforms-1\files-1.1\support-compat-27.1.1.aar\5a8b106c407efc33c53550e261905826\AndroidManifest.xml:17:1-22:12
MERGED from [:CordovaLib] F:\norIONIC\test\myApp\platforms\android\CordovaLib\build\intermediates\manifests\full\release\AndroidManifest.xml:20:1-27:12
MERGED from [android.arch.lifecycle:runtime:1.1.0] C:\Users\Norman\.gradle\caches\transforms-1\files-1.1\runtime-1.1.0.aar\ba5fdd793e72e378db8fa936cf2d9ebb\AndroidManifest.xml:17:1-22:12
MERGED from [android.arch.lifecycle:livedata-core:1.1.0] C:\Users\Norman\.gradle\caches\transforms-1\files-1.1\livedata-core-1.1.0.aar\5d02d8cb7a19f025b220ef6b01416620\AndroidManifest.xml:17:1-22:12
MERGED from [android.arch.lifecycle:viewmodel:1.1.0] C:\Users\Norman\.gradle\caches\transforms-1\files-1.1\viewmodel-1.1.0.aar\25f405f3b00d205d45cefebef59b737c\AndroidManifest.xml:17:1-22:12
MERGED from [android.arch.core:runtime:1.1.0] C:\Users\Norman\.gradle\caches\transforms-1\files-1.1\runtime-1.1.0.aar\daf48fd8ffc0bae990d7cc68b705ad61\AndroidManifest.xml:17:1-22:12
INJECTED from F:\norIONIC\test\myApp\platforms\android\app\src\main\AndroidManifest.xml:2:1-24:12
INJECTED from F:\norIONIC\test\myApp\platforms\android\app\src\main\AndroidManifest.xml:2:1-24:12
INJECTED from F:\norIONIC\test\myApp\platforms\android\app\src\main\AndroidManifest.xml:2:1-24:12
	package
		ADDED from F:\norIONIC\test\myApp\platforms\android\app\src\main\AndroidManifest.xml:2:98-124
		INJECTED from F:\norIONIC\test\myApp\platforms\android\app\src\main\AndroidManifest.xml
		INJECTED from F:\norIONIC\test\myApp\platforms\android\app\src\main\AndroidManifest.xml
	android:versionName
		ADDED from F:\norIONIC\test\myApp\platforms\android\app\src\main\AndroidManifest.xml:2:70-97
		INJECTED from F:\norIONIC\test\myApp\platforms\android\app\src\main\AndroidManifest.xml
		INJECTED from F:\norIONIC\test\myApp\platforms\android\app\src\main\AndroidManifest.xml
	android:hardwareAccelerated
		ADDED from F:\norIONIC\test\myApp\platforms\android\app\src\main\AndroidManifest.xml:2:11-45
	xmlns:android
		ADDED from F:\norIONIC\test\myApp\platforms\android\app\src\main\AndroidManifest.xml:2:125-183
	android:versionCode
		ADDED from F:\norIONIC\test\myApp\platforms\android\app\src\main\AndroidManifest.xml:2:46-69
		INJECTED from F:\norIONIC\test\myApp\platforms\android\app\src\main\AndroidManifest.xml
		INJECTED from F:\norIONIC\test\myApp\platforms\android\app\src\main\AndroidManifest.xml
supports-screens
ADDED from F:\norIONIC\test\myApp\platforms\android\app\src\main\AndroidManifest.xml:3:5-191
	android:largeScreens
		ADDED from F:\norIONIC\test\myApp\platforms\android\app\src\main\AndroidManifest.xml:3:49-76
	android:smallScreens
		ADDED from F:\norIONIC\test\myApp\platforms\android\app\src\main\AndroidManifest.xml:3:132-159
	android:normalScreens
		ADDED from F:\norIONIC\test\myApp\platforms\android\app\src\main\AndroidManifest.xml:3:77-105
	android:xlargeScreens
		ADDED from F:\norIONIC\test\myApp\platforms\android\app\src\main\AndroidManifest.xml:3:160-188
	android:resizeable
		ADDED from F:\norIONIC\test\myApp\platforms\android\app\src\main\AndroidManifest.xml:3:106-131
	android:anyDensity
		ADDED from F:\norIONIC\test\myApp\platforms\android\app\src\main\AndroidManifest.xml:3:23-48
uses-permission#android.permission.INTERNET
ADDED from F:\norIONIC\test\myApp\platforms\android\app\src\main\AndroidManifest.xml:4:5-67
	android:name
		ADDED from F:\norIONIC\test\myApp\platforms\android\app\src\main\AndroidManifest.xml:4:22-64
application
ADDED from F:\norIONIC\test\myApp\platforms\android\app\src\main\AndroidManifest.xml:5:5-14:19
MERGED from [:barcodescanner-release-2.1.5:] C:\Users\Norman\.gradle\caches\transforms-1\files-1.1\barcodescanner-release-2.1.5.aar\0886b21b64992e8c36c835fb3ba8c2d9\AndroidManifest.xml:11:5-12:19
MERGED from [:barcodescanner-release-2.1.5:] C:\Users\Norman\.gradle\caches\transforms-1\files-1.1\barcodescanner-release-2.1.5.aar\0886b21b64992e8c36c835fb3ba8c2d9\AndroidManifest.xml:11:5-12:19
	android:supportsRtl
		ADDED from F:\norIONIC\test\myApp\platforms\android\app\src\main\AndroidManifest.xml:5:114-140
	android:label
		ADDED from F:\norIONIC\test\myApp\platforms\android\app\src\main\AndroidManifest.xml:5:81-113
	android:hardwareAccelerated
		ADDED from F:\norIONIC\test\myApp\platforms\android\app\src\main\AndroidManifest.xml:5:18-52
	android:icon
		ADDED from F:\norIONIC\test\myApp\platforms\android\app\src\main\AndroidManifest.xml:5:53-80
activity#io.ionic.starter.MainActivity
ADDED from F:\norIONIC\test\myApp\platforms\android\app\src\main\AndroidManifest.xml:6:9-11:20
	android:label
		ADDED from F:\norIONIC\test\myApp\platforms\android\app\src\main\AndroidManifest.xml:6:97-134
	android:launchMode
		ADDED from F:\norIONIC\test\myApp\platforms\android\app\src\main\AndroidManifest.xml:6:135-165
	android:windowSoftInputMode
		ADDED from F:\norIONIC\test\myApp\platforms\android\app\src\main\AndroidManifest.xml:6:257-299
	android:configChanges
		ADDED from F:\norIONIC\test\myApp\platforms\android\app\src\main\AndroidManifest.xml:6:19-96
	android:theme
		ADDED from F:\norIONIC\test\myApp\platforms\android\app\src\main\AndroidManifest.xml:6:194-256
	android:name
		ADDED from F:\norIONIC\test\myApp\platforms\android\app\src\main\AndroidManifest.xml:6:166-193
intent-filter#android.intent.action.MAIN+android.intent.category.LAUNCHER
ADDED from F:\norIONIC\test\myApp\platforms\android\app\src\main\AndroidManifest.xml:7:13-10:29
	android:label
		ADDED from F:\norIONIC\test\myApp\platforms\android\app\src\main\AndroidManifest.xml:7:28-65
action#android.intent.action.MAIN
ADDED from F:\norIONIC\test\myApp\platforms\android\app\src\main\AndroidManifest.xml:8:17-69
	android:name
		ADDED from F:\norIONIC\test\myApp\platforms\android\app\src\main\AndroidManifest.xml:8:25-66
category#android.intent.category.LAUNCHER
ADDED from F:\norIONIC\test\myApp\platforms\android\app\src\main\AndroidManifest.xml:9:17-77
	android:name
		ADDED from F:\norIONIC\test\myApp\platforms\android\app\src\main\AndroidManifest.xml:9:27-74
activity#com.google.zxing.client.android.CaptureActivity
ADDED from F:\norIONIC\test\myApp\platforms\android\app\src\main\AndroidManifest.xml:12:9-311
	android:clearTaskOnLaunch
		ADDED from F:\norIONIC\test\myApp\platforms\android\app\src\main\AndroidManifest.xml:12:19-51
	android:windowSoftInputMode
		ADDED from F:\norIONIC\test\myApp\platforms\android\app\src\main\AndroidManifest.xml:12:261-308
	android:exported
		ADDED from F:\norIONIC\test\myApp\platforms\android\app\src\main\AndroidManifest.xml:12:114-138
	android:configChanges
		ADDED from F:\norIONIC\test\myApp\platforms\android\app\src\main\AndroidManifest.xml:12:52-113
	android:theme
		ADDED from F:\norIONIC\test\myApp\platforms\android\app\src\main\AndroidManifest.xml:12:202-260
	android:name
		ADDED from F:\norIONIC\test\myApp\platforms\android\app\src\main\AndroidManifest.xml:12:139-201
activity#com.google.zxing.client.android.encode.EncodeActivity
ADDED from F:\norIONIC\test\myApp\platforms\android\app\src\main\AndroidManifest.xml:13:9-112
	android:label
		ADDED from F:\norIONIC\test\myApp\platforms\android\app\src\main\AndroidManifest.xml:13:19-40
	android:name
		ADDED from F:\norIONIC\test\myApp\platforms\android\app\src\main\AndroidManifest.xml:13:41-109
uses-sdk
ADDED from F:\norIONIC\test\myApp\platforms\android\app\src\main\AndroidManifest.xml:15:5-74
INJECTED from F:\norIONIC\test\myApp\platforms\android\app\src\main\AndroidManifest.xml:15:5-74
MERGED from [:barcodescanner-release-2.1.5:] C:\Users\Norman\.gradle\caches\transforms-1\files-1.1\barcodescanner-release-2.1.5.aar\0886b21b64992e8c36c835fb3ba8c2d9\AndroidManifest.xml:7:5-9:41
MERGED from [:barcodescanner-release-2.1.5:] C:\Users\Norman\.gradle\caches\transforms-1\files-1.1\barcodescanner-release-2.1.5.aar\0886b21b64992e8c36c835fb3ba8c2d9\AndroidManifest.xml:7:5-9:41
MERGED from [com.android.support:support-v4:27.1.1] C:\Users\Norman\.gradle\caches\transforms-1\files-1.1\support-v4-27.1.1.aar\5f39cb2559528927ee7bfb4db10466b5\AndroidManifest.xml:20:5-44
MERGED from [com.android.support:support-v4:27.1.1] C:\Users\Norman\.gradle\caches\transforms-1\files-1.1\support-v4-27.1.1.aar\5f39cb2559528927ee7bfb4db10466b5\AndroidManifest.xml:20:5-44
MERGED from [com.android.support:support-media-compat:27.1.1] C:\Users\Norman\.gradle\caches\transforms-1\files-1.1\support-media-compat-27.1.1.aar\20ed90039c86eddaa7cc43678d867920\AndroidManifest.xml:20:5-44
MERGED from [com.android.support:support-media-compat:27.1.1] C:\Users\Norman\.gradle\caches\transforms-1\files-1.1\support-media-compat-27.1.1.aar\20ed90039c86eddaa7cc43678d867920\AndroidManifest.xml:20:5-44
MERGED from [com.android.support:support-fragment:27.1.1] C:\Users\Norman\.gradle\caches\transforms-1\files-1.1\support-fragment-27.1.1.aar\f140f36c5c4c1de8a40a75945db5d6f8\AndroidManifest.xml:20:5-44
MERGED from [com.android.support:support-fragment:27.1.1] C:\Users\Norman\.gradle\caches\transforms-1\files-1.1\support-fragment-27.1.1.aar\f140f36c5c4c1de8a40a75945db5d6f8\AndroidManifest.xml:20:5-44
MERGED from [com.android.support:support-core-ui:27.1.1] C:\Users\Norman\.gradle\caches\transforms-1\files-1.1\support-core-ui-27.1.1.aar\b5aa1e69608deea75fa206cbc62114cb\AndroidManifest.xml:20:5-44
MERGED from [com.android.support:support-core-ui:27.1.1] C:\Users\Norman\.gradle\caches\transforms-1\files-1.1\support-core-ui-27.1.1.aar\b5aa1e69608deea75fa206cbc62114cb\AndroidManifest.xml:20:5-44
MERGED from [com.android.support:support-core-utils:27.1.1] C:\Users\Norman\.gradle\caches\transforms-1\files-1.1\support-core-utils-27.1.1.aar\1b64ef8e4b59ecac670b4c3fe11f79c5\AndroidManifest.xml:20:5-44
MERGED from [com.android.support:support-core-utils:27.1.1] C:\Users\Norman\.gradle\caches\transforms-1\files-1.1\support-core-utils-27.1.1.aar\1b64ef8e4b59ecac670b4c3fe11f79c5\AndroidManifest.xml:20:5-44
MERGED from [com.android.support:support-compat:27.1.1] C:\Users\Norman\.gradle\caches\transforms-1\files-1.1\support-compat-27.1.1.aar\5a8b106c407efc33c53550e261905826\AndroidManifest.xml:20:5-44
MERGED from [com.android.support:support-compat:27.1.1] C:\Users\Norman\.gradle\caches\transforms-1\files-1.1\support-compat-27.1.1.aar\5a8b106c407efc33c53550e261905826\AndroidManifest.xml:20:5-44
MERGED from [:CordovaLib] F:\norIONIC\test\myApp\platforms\android\CordovaLib\build\intermediates\manifests\full\release\AndroidManifest.xml:25:5-44
MERGED from [:CordovaLib] F:\norIONIC\test\myApp\platforms\android\CordovaLib\build\intermediates\manifests\full\release\AndroidManifest.xml:25:5-44
MERGED from [android.arch.lifecycle:runtime:1.1.0] C:\Users\Norman\.gradle\caches\transforms-1\files-1.1\runtime-1.1.0.aar\ba5fdd793e72e378db8fa936cf2d9ebb\AndroidManifest.xml:20:5-44
MERGED from [android.arch.lifecycle:runtime:1.1.0] C:\Users\Norman\.gradle\caches\transforms-1\files-1.1\runtime-1.1.0.aar\ba5fdd793e72e378db8fa936cf2d9ebb\AndroidManifest.xml:20:5-44
MERGED from [android.arch.lifecycle:livedata-core:1.1.0] C:\Users\Norman\.gradle\caches\transforms-1\files-1.1\livedata-core-1.1.0.aar\5d02d8cb7a19f025b220ef6b01416620\AndroidManifest.xml:20:5-44
MERGED from [android.arch.lifecycle:livedata-core:1.1.0] C:\Users\Norman\.gradle\caches\transforms-1\files-1.1\livedata-core-1.1.0.aar\5d02d8cb7a19f025b220ef6b01416620\AndroidManifest.xml:20:5-44
MERGED from [android.arch.lifecycle:viewmodel:1.1.0] C:\Users\Norman\.gradle\caches\transforms-1\files-1.1\viewmodel-1.1.0.aar\25f405f3b00d205d45cefebef59b737c\AndroidManifest.xml:20:5-44
MERGED from [android.arch.lifecycle:viewmodel:1.1.0] C:\Users\Norman\.gradle\caches\transforms-1\files-1.1\viewmodel-1.1.0.aar\25f405f3b00d205d45cefebef59b737c\AndroidManifest.xml:20:5-44
MERGED from [android.arch.core:runtime:1.1.0] C:\Users\Norman\.gradle\caches\transforms-1\files-1.1\runtime-1.1.0.aar\daf48fd8ffc0bae990d7cc68b705ad61\AndroidManifest.xml:20:5-44
MERGED from [android.arch.core:runtime:1.1.0] C:\Users\Norman\.gradle\caches\transforms-1\files-1.1\runtime-1.1.0.aar\daf48fd8ffc0bae990d7cc68b705ad61\AndroidManifest.xml:20:5-44
INJECTED from F:\norIONIC\test\myApp\platforms\android\app\src\main\AndroidManifest.xml:15:5-74
	android:targetSdkVersion
		ADDED from F:\norIONIC\test\myApp\platforms\android\app\src\main\AndroidManifest.xml:15:42-71
	android:minSdkVersion
		ADDED from F:\norIONIC\test\myApp\platforms\android\app\src\main\AndroidManifest.xml:15:15-41
		INJECTED from F:\norIONIC\test\myApp\platforms\android\app\src\main\AndroidManifest.xml
		INJECTED from F:\norIONIC\test\myApp\platforms\android\app\src\main\AndroidManifest.xml
uses-permission#android.permission.NFC
ADDED from F:\norIONIC\test\myApp\platforms\android\app\src\main\AndroidManifest.xml:16:5-62
	android:name
		ADDED from F:\norIONIC\test\myApp\platforms\android\app\src\main\AndroidManifest.xml:16:22-59
uses-feature#android.hardware.nfc
ADDED from F:\norIONIC\test\myApp\platforms\android\app\src\main\AndroidManifest.xml:17:5-82
	android:required
		ADDED from F:\norIONIC\test\myApp\platforms\android\app\src\main\AndroidManifest.xml:17:55-79
	android:name
		ADDED from F:\norIONIC\test\myApp\platforms\android\app\src\main\AndroidManifest.xml:17:19-54
uses-permission#android.permission.BLUETOOTH
ADDED from F:\norIONIC\test\myApp\platforms\android\app\src\main\AndroidManifest.xml:18:5-68
	android:name
		ADDED from F:\norIONIC\test\myApp\platforms\android\app\src\main\AndroidManifest.xml:18:22-65
uses-permission#android.permission.BLUETOOTH_ADMIN
ADDED from F:\norIONIC\test\myApp\platforms\android\app\src\main\AndroidManifest.xml:19:5-74
	android:name
		ADDED from F:\norIONIC\test\myApp\platforms\android\app\src\main\AndroidManifest.xml:19:22-71
uses-permission#android.permission.ACCESS_COARSE_LOCATION
ADDED from F:\norIONIC\test\myApp\platforms\android\app\src\main\AndroidManifest.xml:20:5-81
	android:name
		ADDED from F:\norIONIC\test\myApp\platforms\android\app\src\main\AndroidManifest.xml:20:22-78
uses-permission#android.permission.CAMERA
ADDED from F:\norIONIC\test\myApp\platforms\android\app\src\main\AndroidManifest.xml:21:5-65
	android:name
		ADDED from F:\norIONIC\test\myApp\platforms\android\app\src\main\AndroidManifest.xml:21:22-62
uses-permission#android.permission.FLASHLIGHT
ADDED from F:\norIONIC\test\myApp\platforms\android\app\src\main\AndroidManifest.xml:22:5-69
	android:name
		ADDED from F:\norIONIC\test\myApp\platforms\android\app\src\main\AndroidManifest.xml:22:22-66
uses-feature#android.hardware.camera
ADDED from F:\norIONIC\test\myApp\platforms\android\app\src\main\AndroidManifest.xml:23:5-84
	android:required
		ADDED from F:\norIONIC\test\myApp\platforms\android\app\src\main\AndroidManifest.xml:23:58-81
	android:name
		ADDED from F:\norIONIC\test\myApp\platforms\android\app\src\main\AndroidManifest.xml:23:19-57
