## Title: EnchantrixBarker
## Notes: Sends a price list of Enchants that a user has available for sale to the Trade channel. [<%version%>] This AddOn is licensed under the GNU GPL, see GPL.txt for details.
##
## Interface: 80205
## Dependencies: Stubby
## OptionalDeps: Enchantrix, !nLog, DebugLib, Babylonian, LibExtraTip, TipHelper
## SavedVariables: EnchantrixBarkerConfig, EnchantrixBarkerSavedInfo
##
## Version: <%version%> (<%codename%>)
## Revision: $Id$
## Author: Norganna's AddOns
## X-Part-Of: Auctioneer
## X-Category: Professions
## X-Max-Interface: 80205
## X-URL: http://auctioneeraddon.com/
## X-Feedback: http://forums.norganna.org
##
BarkerManifest.lua

BarkerObjects.lua

Libs\Load.xml
BarkerStrings.lua
BarkerLocale.lua

BarkerSettings.lua
BarkerUtil.lua

EnchantrixBarker.lua
EnchantrixBarker.xml
