## Title: Auctioneer Stats: |cff447722Over Time
## Notes: Provides statistics to Auctioneer
##
## Interface: 80300
## LoadOnDemand: 0
## Dependencies: Stubby, Auctioneer
## OptionalDependencies: !nLog, SlideBar, Configator, Babylonian, DebugLib, TipHelper, LibExtraTip, LibDataBroker
## SavedVariables: AuctioneerStatsOverTimeData
##
## Version: <%version%> (<%codename%>)
## Revision: $Id$
## Author: Norganna's AddOns
## X-Part-Of: Auctioneer
## X-Category: Auction House
## X-Max-Interface: 80300
## X-URL: http://auctioneeraddon.com/
## X-Feedback: https://auctioneeraddon.com/slack
##

Main.lua
