## Title: Auc:Util:Scan Progress
## Notes: Auctioneer utility that displays information about the status of on-going Auction House scans.
##
## Interface: 80205
## Dependancies: Auc-Advanced
##
## Version: <%version%> (<%codename%>)
## Revision: $Id$
## Author: Norganna's AddOns
## X-Part-Of: Auctioneer
## X-Category: Auction House
## X-Max-Interface: 80100
## X-URL: http://auctioneeraddon.com/
## X-Feedback: http://forums.norganna.org
##
Embed.xml
