## Title: Auc:Util:Ask Price
## Notes: Auctioneer utility that automatically responds to requests for pricing via the guild and, or, party chat channesl.
##
## Interface: 80205
## Dependancies: Auc-Advanced
##
## Version: <%version%> (<%codename%>)
## Revision: $Id$
## Author: Norganna's AddOns
## X-Part-Of: Auctioneer
## X-Category: Auction House
## X-Max-Interface: 80205
## X-URL: http://auctioneeraddon.com/
## X-Feedback: http://forums.norganna.org
##
Embed.xml
