## Title: Auc:Stat:Std Deviation
## Notes: Statistics extension for Auctioneer that uses the variance to detect, and ignore, outliers and provides pricing recommendations.
##
## Interface: 80205
## LoadOnDemand: 0
## Disabled: 1
## Dependencies: Auc-Advanced
## SavedVariables: AucAdvancedStatStdDevData
##
## Version: <%version%> (<%codename%>)
## Revision: $Id$
## Author: Norganna's AddOns
## X-Part-Of: Auctioneer
## X-Category: Auction House
## X-Max-Interface: 80100
## X-URL: http://auctioneeraddon.com/
## X-Feedback: http://forums.norganna.org
##

StatStdDev.lua
