## Title: Auc:Stat:Simple
## Notes: Simple statistics extension for Auctioneer. Performs historical exponential moving averages at the 1, 3, 7 and 14 day intervals.
##
## Interface: 80205
## LoadOnDemand: 0
## Disabled: 0
## Dependencies: Auc-Advanced
## SavedVariables: AucAdvancedStatSimpleData
##
## Version: <%version%> (<%codename%>)
## Revision: $Id$
## Author: Norganna's AddOns
## X-Part-Of: Auctioneer
## X-Category: Auction House
## X-Max-Interface: 80100
## X-URL: http://auctioneeraddon.com/
## X-Feedback: http://forums.norganna.org
##

StatSimple.lua
