## Title: Auc:Stat:Sales Prices
## Notes: Statistics extension for Auctioneer that bases its pricing recommendations on the sales history contained within BeanCounter.
##
## Interface: 80205
## Dependancies: Auc-Advanced BeanCounter
##
## Version: <%version%> (<%codename%>)
## Revision: $Id$
## Author: Norganna's AddOns
## X-Part-Of: Auctioneer
## X-Category: Auction House
## X-Max-Interface: 80100
## X-URL: http://auctioneeraddon.com/
## X-Feedback: http://forums.norganna.org
##
Embed.xml
