## Title: Auc:Stat:Histogram
## Notes: Statistics extension for Auctioneer that uses a histogram data collection method.
##
## Interface: 80205
## LoadOnDemand: 0
## Disabled: 1
## Dependencies: Auc-Advanced
## SavedVariables: AucAdvancedStatHistogramData
##
## Version: <%version%> (<%codename%>)
## Revision: $Id$
## Author: Norganna's AddOns
## X-Part-Of: Auctioneer
## X-Category: Auction House
## X-Max-Interface: 80100
## X-URL: http://auctioneeraddon.com/
## X-Feedback: http://forums.norganna.org
##

StatHistogram.lua
