## Title: Auc:Match:Undercut
## Notes: Module for Auctioneer that allows you to automatically meet, beat, or exceed the prices set by others when creating auctions at the Auction House.
## Interface: 80205
## Dependancies: Auc-Advanced
##
## Version: <%version%> (<%codename%>)
## Revision: $Id$
## Author: Norganna's AddOns
## X-Part-Of: Auctioneer
## X-Category: Auction House
## X-Max-Interface: 80100
## X-URL: http://auctioneeraddon.com/
## X-Feedback: http://forums.norganna.org
##
Embed.xml
