## Title: Auc:Filter:Basic
## Notes: Allows filtering of Auctioneer data by some basic items, such as minimum quality, minimum item level, and ignored seller.
##
## Interface: 80205
## LoadOnDemand: 0
## Disabled: 0
## Dependencies: Auc-Advanced
## SavedVariables: AucAdvancedFilterBasic_IgnoreList
##
## Version: <%version%> (<%codename%>)
## Revision: $Id$
## Author: Norganna's AddOns
## X-Part-Of: Auctioneer
## X-Category: Auction House
## X-Max-Interface: 80100
## X-URL: http://auctioneeraddon.com/
## X-Feedback: http://forums.norganna.org
##

BasicFilter.xml
BasicFilter.lua
