## Title: Auc:Database
## Notes: AuctioneerDb.com UI Integration AddOn 
##
## Interface: 70000
## LoadOnDemand: 0
## Disabled: 0
## Dependencies: Auc-Advanced
## SavedVariables: AucDbData
##
## X-Revision: 124
## Author: Norganna's AddOns
## X-Part-Of: Auctioneer
## X-Category: Auction House
## X-Max-Interface: 70000
## X-URL: http://www.auctioneerdb.com/
## X-Feedback: http://forums.norganna.org
##
##
Support\Load.xml
DbStrings.lua
DbCore.lua
DbStatus.lua
DbMain.lua
DbBase.lua
DbData.lua
