module github.com/wotd/GitOps-AS-demo-pultry

go 1.17

require github.com/go-redis/redis v6.15.9+incompatible

require (
	github.com/onsi/ginkgo v1.16.5 // indirect
	github.com/onsi/gomega v1.18.1 // indirect
)
