{
    "name": "Widget",
    "alias": "widget",
    "description": "",
    "keywords": [],
    "order": 0,
    "providers": [
        "Modules\\Widget\\Providers\\WidgetServiceProvider"
    ],
    "aliases": {},
    "files": [],
    "requires": []
}
