/* PROJECT */

	Site Name:   Nikjobs
	Site URL:    http://nikjobs.ir
	Created:     2020/01/01
	Standards:   HTML5, CSS3
	Components:  jQuery
	Software:    laravel
	Web Design:  amin nourbaghaei

/* AUTHOR */

	Name:        nikbin
	Nickname:    nikbin
	Title:       find job
