{
    "name": "Seo",
    "alias": "seo",
    "description": "",
    "keywords": [],
    "order": 0,
    "providers": [
        "Modules\\Seo\\Providers\\SeoServiceProvider"
    ],
    "aliases": {},
    "files": [],
    "requires": []
}
