{
    "name": "SpecialDiscount",
    "alias": "specialdiscount",
    "description": "",
    "keywords": [],
    "order": 0,
    "providers": [
        "Modules\\SpecialDiscount\\Providers\\SpecialDiscountServiceProvider"
    ],
    "aliases": {},
    "files": [],
    "requires": []
}
