{
    "name": "Download",
    "alias": "download",
    "description": "",
    "keywords": [],
    "order": 0,
    "providers": [
        "Modules\\Download\\Providers\\DownloadServiceProvider"
    ],
    "aliases": {},
    "files": [],
    "requires": []
}
