{
    "Menu": true,
    "Core": true,
    "Article": true,
    "Information": true,
    "Product": true,
    "Carousel": true,
    "Portfolio": true,
    "Customer": true,
    "Plan": true,
    "Seo": true,
    "Page": true,
    "Sms": true,
    "Question": true,
    "Service": true,
    "User": true,
    "Member": true,
    "Client": true,
    "Payment": true,
    "Comment": true,
    "Event": true,
    "Download": true,
    "Store": true,
    "Brand": true,
    "Educational": true,
    "Request": true,
    "Advertising": true,
    "Order": true,
    "Gallery": true,
    "Video": true,
    "Widget": true,
    "Lottery": true,
    "SpecialDiscount": true,
    "Ad": true,
    "Chat": true,
    "Agent": true
}