{
    "name": "Ad",
    "alias": "ad",
    "description": "",
    "keywords": [],
    "order": 0,
    "providers": [
        "Modules\\Ad\\Providers\\AdServiceProvider"
    ],
    "aliases": {},
    "files": [],
    "requires": []
}
