<svg xmlns="http://www.w3.org/2000/svg" xmlns:xlink="http://www.w3.org/1999/xlink" width="72.451" height="66.451" viewBox="0 0 72.451 66.451">
  <defs>
    <filter id="Rectangle_271" x="0" y="6.116" width="72.451" height="60.336" filterUnits="userSpaceOnUse">
      <feOffset dy="3" input="SourceAlpha"/>
      <feGaussianBlur stdDeviation="3" result="blur"/>
      <feFlood flood-opacity="0.161"/>
      <feComposite operator="in" in2="blur"/>
      <feComposite in="SourceGraphic"/>
    </filter>
  </defs>
  <g id="Calendar" transform="translate(9 0)">
    <g transform="matrix(1, 0, 0, 1, -9, 0)" filter="url(#Rectangle_271)">
      <path id="Rectangle_271-2" data-name="Rectangle 271" d="M0,0H54.451a0,0,0,0,1,0,0V34.982A7.353,7.353,0,0,1,47.1,42.336H7.353A7.353,7.353,0,0,1,0,34.982V0A0,0,0,0,1,0,0Z" transform="translate(9 12.12)" fill="#fff"/>
    </g>
    <path id="Rectangle_272" data-name="Rectangle 272" d="M4.34,0H50.111a4.34,4.34,0,0,1,4.34,4.34v7.328a0,0,0,0,1,0,0H0a0,0,0,0,1,0,0V4.34A4.34,4.34,0,0,1,4.34,0Z" transform="translate(0 3.89)" fill="#dd7359"/>
    <g id="Group_52" data-name="Group 52" transform="translate(6.55 0)">
      <ellipse id="Ellipse_17" data-name="Ellipse 17" cx="4.173" cy="4.173" rx="4.173" ry="4.173" transform="translate(0 5.835)" fill="#df7c64"/>
      <path id="Path_243" data-name="Path 243" d="M20.509,96.862h0a2.944,2.944,0,0,1-2.944-2.944V86.666a2.944,2.944,0,0,1,2.944-2.945h0a2.944,2.944,0,0,1,2.944,2.945v7.252A2.944,2.944,0,0,1,20.509,96.862Z" transform="translate(-16.336 -83.721)" fill="#f0f0f0"/>
    </g>
    <g id="Group_53" data-name="Group 53" transform="translate(39.594 0)">
      <path id="Path_244" data-name="Path 244" d="M48.672,92.069A4.173,4.173,0,1,1,44.5,87.9,4.174,4.174,0,0,1,48.672,92.069Z" transform="translate(-40.326 -82.061)" fill="#df7c64"/>
      <path id="Path_245" data-name="Path 245" d="M44.149,96.862h0a2.944,2.944,0,0,1-2.944-2.944V86.666a2.944,2.944,0,0,1,2.944-2.945h0a2.944,2.944,0,0,1,2.944,2.945v7.252A2.944,2.944,0,0,1,44.149,96.862Z" transform="translate(-39.976 -83.721)" fill="#f0f0f0"/>
    </g>
    <rect id="Rectangle_273" data-name="Rectangle 273" width="54.451" height="1.945" transform="translate(0 15.558)" fill="#e6e6e6"/>
    <text id="i" transform="translate(26.849 40.395)" fill="#303030" font-size="33" font-family="FuturaPTCond-Bold, Futura PT" font-weight="700" letter-spacing="-0.025em"><tspan x="-3.399" y="0">i</tspan></text>
  </g>
</svg>
