{
    "name": "Educational",
    "alias": "educational",
    "description": "",
    "keywords": [],
    "order": 0,
    "providers": [
        "Modules\\Educational\\Providers\\EducationalServiceProvider"
    ],
    "aliases": {},
    "files": [],
    "requires": []
}
