{
    "name": "Information",
    "alias": "information",
    "description": "",
    "keywords": [],
    "order": 0,
    "providers": [
        "Modules\\Information\\Providers\\InformationServiceProvider"
    ],
    "aliases": {},
    "files": [],
    "requires": []
}
