{
    "name": "Carousel",
    "alias": "carousel",
    "description": "",
    "keywords": [],
    "order": 0,
    "providers": [
        "Modules\\Carousel\\Providers\\CarouselServiceProvider"
    ],
    "aliases": {},
    "files": [],
    "requires": []
}
