{
    "name": "Request",
    "alias": "request",
    "description": "",
    "keywords": [],
    "order": 0,
    "providers": [
        "Modules\\Request\\Providers\\RequestServiceProvider"
    ],
    "aliases": {},
    "files": [],
    "requires": []
}
