{
    "name": "Lottery",
    "alias": "lottery",
    "description": "",
    "keywords": [],
    "order": 0,
    "providers": [
        "Modules\\Lottery\\Providers\\LotteryServiceProvider"
    ],
    "aliases": {},
    "files": [],
    "requires": []
}
