module main

go 1.17

require (
	github.com/containerd/containerd v1.5.7 // indirect
	github.com/docker/docker v20.10.10+incompatible
	github.com/docker/go-connections v0.4.0 // indirect
	github.com/google/go-cmp v0.5.6 // indirect
	github.com/gorilla/mux v1.8.0 // indirect
	github.com/grandcat/zeroconf v1.0.0
	github.com/moby/term v0.0.0-20210619224110-3f7ff695adc6 // indirect
	github.com/morikuni/aec v1.0.0 // indirect
	golang.org/x/time v0.0.0-20210723032227-1f47c861a9ac // indirect
	google.golang.org/grpc v1.42.0 // indirect
)

