"A719086171"=>"9432a1c7af7d0e8709966db4047c01ffeb73ac0e",
"zc511321"=>"8ceabfb21be8cf4478b4a0493f49ad1248d14a08",
"W990614666"=>"00008101-000E0D1614D1001E",
"zzy326"=>"012531ed0bfa7fb1fc13d7f19dbfcde25d46181d",
"da066828"=>"00008101-00111D862E10001E",
"asd123"=>"00008101-0005114C3402001E",
"wrz970803"=>"00008101-000E71D90250001E",
"dxf123123"=>"00008101-001A6DDA1E46001E",
"wang0822"=>"00008101-001E3DD40861401E",
"1509833sun"=>"00008030-001975612288802E",
"tian0720"=>"e47143f1c89c384cb0fc7b6db4274911199f197b",
"maowei1125"=>"00008020-000D79CA14FA002E",
"hg123456"=>"00008030-001449111483802E",
"wzq7876573"=>"00008101-0019491226C2001E",
"liujia0206"=>"00008101-000A510A1E78001E",
"liu731107"=>"00008101-000469163ED8001E",
"pjs123456"=>"00008101-00196D8A2E12001E",
"qq333444"=>"00008101-000238C60EF0801E",
"825903969q"=>"47834834f669fdddc8d9ee0ae84bf1b6d9d5bf2e",
"fed7673"=>"00008110-001430DA2178801E",
"123zz456"=>"00008020-0013355E0112002E",
"P11111"=>"00008030-000A11381EF8802E",
"wang123"=>"00008020-001221461EBA002E",
"q646950015"=>"00008030-000274320206802E",
"S130724"=>"a8cb9aef4965b42a82c0aaa3e381164d47a36036",
"cuixs1994"=>"620dfca60c1ecdd07d9953512950fc9ff57b9a26",
"wu5201314"=>"00008030-00083544118B802E",
"Wangxiao2"=>"00008020-001A35361E6A002E",
"wu960501"=>"00008101-001D65080C50001E",
"jiqing416"=>"00008101-0011744E3E82001E",
"Lpd012772"=>"00008101-000D14963602001E",
"yzj0216"=>"00008020-001145C62E68002E",
"xhzl679"=>"e7d3a73f1be471e499c125041abf2c7214395980",
"lmyny5867"=>"57ba32a65c8989056c6d93016b2392659745c356",
"Liuming00"=>"00008101-001231013C84001E",
"wang8530"=>"00008110-00140548210A801E",
