"p463523457"=>"00008030-001D341C3A21802E",
"qgf9248814"=>"00008020-001925A62630003A",
"qiyi1226"=>"e8a2dc46fa3ef383f458a682d9560b9b8cb1f2e5",
"z495617149"=>"00008030-000A55E63C9A802E",
"zdz6611441"=>"00008101-001468D81152001E",
"ly43686669"=>"679cf873258c1f3d2e3219958b28cc2e1ce7dca2",
"kupe521 "=>"00008101-001515192E0A001E",
"fjj0203"=>"00008030-000E295A0191802E",
"zhang12345"=>"00008101-001A195E3EF1001E",
"huan178"=>"00008020-001D4D812633002E",
"c33706790 "=>"00008101-000248D81AD0001E",
"zllac7"=>"00008030-001161110C98802E",
"fanjian622"=>"00008101-0009749C3C90001E",
"sgjw0825"=>"00008030-001150EA3EF8802E",
"l19941103"=>"00008020-000105211112002E",
"sc123456"=>"00008020-000A159A2130003A",
"c33706790"=>"00008101-000248D81AD0001E",
"yao1314"=>"00008110-001E349914F2801E",
"lieying008"=>"00008101-00146CA01AFA001E",
"a5593088"=>"00008110-00094C461E01801E",
"sbpynn234"=>"00008030-000E51CE2101802E",
"boy62015"=>"00008101-000669600E91003A",
"fed123"=>"00008101-001C69022122001E",
"xxs123"=>"00008110-001428DE3604801E",
"austin11"=>"74f1283475fd4ceeb6ab2f0fa2fd73265ba428b0",
"1367638a"=>"787b74a8dfb133d585cecddfe325e851137676a1",
"He3388"=>"00008030-000C09910EE9802E",
"m151016"=>"00008020-001260293490003A",
"deng150141 "=>"101e9425761a07042b2b18d9bd583db04a54795d",
"qwe1234567"=>"00008101-00150C6A3EF2001E",
"xc88866630"=>"162a89eda0e78b39f6dc48982bf826cd1b73609a",
"an198165"=>"00008020-000A75813641002E",