"b254929559"=>"00008020-000E6C8E2E82002E",
"fh1112"=>"00008101-000A09D838C1401E",
"Home199"=>"00008030-00091DC136F8802E",
"328486812a"=>"4283f92a837f39274adff88cbe6929005aa50a00",
"y21597370"=>"00008030-0016203C0128802E",
"sbk123456"=>"cd32cf5d9b19d0f03c2aa285315c9d26a0183382",
"h718339432"=>"00008020-00032D0A0EE9002E",
"A162613"=>"799bf434a49dfb730a9dfd9e7fbdc30b95eae7d1",
"ZG198764"=>"00008110-001908DE2182801E",
"76623144a"=>"08e08e132d955be29f9c4be68d5d431f1d3a091e",
"Ab8001"=>"00008110-001514EE2E78801E",
"kingho2109"=>"3e79f8b5bf5296cca675298b505ed347afa0fa7e",
"ye86482212"=>"00008020-000E1C142E08002E",
"yqz1998"=>"00008020-0002719C2128002E",
"huiyi0633"=>"00008101-000649E802B9003A",
"qin0536"=>"00008101-001509C22241001E",
"q709713385"=>"a0d01d84f33c7d58321b736fd1d2640881642528",
"ai970820"=>"00008020-000C29041A99002E",
"z424282492"=>"00008020-001444A82630003A",
"a512610464"=>"00008030-001A68943480802E",
"ljx8888888"=>"732eb57c53f5961f44f11a2cb65eb73941384819",
"x123456789"=>"75e49b3f51ef2031d337c80b3e3fc5f021e22916",
"chem568912"=>"c6ca134757e2395424dacc8b8b25438200e2769c",
"h181433941"=>"00008030-001C1D492E42802E",
"a19961107"=>"c890f2e70426233f980c4f9630b2a87cb256b4fb",
"q5184328"=>"00008030-000C64502278802E",
"bx0044"=>"cbc82b799acea6849ccccf19c043567ad58ec4fb",
"a334832975"=>"b7cdea36c9645b3cb03a21b62069f98f0224306f",
"WLB6098"=>"8f2cdd639e72e00bd378ae02412cb3691b757277",
"cgn024796"=>"00008030-001650CE118B802E",
"316978k"=>"00008020-001251E1013A002E",
"xgh9425"=>"00008101-000D09891482001E",
"C159357"=>"00008020-000603503E33002E",
"Z19931201"=>"00008020-0005218A0A29002E",
"jun0724"=>"00008030-001D149C3AD0402E",
"hk434433"=>"00008030-000A21380EDB802E",
"Da1190"=>"00008110-001A551A2212801E",
"yang123"=>"00008030-001970D43410402E",
"K247370763"=>"00008110-000434AE1486801",
"aa139789"=>"be298ee1a39d00a159be5d98616e0bc786ade350",
"asd875739"=>"970428f109f9183b4d705725f81816d4632f459e",
"zjm329279"=>"00008030-0005194A0C42802E",
"lang1111"=>"00008030-000D39420AD1802E",
"r889900"=>"00008101-000B789C148A001E",
"ygfengzi12"=>"00008030-000C2D023C47802E",
"zyj147258"=>"00008110-000E5CDA220A801E",
"Ancor2013"=>"00008030-000C18811A86802E",
"Cgq1216"=>"743ff22c7e24ff02bbf66d54cd1525d02e6fa0e4",
"lq19890508"=>"d57d9b8fde9b09a8888e59a6ce1e35f309c1f7a3",
"Vj558558"=>"00008101-000E31682651001E",