"jxw5588"=>"00008030-000269083C09802E",
"szx175 "=>"00008030-001111293E82402E",
"z19970524"=>"00008020-001E4599113B002E",
"kkj777"=>"0246e3976c5fef5b1f88c922247a0396a7d87692",
"ax791016 "=>"00008030-001D05CE0C06402E",
"qwe12345"=>"00008101-00150C6A3EF2001E",
"bie2245 "=>"661840b08bac160867764713b7ee819034ebb3d0",
"LH041015"=>"408f3b0fd0adf1f8aef79a2e6408e61a98f99e9d",
"Shuai521 "=>"bb2dddc8bca23f42232baa324b99005b568322c8",
"a934823 "=>"00008030-000A248E2E2A802E",