"YX1821349"=>"b6309d31f873b6edce35a2a678fa855d0b49ebec",
"156214a"=>"00008101-001915243E52001E",
"19901221a"=>"00008030-00160C2A2638802E",
"Ch10789"=>"00008020-000844D11E50003A",
"fyd0207"=>"00008101-0008493601EB001E",
"Z198271489"=>"00008030-000439403A09802E",
"feng0220"=>"00008101-000270D80C84001E",
"qzsw2021"=>"00008110-001C6958113A801E",
"zgl12138"=>"00008030-0016288036C2802E",
"FED5835"=>"00008020-00163DE63C9A002E",
"xajh909"=>"0e89d3926ad08d96c74683f81efad7a6726c820e",
"http12138"=>"00008030-001C353C26E8802E",
"y159565678"=>"00008030-001C4DE63482802E",
"941120cky"=>"df2055c7d62ae9f33c4d0da999ce87c9afba6390",
"qqw200101"=>"f07b987b2e50b9da72224b0e2fcdf3e27b28e692",
"maxiang123"=>"00008030-000171A80A28802E",
"Abc123456"=>"041e08b7c8bc18bcc5b5436fd8a84b5bcb5081c8",
"Wikinking8"=>"00008030-001279A83641802E",
"5888hou "=>"00008020-001230542E81002E",
"s123456"=>"00008101-001365E20AD2001E",
"d5201314"=>"e51d7f34a2091043406439ecea19828365902219",
"newepr521"=>"b2d55ad9f5a32b4321c2cdd382fef8dd48d19cfe",
"316978k"=>"00008020-001251E1013A002E",
"xj321313"=>"00008101-000520CC2611001E",
"w1334421"=>"00008110-000625E92178801E",
"k137678568"=>"00008030-000369EC3CFB402E",
"j807177802"=>"206a5f78a6c6f1384b4a9792fa3510d381062b08",
"hwc5261"=>"00008030-00064D960AD8802E",
"qq3966466"=>"00008030-001C146E2685802E",
"JR516729 "=>"00008020-001C4D942663002E",
"liu44356"=>"00008030-000D69A21430802E",
"l6821348"=>"00008020-000971683452002E",
"D19951217"=>"00008030-000215990150802E",
"K460883620"=>"bca9ae84a7fe9f0f7f78849f1dd9182cdbe27cea",
"wszq106119"=>"00008020-001A51682642002E",
"x280311614"=>"00008110-0009582A020A801E",
"lmfoh2000"=>"00008020-001D44900A02002E",
"F123456789"=>"00008020-00130CD00C0B002E",
"Lpd012772"=>"00008101-000D14963602001E",
"liangge666"=>"1166dfc4bb44fe52594ed9ada9c060151232e0b5",
"A814865019"=>"00008030-000135003402802E",
"lts520"=>"449c9914567c7e7b1fe00bde67e2f8a83921aa6e",
"a80775490"=>"00008101-00013D542138001E",
"b997734574"=>"00008020-000151A21A02003A",
"arouuu1"=>"00008101-0009485E3630001E",
"he1997"=>"00008030-000E75EE1A82402E",
"177337186f"=>"00008030-000518C1269A402E",
"haohao070"=>"00008030-0001319126BA802E",
"qmyz98"=>"50008020-000C4D481E78002E",
"200194xx"=>"00008020-000604863443002E",
"a1378064"=>"61a9b2497119f24f443ef1f58160d9d51d65e84f",
"SL1888"=>"b29a99375de0fdc50bc7f741f31c8ca36ebcd034",
"13812qaz"=>"00008020-001338463651002E",
"Wu9986jin"=>"00008030-001A554E117A802E",
"00369y"=>"00008101-001145E21E21001E",
"Zn850123"=>"00008020-00112CD60C28002E",
"sss123456"=>"00008030-000619622103802E",
"X17774581"=>"00008101-000448A20291001E",
"Lll183"=>"00008110-001650112222801E",
"waa003"=>"00008030–001445A62208802E",
"cctest "=>"07b2110707409ed2c91d31b3bc4b7619601debd7",