"q610134780"=>"00008030-0005548C1468802E",
"YY991001"=>"00008101-001625DC1445001E",
"lcg3685240"=>"00008101-001571093A92001E",
"Havi1234"=>"00008101-0008782E11BA001E",
"xiayu520"=>"00008030-000338923C45802E",
"lhw313"=>"00008030-000979821450802E",
"zxx520131"=>"00008030-00011D9C1431802E",
"di370829"=>"92eeea9da99799a8667ca62f9fcea201f9bb17e4",
"ymz0596"=>"00008101-00010D6A11BA001E",
"lengleng21"=>"00008101-001908E10E00001E",
"lcg3685240"=>"00008101-001571093A92001E",
"maxiang56"=>"00008101-0001659A3C63001E",
"qq495242"=>"00008020-0016510C1E41002E",
"Z123456"=>"aa565dc2c98c42d332ce35aab2a4a8a800225855",
"X17774581"=>"00008101-000448A20291001E",
"dawei123"=>"00008030-000C09AC3EA0802E",
"a1517937"=>"00008020-00065CAC14F2002E",
"q362390644"=>"00008020-001E443801D9002E",