"skate420"=>"00008110-001065522E01801E",
"Zx1773563 "=>"00008101-000A454COA2A001E",
"ydn621700"=>"00008030-000141AA0AE8802E",
"dxj890422"=>"00008020-0016645A3A33002E",
"w6523878"=>"00008030-000C2C5A3490402E",
"ljl1125"=>"00008030-00016CD91139802E",
"a994683664"=>"00008101-00192D9A3EA1001E",
"yuxia888"=>"00008020-000D18540EE8003A",
"zhao1990"=>"acc9dd4394ca7a59b41ee826a46f1c62a5a756ec",
"yzglsl001"=>"00008101-000524CA1492001E",
"csl199418"=>"00008030-001258483E99802E",
"fan112233"=>"f4c5e3f631b1b071d884e940eecc71a10f4c9dca",
"z2509726"=>"00008030-000910191AF9802E",
"a973364049"=>"00008020-0005116E2103002E",
"y19870408"=>"00008030-000305691199802E",
"d940220"=>"00008030-000C289614D8802E",
" lf527763"=>"8ff082c967ab7e80c6b9b3e1701df41e37060801",
"zd9125"=>"00008030-0015441C2EF8802E",
"a973364049"=>"00008020-0005116E2103002E",
"616352127a"=>"53e023be1d27e4c722d3812537947962438e29b5",
"abc1314520"=>"c6f50466f63f84ea5076cf380383cc34cb03cb26",
"XSM123456"=>"00008020-001D25120A99002E",
"a779a119a "=>"f9b17328892932143e06bd60062839f2fb97a266",
"xu1355346055"=>"37cee45fb908f88ebc51a67ae9617624d86e5f89",
"grq0129"=>"8d90fc6ad330c4154dbd19757e2a245254a12d03",
"lx19961124 "=>"00008020-001E3D163A79002E",
"luyifu6666"=>"00008101-001538321AE0001E",
"ca8088"=>"00008101-001A09691428001E",
"670145161c"=>"00008101-000D391222D8001E",
"qz775666"=>"00008101-00050DA43421001E",
"jjchen7610"=>"00008030-0002759E1412802E",
"a76742600"=>"ec58f7fa5716c833ee5d6a55d7ea3a08258ebb7e",
"Zbh960729 "=>"00008101-00190C222622001E",
"lcx0103"=>"7c212a985b10594f804454af3f5f01f4404c21f3",
"zz626658"=>"ef1ee1a4986d38dcc26538d9801f15da921e08b1",
"dy52588814"=>"00008101-000578380AA2001E",
"Frd8866"=>"f57a312679dcf46b625706ddc2779a6b01b5349a",
"Xj123456"=>"00008020-001079411409002E",
"zy5621781"=>"2c6ef3c29e83dc8360bea766ad0b0000be9ec3c5",
"licong1991"=>"00008101-001509C22241001E",