"su1234567"=>"00008030-001E40D63630802E",
"A19551922"=>"00008110-001E75E90A86801E",
"w514199266"=>"00008020-0004719634B8002E",
"Aa55661314"=>"00008020-00154DC43AEA002E",
"ty8225646"=>"ebd4a6f160ff3bff5ca247d0416c70b6abf52dbf",
"132012LX"=>"45017248fdbec908690123a0ea0b2b4d09f827ea",
"Du59019259"=>"00008101-001639900011401E",
"bie2245"=>"661840b08bac160867764713b7ee819034ebb3d0",
"wh110a"=>"00008110-001C185C21C2801E",
"hanyi123"=>"58b38e40763b49b734e904d88df21ba0e2ecf9e3",
"Lw901103"=>"40338b76a64515750f0cc60a4bab862a738ff031",
"wang8530"=>"00008110-00140548210A801E",
"yu920509"=>"00008030-0006205E3AB9802E",
"yu920509"=>"00008030-0006205E3AB9802E",
"a7712425"=>"8c9aba6d10282fa71a6916328bfc272fcdf8750f",