"ye86482212"=>"00008020-000E1C142E08002E",
"dxf123123"=>"00008101-001A6DDA1E46001E",
"W020500"=>"00008030-000221D81144802E",
"a901030"=>"5da637326694444abbb32885eca5ba0b15a77292",
"yanghu88"=>"00008110-001130241AB8801E",
"cheng8910"=>"00008101-00156DD12229003A",
"147258aa"=>"adf0b8c8a5af8162e155694b99a4db76956cda4f",
"szx175"=>"00008030-001111293E82402E",
"ljx8888888"=>"732eb57c53f5961f44f11a2cb65eb73941384819",
"ff19870617"=>"00008020-001C49240E88002E",
"qq45354887"=>"a8ea22a528be82aaf48f6247982578785d1f6049",
"qwe1319"=>"00008101-000A6C343E39003A",
"asd875739"=>"970428f109f9183b4d705725f81816d4632f459e",
"Tang145"=>"00008110-0001042E1A12801E",
"jkcqw55"=>"1529e14cc9027aa39eb463c712e3158b797c4e2e",
"q269005602"=>"00008020-001D4D201430003A",
"benben1234"=>"00008020-00166C380C11002E",
"jx2021421"=>"00008030-000D25E60168802E",
"blackie721"=>"00008101-000A7C501E6A001E",
"liantain82"=>"00008101-00034D522190001E",
"castle0212"=>"00008020-000E205A3A79002E",
"zzf199217"=>"35dd72c8a204bcf22b6d4e13955f859a25d3705c",
"cjf2726"=>"00008030-000319060E89802E",
"Q351736"=>"00008101-0003548C3A85001E",
"zjl369258"=>"00008030-0019689E26A0802E",
"Qw123123"=>"00008101-0006793A0A08001E",
"qmx12345"=>"00008101-001A44600A12001E",
"Z130339"=>"00008020-00014589227B002E",