"yangrui722"=>"00008020-001924243492002E",
"L19971114"=>"00008030-000C44801A07802E",
"WXM110"=>"00008030-000D08CA1490802E",
"a80775490"=>"00008101-00013D542138001E",
"xhl890525"=>"00008101-000C35AC18782C3A",
"H2018888"=>"00008101-001971501E46001E",
"Jang5269"=>" 00008101-00190D663699001E",
"w123456f"=>"00008030-00011D3221B9402E",
"a751990871"=>"00008110-000978CE22A2801E",
"Fox123zb"=>"00008030-00090C3802F0802E",