"z540628997"=>"00008030-0014258622BB802E",
"lx1030"=>"a84ff7cb758632e4554820cdd9865bdc62126c79",
"ke4598234"=>"00008101-000E193A01D8001E",
"xjn124"=>"eda7881086eb178aa8d61a5f8b061f8f1cfc3b68",
"mc8888"=>"00008101-000161491492001E",
"yh1840283"=>"00008101-0015713901F8001E",
"aj123456"=>"00008101-001E383202B8001E",
"gdh6253jsg "=>"00008101-001255023E2B001E",
"z245000"=>"00008030-000A284A26BB802E",
"a731856076"=>"00008101-000A196234E8001E",
"liu9365"=>"00008020-000275110E63002E",
"ming3507"=>"00008030-001110313E09802E",
"w45678"=>"00008030-0016485C3681802E",
"Aa123321"=>"00008020–001650A92638002E",
"d144327953"=>"00008020-000C68E9369A002E",
"gzh9999"=>"00008020-000568301E32002E",
"yyds1122"=>"7c2fb12b4d295bfea22326d163d7d04ec9b5db1e",
"c1107677"=>"5ec1f01a9ad4060b79abba5510da6950a7a100e5",
"abc111"=>"00008020-001E1DDA3A69002E",
"yaoyue5"=>"8117ad11ec70e8166123d0a539d03a696651ddb4",
"y414044688"=>"00008101-001904EC3438001E",
"ll81257501"=>"00008101-001668460C80001E",
"niu624814"=>"4929177ef07fc471ae8bd01b2c621c3ac4c8cb8c",
"llbb111"=>"00008030-001458512638802E",
"a179450598"=>"00008110-0009058C34E1801E",
"wei2006"=>"00008030-000A15001EF3802E",
"12345qwe"=>"00008030-001C21D60A31802E",
"tswyd123"=>"00008030-0005389C347A802E",
"k19851220"=>"d37932359f96a88b71a8a2b3f32beabcab4886c1",
"1987125wjl"=>"00008101-001569DA1E02001E",
"H22222"=>"00008030-000928DE0C83802E",
"wxj050531"=>"0e206977a4afbd9c7fa0796bd6911ce9991b5d5f",
"343134298w"=>"00008101-000A09203C21001E",
"coolj87"=>"00008030-000C48CA3C90402E",
"q768948905"=>"00008030-000E4DA13EF1802E",
"s251875"=>"00008110-000615E61E22801E",
"xulei123"=>"00008030-000804813ED1802E",
"yusheng92"=>"00008101-001469D91169001E",
"xiao151916"=>"00008020-00067CC81ED0003A",
"HHN123456"=>"a0c49e03ffb947df4f4bbe65a9b5da75c3fb7edf",
"hjg5579"=>"1b635497fe3e3d4c3bef5042b99f0adec4ce4d87",
"gx123456"=>"a520a92a6bbfc8fb3eb91ca3c1703201ea93caa1",
"173063632l"=>"00008020-000A3CA63E91002E",
"lcj020216"=>"00008110-00080D2A0E2A801E",
"ljy2003520"=>"5fc2b36dcaef17df137ddae527c0f9899ba5d5e2",
"l150233"=>"00008030-001A4D681489802E",
"a150250"=>"00008020-00192CA60261002E",
"wu2290290"=>"00008030-001D24A234F9402E",
"Z1336796"=>"00008020-000105E43EDA002E",
"sss123"=>"cc51af3b5966b280d1323bad23f4a5ec5af113db",
"xw9486"=>"00008020-00051D0A229A002E",
"xwh123456"=>"00008020-00093C843484003A",
"qq12345"=>"00008020-000E2D110108002E",
"5081dxy"=>"00008030-000C25603CD2802E",
"lang1111"=>"00008030-000D39420AD1802E",
"g1179310"=>"00008101-001C74E114D0001E",
"ljc103302"=>"00008101-0009082E0204001E",