{
    "name": "SemanticCommonsClient",
    "author": "Ostrzyciel",
    "url": "https://gitlab.com/nonsensopedia/extensions/semanticcommonsclient",
    "license-name": "GPL-3.0-or-later",
    "version": "0.4.1",
    "namemsg": "semanticCommonsClient",
    "descriptionmsg": "semanticCommonsClient-desc",
    "manifest_version": 1,
    "load_composer_autoloader": true,
    "requires": {
        "MediaWiki": ">= 1.35.0",
        "extensions": {
            "Scribunto": "*"
        }
    },
    "MessagesDirs": {
        "SemanticCommonsClient": [ "i18n" ]
    },
    "ServiceWiringFiles": [
        "includes/Services/ServiceWiring.php"
    ],
    "config": {
        "SccCommonsApiUrl": "https://commons.wikimedia.org/w/api.php",
        "SccWikidataQueryServiceUrl": "https://query.wikidata.org/bigdata/namespace/wdq/sparql"
    },
    "AutoloadNamespaces": {
        "SemanticCommonsClient\\": "includes/"
    },
    "Hooks": {
        "ScribuntoExternalLibraries": "SemanticCommonsClient\\Scribunto\\Hooks::onScribuntoExternalLibraries"
    },
    "APIModules": {
        "purgecommonsmetadata": {
            "class": "SemanticCommonsClient\\Api\\PurgeMetadataModule",
            "services": [ "MainObjectStash", "PermissionManager" ]
        }
    },
    "AvailableRights": [
        "purge-commons-metadata"
    ],
    "GroupPermissions": {
        "rollback": { "purge-commons-metadata": true },
        "content-moderator": { "purge-commons-metadata": true },
        "sysop": { "purge-commons-metadata": true }
    },
    "type": "other"
}
