{
    "name": "NonsaLinks",
    "author": "Ostrzyciel",
    "license-name": "GPL-2.0+",
    "version": "0.3.0",
    "namemsg": "nonsaLinks",
    "descriptionmsg": "nonsaLinks-desc",
    "url": "https://gitlab.com/nonsensopedia/extensions/nonsalinks",
    "type": "semantic",
    "manifest_version": 1,
    "requires": {
        "MediaWiki": ">= 1.37.0",
        "extensions": {
            "SemanticMediaWiki": ">= 3.1.0"
        },
        "platform": {
            "php": ">= 7.4"
        }
    },
    "MessagesDirs": {
        "NonsaLinks": [ "i18n" ]
    },
    "config": {
        "NLSeeAlsoAliases": [ "Zobacz też" ],
        "NLSeeAlsoNamespaces": [ 0 ]
    },
    "AutoloadNamespaces": {
        "NonsaLinks\\Hooks\\": "includes/Hooks/",
        "NonsaLinks\\SMW\\": "includes/SMW/"
    },
    "ExtensionMessagesFiles": {
        "NonsaLinksMagic": "NonsaLinks.magic.php"
    },
    "Hooks": {
        "SMW::Store::BeforeDataUpdateComplete": "NonsaLinks\\Hooks\\BeforeDataUpdateComplete::run",
        "SMW::Property::initProperties": "NonsaLinks\\Hooks\\InitProperties::run",
        "GetDoubleUnderscoreIDs": "NonsaLinks\\Hooks\\GetDoubleUnderscoreIDs::run"
    }
}
