{
    "name": "NonsaCodeJanitor",
    "author": "Ostrzyciel",
    "url": "https://gitlab.com/nonsensopedia/extensions/nonsacodejanitor",
    "license-name": "GPL-2.0+",
    "version": "0.2.0",
    "namemsg": "nonsaCodeJanitor",
    "descriptionmsg": "nonsaCodeJanitor-desc",
    "manifest_version": 1,
    "requires": {
        "MediaWiki": ">= 1.35.0"
    },
    "MessagesDirs": {
        "NonsaCodeJanitor": [ "i18n" ]
    },
    "AutoloadNamespaces": {
        "NonsaCodeJanitor\\": "includes/",
        "NonsaCodeJanitor\\Transforms\\": "includes/Transforms/"
    },
    "Hooks": {
        "ParserPreSaveTransformComplete": "NonsaCodeJanitor\\Hooks::onParserPreSaveTransformComplete"
    },
    "type": "other"
}
