{
    "name": "MobileDetectNonsa",
    "author": [
        "Ostrzyciel"
    ],
    "url": "https://gitlab.com/nonsensopedia/mobiledetectnonsa/",
    "license-name": "GPL-3.0-only",
    "version": "3.0.0",
    "namemsg": "mobileDetectNonsa",
    "descriptionmsg": "mobileDetectNonsa-desc",
    "manifest_version": 1,
    "MessagesDirs": {
        "MobileDetectNonsa": [ "i18n" ]
    },
    "AutoloadClasses": {
        "MobileDetectNonsa": "includes/MobileDetectNonsa.php",
        "MobileDetectParser": "includes/MobileDetectParser.php",

        "MdNode": "includes/MdNode.php",
        "MdTagNode": "includes/MdNode.php",
        "MdTextNode": "includes/MdNode.php"
    },
    "Hooks": {
        "ParserFirstCallInit": "MobileDetectNonsa::onParserFirstCallInit",
        "ParserOutputPostCacheTransform": "MobileDetectNonsa::onParserOutputPostCacheTransform"
    },
    "CodeMirrorTagModes": {
        "nomobile": "text/mediawiki",
        "mobileonly": "text/mediawiki"
    },
    "type": "other"
}
