<?xml version="1.0" encoding="utf-8" standalone="no"?>
<!DOCTYPE svg PUBLIC "-//W3C//DTD SVG 1.1//EN"
  "http://www.w3.org/Graphics/SVG/1.1/DTD/svg11.dtd">
<!-- Created with matplotlib (https://matplotlib.org/) -->
<svg height="1080pt" version="1.1" viewBox="0 0 1440 1080" width="1440pt" xmlns="http://www.w3.org/2000/svg" xmlns:xlink="http://www.w3.org/1999/xlink">
 <metadata>
  <rdf:RDF xmlns:cc="http://creativecommons.org/ns#" xmlns:dc="http://purl.org/dc/elements/1.1/" xmlns:rdf="http://www.w3.org/1999/02/22-rdf-syntax-ns#">
   <cc:Work>
    <dc:type rdf:resource="http://purl.org/dc/dcmitype/StillImage"/>
    <dc:date>2021-07-29T12:50:16.729164</dc:date>
    <dc:format>image/svg+xml</dc:format>
    <dc:creator>
     <cc:Agent>
      <dc:title>Matplotlib v3.3.1, https://matplotlib.org/</dc:title>
     </cc:Agent>
    </dc:creator>
   </cc:Work>
  </rdf:RDF>
 </metadata>
 <defs>
  <style type="text/css">*{stroke-linecap:butt;stroke-linejoin:round;}</style>
 </defs>
 <g id="figure_1">
  <g id="patch_1">
   <path d="M 0 1080 
L 1440 1080 
L 1440 0 
L 0 0 
z
" style="fill:#ffffff;"/>
  </g>
  <g id="axes_1">
   <g id="patch_2">
    <path d="M 180 945 
L 1296 945 
L 1296 129.6 
L 180 129.6 
z
" style="fill:#ffffff;"/>
   </g>
   <g id="patch_3">
    <path clip-path="url(#pf56ee8f295)" d="M 230.727273 208885.686011 
L 343.454545 208885.686011 
L 343.454545 166.663636 
L 230.727273 166.663636 
z
" style="fill:#1f77b4;"/>
   </g>
   <g id="patch_4">
    <path clip-path="url(#pf56ee8f295)" d="M 343.454545 208885.686011 
L 456.181818 208885.686011 
L 456.181818 370.218059 
L 343.454545 370.218059 
z
" style="fill:#1f77b4;"/>
   </g>
   <g id="patch_5">
    <path clip-path="url(#pf56ee8f295)" d="M 456.181818 208885.686011 
L 568.909091 208885.686011 
L 568.909091 433.060512 
L 456.181818 433.060512 
z
" style="fill:#1f77b4;"/>
   </g>
   <g id="patch_6">
    <path clip-path="url(#pf56ee8f295)" d="M 568.909091 208885.686011 
L 681.636364 208885.686011 
L 681.636364 535.158774 
L 568.909091 535.158774 
z
" style="fill:#1f77b4;"/>
   </g>
   <g id="patch_7">
    <path clip-path="url(#pf56ee8f295)" d="M 681.636364 208885.686011 
L 794.363636 208885.686011 
L 794.363636 663.33555 
L 681.636364 663.33555 
z
" style="fill:#1f77b4;"/>
   </g>
   <g id="patch_8">
    <path clip-path="url(#pf56ee8f295)" d="M 794.363636 208885.686011 
L 907.090909 208885.686011 
L 907.090909 720.11374 
L 794.363636 720.11374 
z
" style="fill:#1f77b4;"/>
   </g>
   <g id="patch_9">
    <path clip-path="url(#pf56ee8f295)" d="M 907.090909 208885.686011 
L 1019.818182 208885.686011 
L 1019.818182 746.098218 
L 907.090909 746.098218 
z
" style="fill:#1f77b4;"/>
   </g>
   <g id="patch_10">
    <path clip-path="url(#pf56ee8f295)" d="M 1019.818182 208885.686011 
L 1132.545455 208885.686011 
L 1132.545455 907.936364 
L 1019.818182 907.936364 
z
" style="fill:#1f77b4;"/>
   </g>
   <g id="patch_11">
    <path clip-path="url(#pf56ee8f295)" d="M 1132.545455 208885.686011 
L 1245.272727 208885.686011 
L 1245.272727 907.936364 
L 1132.545455 907.936364 
z
" style="fill:#1f77b4;"/>
   </g>
   <g id="matplotlib.axis_1">
    <g id="xtick_1">
     <g id="line2d_1">
      <defs>
       <path d="M 0 0 
L 0 3.5 
" id="m7e985d8f00" style="stroke:#000000;stroke-width:0.8;"/>
      </defs>
      <g>
       <use style="stroke:#000000;stroke-width:0.8;" x="230.727273" xlink:href="#m7e985d8f00" y="945"/>
      </g>
     </g>
     <g id="text_1">
      <!-- $\mathdefault{10^{0}}$ -->
      <g transform="translate(217.847273 963.785)scale(0.16 -0.16)">
       <defs>
        <path d="M 12.5 6.796875 
L 27.84375 6.796875 
L 27.84375 55.65625 
Q 27.84375 57.75 28 60.09375 
L 15.25 49.15625 
Q 14.59375 48.59375 13.9375 48.46875 
Q 13.296875 48.34375 12.75 48.4375 
Q 12.203125 48.546875 11.71875 48.84375 
Q 11.25 49.15625 11 49.5 
L 8.203125 53.34375 
L 29.546875 71.796875 
L 36.796875 71.796875 
L 36.796875 6.796875 
L 50.90625 6.796875 
L 50.90625 0 
L 12.5 0 
z
" id="Lato-Regular-49"/>
        <path d="M 55 35.796875 
Q 55 26.40625 52.96875 19.53125 
Q 50.953125 12.65625 47.453125 8.15625 
Q 43.953125 3.65625 39.171875 1.453125 
Q 34.40625 -0.75 28.953125 -0.75 
Q 23.453125 -0.75 18.71875 1.453125 
Q 14 3.65625 10.5 8.15625 
Q 7 12.65625 5 19.53125 
Q 3 26.40625 3 35.796875 
Q 3 45.203125 5 52.09375 
Q 7 59 10.5 63.515625 
Q 14 68.046875 18.71875 70.25 
Q 23.453125 72.453125 28.953125 72.453125 
Q 34.40625 72.453125 39.171875 70.25 
Q 43.953125 68.046875 47.453125 63.515625 
Q 50.953125 59 52.96875 52.09375 
Q 55 45.203125 55 35.796875 
z
M 45.75 35.796875 
Q 45.75 44 44.375 49.578125 
Q 43 55.15625 40.671875 58.546875 
Q 38.34375 61.953125 35.296875 63.421875 
Q 32.25 64.90625 28.953125 64.90625 
Q 25.65625 64.90625 22.59375 63.421875 
Q 19.546875 61.953125 17.25 58.546875 
Q 14.953125 55.15625 13.578125 49.578125 
Q 12.203125 44 12.203125 35.796875 
Q 12.203125 27.59375 13.578125 22.046875 
Q 14.953125 16.5 17.25 13.09375 
Q 19.546875 9.703125 22.59375 8.21875 
Q 25.65625 6.75 28.953125 6.75 
Q 32.25 6.75 35.296875 8.21875 
Q 38.34375 9.703125 40.671875 13.09375 
Q 43 16.5 44.375 22.046875 
Q 45.75 27.59375 45.75 35.796875 
z
" id="Lato-Regular-48"/>
       </defs>
       <use transform="translate(0 0.823438)" xlink:href="#Lato-Regular-49"/>
       <use transform="translate(58 0.823438)" xlink:href="#Lato-Regular-48"/>
       <use transform="translate(116.886484 36.282813)scale(0.7)" xlink:href="#Lato-Regular-48"/>
      </g>
     </g>
    </g>
    <g id="xtick_2">
     <g id="line2d_2">
      <g>
       <use style="stroke:#000000;stroke-width:0.8;" x="556.221369" xlink:href="#m7e985d8f00" y="945"/>
      </g>
     </g>
     <g id="text_2">
      <!-- $\mathdefault{10^{1}}$ -->
      <g transform="translate(543.341369 963.785)scale(0.16 -0.16)">
       <use transform="translate(0 0.282813)" xlink:href="#Lato-Regular-49"/>
       <use transform="translate(58 0.282813)" xlink:href="#Lato-Regular-48"/>
       <use transform="translate(116.886484 35.742188)scale(0.7)" xlink:href="#Lato-Regular-49"/>
      </g>
     </g>
    </g>
    <g id="xtick_3">
     <g id="line2d_3">
      <g>
       <use style="stroke:#000000;stroke-width:0.8;" x="881.715466" xlink:href="#m7e985d8f00" y="945"/>
      </g>
     </g>
     <g id="text_3">
      <!-- $\mathdefault{10^{2}}$ -->
      <g transform="translate(868.835466 963.785)scale(0.16 -0.16)">
       <defs>
        <path d="M 29.546875 72.453125 
Q 34.09375 72.453125 38.046875 71.09375 
Q 42 69.75 44.890625 67.171875 
Q 47.796875 64.59375 49.4375 60.890625 
Q 51.09375 57.203125 51.09375 52.5 
Q 51.09375 48.5 49.890625 45.078125 
Q 48.703125 41.65625 46.640625 38.546875 
Q 44.59375 35.453125 41.921875 32.5 
Q 39.25 29.546875 36.25 26.546875 
L 17.34375 7.25 
Q 19.34375 7.796875 21.390625 8.125 
Q 23.453125 8.453125 25.34375 8.453125 
L 49.34375 8.453125 
Q 50.796875 8.453125 51.640625 7.59375 
Q 52.5 6.75 52.5 5.40625 
L 52.5 0 
L 4.703125 0 
L 4.703125 3.046875 
Q 4.703125 4 5.09375 5 
Q 5.5 6 6.34375 6.84375 
L 29.296875 29.90625 
Q 32.15625 32.796875 34.5 35.46875 
Q 36.84375 38.15625 38.5 40.84375 
Q 40.15625 43.546875 41.046875 46.3125 
Q 41.953125 49.09375 41.953125 52.25 
Q 41.953125 55.40625 40.953125 57.78125 
Q 39.953125 60.15625 38.21875 61.703125 
Q 36.5 63.25 34.140625 64.015625 
Q 31.796875 64.796875 29.09375 64.796875 
Q 26.34375 64.796875 24.046875 64 
Q 21.75 63.203125 19.96875 61.765625 
Q 18.203125 60.34375 17 58.390625 
Q 15.796875 56.453125 15.296875 54.09375 
Q 14.703125 52.34375 13.671875 51.765625 
Q 12.65625 51.203125 10.796875 51.453125 
L 6.15625 52.25 
Q 6.84375 57.15625 8.875 60.921875 
Q 10.90625 64.703125 13.96875 67.25 
Q 17.046875 69.796875 21 71.125 
Q 24.953125 72.453125 29.546875 72.453125 
z
" id="Lato-Regular-50"/>
       </defs>
       <use transform="translate(0 0.823438)" xlink:href="#Lato-Regular-49"/>
       <use transform="translate(58 0.823438)" xlink:href="#Lato-Regular-48"/>
       <use transform="translate(116.886484 36.282813)scale(0.7)" xlink:href="#Lato-Regular-50"/>
      </g>
     </g>
    </g>
    <g id="xtick_4">
     <g id="line2d_4">
      <g>
       <use style="stroke:#000000;stroke-width:0.8;" x="1207.209563" xlink:href="#m7e985d8f00" y="945"/>
      </g>
     </g>
     <g id="text_4">
      <!-- $\mathdefault{10^{3}}$ -->
      <g transform="translate(1194.329563 963.785)scale(0.16 -0.16)">
       <defs>
        <path d="M 29.90625 72.453125 
Q 34.453125 72.453125 38.296875 71.140625 
Q 42.15625 69.84375 44.921875 67.4375 
Q 47.703125 65.046875 49.25 61.640625 
Q 50.796875 58.25 50.796875 54.09375 
Q 50.796875 50.703125 49.921875 48.015625 
Q 49.046875 45.34375 47.421875 43.3125 
Q 45.796875 41.296875 43.5 39.890625 
Q 41.203125 38.5 38.34375 37.65625 
Q 45.34375 35.796875 48.875 31.4375 
Q 52.40625 27.09375 52.40625 20.546875 
Q 52.40625 15.59375 50.53125 11.640625 
Q 48.65625 7.703125 45.40625 4.921875 
Q 42.15625 2.15625 37.828125 0.671875 
Q 33.5 -0.796875 28.546875 -0.796875 
Q 22.84375 -0.796875 18.796875 0.625 
Q 14.75 2.046875 11.953125 4.546875 
Q 9.15625 7.046875 7.34375 10.46875 
Q 5.546875 13.90625 4.296875 17.90625 
L 8.15625 19.5 
Q 9.65625 20.15625 11.078125 19.84375 
Q 12.5 19.546875 13.15625 18.203125 
Q 13.796875 16.796875 14.765625 14.84375 
Q 15.75 12.90625 17.453125 11.09375 
Q 19.15625 9.296875 21.78125 8.046875 
Q 24.40625 6.796875 28.453125 6.796875 
Q 32.203125 6.796875 35.015625 8.015625 
Q 37.84375 9.25 39.71875 11.203125 
Q 41.59375 13.15625 42.546875 15.546875 
Q 43.5 17.953125 43.5 20.296875 
Q 43.5 23.203125 42.75 25.59375 
Q 42 28 39.953125 29.75 
Q 37.90625 31.5 34.328125 32.5 
Q 30.75 33.5 25.15625 33.5 
L 25.15625 39.953125 
Q 29.75 40 32.96875 40.953125 
Q 36.203125 41.90625 38.21875 43.546875 
Q 40.25 45.203125 41.171875 47.5 
Q 42.09375 49.796875 42.09375 52.59375 
Q 42.09375 55.703125 41.125 58 
Q 40.15625 60.296875 38.453125 61.796875 
Q 36.75 63.296875 34.421875 64.046875 
Q 32.09375 64.796875 29.40625 64.796875 
Q 26.703125 64.796875 24.375 64 
Q 22.046875 63.203125 20.265625 61.765625 
Q 18.5 60.34375 17.296875 58.390625 
Q 16.09375 56.453125 15.59375 54.09375 
Q 14.953125 52.34375 13.96875 51.765625 
Q 13 51.203125 11.15625 51.453125 
L 6.5 52.25 
Q 7.203125 57.15625 9.203125 60.921875 
Q 11.203125 64.703125 14.265625 67.25 
Q 17.34375 69.796875 21.3125 71.125 
Q 25.296875 72.453125 29.90625 72.453125 
z
" id="Lato-Regular-51"/>
       </defs>
       <use transform="translate(0 0.823438)" xlink:href="#Lato-Regular-49"/>
       <use transform="translate(58 0.823438)" xlink:href="#Lato-Regular-48"/>
       <use transform="translate(116.886484 36.282813)scale(0.7)" xlink:href="#Lato-Regular-51"/>
      </g>
     </g>
    </g>
    <g id="xtick_5">
     <g id="line2d_5">
      <defs>
       <path d="M 0 0 
L 0 2 
" id="m118bd274d3" style="stroke:#000000;stroke-width:0.6;"/>
      </defs>
      <g>
       <use style="stroke:#000000;stroke-width:0.6;" x="180.307599" xlink:href="#m118bd274d3" y="945"/>
      </g>
     </g>
    </g>
    <g id="xtick_6">
     <g id="line2d_6">
      <g>
       <use style="stroke:#000000;stroke-width:0.6;" x="199.183636" xlink:href="#m118bd274d3" y="945"/>
      </g>
     </g>
    </g>
    <g id="xtick_7">
     <g id="line2d_7">
      <g>
       <use style="stroke:#000000;stroke-width:0.6;" x="215.83348" xlink:href="#m118bd274d3" y="945"/>
      </g>
     </g>
    </g>
    <g id="xtick_8">
     <g id="line2d_8">
      <g>
       <use style="stroke:#000000;stroke-width:0.6;" x="328.710759" xlink:href="#m118bd274d3" y="945"/>
      </g>
     </g>
    </g>
    <g id="xtick_9">
     <g id="line2d_9">
      <g>
       <use style="stroke:#000000;stroke-width:0.6;" x="386.027425" xlink:href="#m118bd274d3" y="945"/>
      </g>
     </g>
    </g>
    <g id="xtick_10">
     <g id="line2d_10">
      <g>
       <use style="stroke:#000000;stroke-width:0.6;" x="426.694246" xlink:href="#m118bd274d3" y="945"/>
      </g>
     </g>
    </g>
    <g id="xtick_11">
     <g id="line2d_11">
      <g>
       <use style="stroke:#000000;stroke-width:0.6;" x="458.237883" xlink:href="#m118bd274d3" y="945"/>
      </g>
     </g>
    </g>
    <g id="xtick_12">
     <g id="line2d_12">
      <g>
       <use style="stroke:#000000;stroke-width:0.6;" x="484.010911" xlink:href="#m118bd274d3" y="945"/>
      </g>
     </g>
    </g>
    <g id="xtick_13">
     <g id="line2d_13">
      <g>
       <use style="stroke:#000000;stroke-width:0.6;" x="505.801696" xlink:href="#m118bd274d3" y="945"/>
      </g>
     </g>
    </g>
    <g id="xtick_14">
     <g id="line2d_14">
      <g>
       <use style="stroke:#000000;stroke-width:0.6;" x="524.677732" xlink:href="#m118bd274d3" y="945"/>
      </g>
     </g>
    </g>
    <g id="xtick_15">
     <g id="line2d_15">
      <g>
       <use style="stroke:#000000;stroke-width:0.6;" x="541.327576" xlink:href="#m118bd274d3" y="945"/>
      </g>
     </g>
    </g>
    <g id="xtick_16">
     <g id="line2d_16">
      <g>
       <use style="stroke:#000000;stroke-width:0.6;" x="654.204856" xlink:href="#m118bd274d3" y="945"/>
      </g>
     </g>
    </g>
    <g id="xtick_17">
     <g id="line2d_17">
      <g>
       <use style="stroke:#000000;stroke-width:0.6;" x="711.521521" xlink:href="#m118bd274d3" y="945"/>
      </g>
     </g>
    </g>
    <g id="xtick_18">
     <g id="line2d_18">
      <g>
       <use style="stroke:#000000;stroke-width:0.6;" x="752.188342" xlink:href="#m118bd274d3" y="945"/>
      </g>
     </g>
    </g>
    <g id="xtick_19">
     <g id="line2d_19">
      <g>
       <use style="stroke:#000000;stroke-width:0.6;" x="783.73198" xlink:href="#m118bd274d3" y="945"/>
      </g>
     </g>
    </g>
    <g id="xtick_20">
     <g id="line2d_20">
      <g>
       <use style="stroke:#000000;stroke-width:0.6;" x="809.505008" xlink:href="#m118bd274d3" y="945"/>
      </g>
     </g>
    </g>
    <g id="xtick_21">
     <g id="line2d_21">
      <g>
       <use style="stroke:#000000;stroke-width:0.6;" x="831.295792" xlink:href="#m118bd274d3" y="945"/>
      </g>
     </g>
    </g>
    <g id="xtick_22">
     <g id="line2d_22">
      <g>
       <use style="stroke:#000000;stroke-width:0.6;" x="850.171829" xlink:href="#m118bd274d3" y="945"/>
      </g>
     </g>
    </g>
    <g id="xtick_23">
     <g id="line2d_23">
      <g>
       <use style="stroke:#000000;stroke-width:0.6;" x="866.821673" xlink:href="#m118bd274d3" y="945"/>
      </g>
     </g>
    </g>
    <g id="xtick_24">
     <g id="line2d_24">
      <g>
       <use style="stroke:#000000;stroke-width:0.6;" x="979.698953" xlink:href="#m118bd274d3" y="945"/>
      </g>
     </g>
    </g>
    <g id="xtick_25">
     <g id="line2d_25">
      <g>
       <use style="stroke:#000000;stroke-width:0.6;" x="1037.015618" xlink:href="#m118bd274d3" y="945"/>
      </g>
     </g>
    </g>
    <g id="xtick_26">
     <g id="line2d_26">
      <g>
       <use style="stroke:#000000;stroke-width:0.6;" x="1077.682439" xlink:href="#m118bd274d3" y="945"/>
      </g>
     </g>
    </g>
    <g id="xtick_27">
     <g id="line2d_27">
      <g>
       <use style="stroke:#000000;stroke-width:0.6;" x="1109.226076" xlink:href="#m118bd274d3" y="945"/>
      </g>
     </g>
    </g>
    <g id="xtick_28">
     <g id="line2d_28">
      <g>
       <use style="stroke:#000000;stroke-width:0.6;" x="1134.999104" xlink:href="#m118bd274d3" y="945"/>
      </g>
     </g>
    </g>
    <g id="xtick_29">
     <g id="line2d_29">
      <g>
       <use style="stroke:#000000;stroke-width:0.6;" x="1156.789889" xlink:href="#m118bd274d3" y="945"/>
      </g>
     </g>
    </g>
    <g id="xtick_30">
     <g id="line2d_30">
      <g>
       <use style="stroke:#000000;stroke-width:0.6;" x="1175.665926" xlink:href="#m118bd274d3" y="945"/>
      </g>
     </g>
    </g>
    <g id="xtick_31">
     <g id="line2d_31">
      <g>
       <use style="stroke:#000000;stroke-width:0.6;" x="1192.31577" xlink:href="#m118bd274d3" y="945"/>
      </g>
     </g>
    </g>
    <g id="text_5">
     <!-- Krawędzie prowadzące do strony -->
     <g transform="translate(621.90875 982.315)scale(0.16 -0.16)">
      <defs>
       <path d="M 18.796875 40.25 
L 22.453125 40.25 
Q 24.34375 40.25 25.5 40.71875 
Q 26.65625 41.203125 27.59375 42.34375 
L 51.453125 69.34375 
Q 52.453125 70.65625 53.546875 71.15625 
Q 54.65625 71.65625 56.25 71.65625 
L 64.453125 71.65625 
L 37.15625 40.796875 
Q 36.15625 39.59375 35.21875 38.8125 
Q 34.296875 38.046875 33.25 37.546875 
Q 34.59375 37.09375 35.6875 36.21875 
Q 36.796875 35.34375 37.84375 33.953125 
L 66.34375 0 
L 57.953125 0 
Q 57 0 56.328125 0.125 
Q 55.65625 0.25 55.15625 0.515625 
Q 54.65625 0.796875 54.28125 1.171875 
Q 53.90625 1.546875 53.546875 2.046875 
L 28.84375 30.5 
Q 27.84375 31.75 26.6875 32.265625 
Q 25.546875 32.796875 23.203125 32.796875 
L 18.796875 32.796875 
L 18.796875 0 
L 9.15625 0 
L 9.15625 71.65625 
L 18.796875 71.65625 
z
" id="Lato-Regular-75"/>
       <path d="M 7.046875 0 
L 7.046875 50.65625 
L 12.15625 50.65625 
Q 13.59375 50.65625 14.140625 50.09375 
Q 14.703125 49.546875 14.90625 48.203125 
L 15.453125 40.5 
Q 17.84375 45.703125 21.375 48.625 
Q 24.90625 51.546875 29.953125 51.546875 
Q 31.546875 51.546875 33.015625 51.1875 
Q 34.5 50.84375 35.65625 50.09375 
L 35 43.453125 
Q 34.703125 42.203125 33.5 42.203125 
Q 32.796875 42.203125 31.4375 42.5 
Q 30.09375 42.796875 28.40625 42.796875 
Q 26 42.796875 24.09375 42.0625 
Q 22.203125 41.34375 20.71875 39.96875 
Q 19.25 38.59375 18.09375 36.59375 
Q 16.953125 34.59375 16 32 
L 16 0 
z
" id="Lato-Regular-114"/>
       <path d="M 39.25 0 
Q 37.953125 0 37.25 0.421875 
Q 36.546875 0.84375 36.15625 2.09375 
L 35.15625 6.84375 
Q 33.15625 5.046875 31.21875 3.625 
Q 29.296875 2.203125 27.21875 1.21875 
Q 25.15625 0.25 22.78125 -0.265625 
Q 20.40625 -0.796875 17.5 -0.796875 
Q 14.546875 -0.796875 11.9375 0.015625 
Q 9.34375 0.84375 7.421875 2.5 
Q 5.5 4.15625 4.375 6.671875 
Q 3.25 9.203125 3.25 12.65625 
Q 3.25 15.65625 4.890625 18.421875 
Q 6.546875 21.203125 10.25 23.34375 
Q 13.953125 25.5 19.890625 26.875 
Q 25.84375 28.25 34.5 28.453125 
L 34.5 32.40625 
Q 34.5 38.296875 31.953125 41.3125 
Q 29.40625 44.34375 24.5 44.34375 
Q 21.203125 44.34375 18.96875 43.515625 
Q 16.75 42.703125 15.125 41.671875 
Q 13.5 40.65625 12.328125 39.828125 
Q 11.15625 39 10 39 
Q 9.09375 39 8.4375 39.46875 
Q 7.796875 39.953125 7.34375 40.65625 
L 5.75 43.5 
Q 9.953125 47.546875 14.796875 49.546875 
Q 19.65625 51.546875 25.546875 51.546875 
Q 29.796875 51.546875 33.09375 50.140625 
Q 36.40625 48.75 38.65625 46.25 
Q 40.90625 43.75 42.046875 40.203125 
Q 43.203125 36.65625 43.203125 32.40625 
L 43.203125 0 
z
M 20.15625 5.453125 
Q 22.5 5.453125 24.453125 5.921875 
Q 26.40625 6.40625 28.125 7.28125 
Q 29.84375 8.15625 31.421875 9.421875 
Q 33 10.703125 34.5 12.296875 
L 34.5 22.796875 
Q 28.34375 22.59375 24.015625 21.8125 
Q 19.703125 21.046875 16.96875 19.796875 
Q 14.25 18.546875 13.015625 16.84375 
Q 11.796875 15.15625 11.796875 13.046875 
Q 11.796875 11.046875 12.4375 9.59375 
Q 13.09375 8.15625 14.21875 7.21875 
Q 15.34375 6.296875 16.875 5.875 
Q 18.40625 5.453125 20.15625 5.453125 
z
" id="Lato-Regular-97"/>
       <path d="M 1.65625 50.65625 
L 8.65625 50.65625 
Q 9.703125 50.65625 10.421875 50.09375 
Q 11.15625 49.546875 11.40625 48.796875 
L 21.09375 16.203125 
Q 21.5 14.453125 21.84375 12.765625 
Q 22.203125 11.09375 22.453125 9.453125 
Q 22.84375 11.09375 23.34375 12.765625 
Q 23.84375 14.453125 24.40625 16.203125 
L 35.09375 49 
Q 35.34375 49.75 35.96875 50.25 
Q 36.59375 50.75 37.5 50.75 
L 41.40625 50.75 
Q 42.40625 50.75 43.046875 50.25 
Q 43.703125 49.75 43.953125 49 
L 54.40625 16.203125 
Q 54.90625 14.453125 55.34375 12.75 
Q 55.796875 11.046875 56.203125 9.40625 
Q 56.5 11.046875 56.875 12.71875 
Q 57.25 14.40625 57.703125 16.203125 
L 67.59375 48.796875 
Q 67.84375 49.59375 68.546875 50.125 
Q 69.25 50.65625 70.203125 50.65625 
L 76.90625 50.65625 
L 60.5 0 
L 53.453125 0 
Q 52.15625 0 51.65625 1.703125 
L 40.453125 36.046875 
Q 40.046875 37.203125 39.796875 38.375 
Q 39.546875 39.546875 39.296875 40.703125 
Q 39.046875 39.546875 38.765625 38.34375 
Q 38.5 37.15625 38.15625 36 
L 26.75 1.703125 
Q 26.296875 0 24.75 0 
L 18.046875 0 
z
" id="Lato-Regular-119"/>
       <path d="M 37.5 -10.546875 
Q 37.84375 -10.546875 38.0625 -10.75 
Q 38.296875 -10.953125 38.40625 -11.203125 
L 39.796875 -14.5 
Q 38.296875 -15.65625 35.96875 -16.375 
Q 33.65625 -17.09375 31.09375 -17.09375 
Q 26.703125 -17.09375 24.171875 -15.125 
Q 21.65625 -13.15625 21.65625 -9.84375 
Q 21.65625 -7.203125 23.296875 -4.84375 
Q 24.953125 -2.5 27.546875 -0.65625 
Q 22.453125 -0.546875 18.140625 1.265625 
Q 13.84375 3.09375 10.75 6.515625 
Q 7.65625 9.953125 5.90625 14.921875 
Q 4.15625 19.90625 4.15625 26.34375 
Q 4.15625 31.65625 5.78125 36.25 
Q 7.40625 40.84375 10.453125 44.21875 
Q 13.5 47.59375 17.890625 49.515625 
Q 22.296875 51.453125 27.796875 51.453125 
Q 32.34375 51.453125 36.21875 49.921875 
Q 40.09375 48.40625 42.921875 45.53125 
Q 45.75 42.65625 47.34375 38.421875 
Q 48.953125 34.203125 48.953125 28.796875 
Q 48.953125 26.703125 48.5 26 
Q 48.046875 25.296875 46.796875 25.296875 
L 12.953125 25.296875 
Q 13.046875 20.5 14.25 16.953125 
Q 15.453125 13.40625 17.546875 11.03125 
Q 19.65625 8.65625 22.546875 7.46875 
Q 25.453125 6.296875 29.046875 6.296875 
Q 32.40625 6.296875 34.828125 7.0625 
Q 37.25 7.84375 39 8.75 
Q 40.75 9.65625 41.921875 10.421875 
Q 43.09375 11.203125 43.953125 11.203125 
Q 45.046875 11.203125 45.65625 10.34375 
L 48.15625 7.09375 
Q 45.59375 4.09375 41.84375 2.296875 
Q 38.09375 0.5 33.90625 -0.203125 
Q 32.90625 -0.75 31.921875 -1.515625 
Q 30.953125 -2.296875 30.171875 -3.25 
Q 29.40625 -4.203125 28.90625 -5.328125 
Q 28.40625 -6.453125 28.40625 -7.703125 
Q 28.40625 -9.59375 29.625 -10.671875 
Q 30.84375 -11.75 32.953125 -11.75 
Q 34.09375 -11.75 34.84375 -11.578125 
Q 35.59375 -11.40625 36.09375 -11.171875 
Q 36.59375 -10.953125 36.921875 -10.75 
Q 37.25 -10.546875 37.5 -10.546875 
z
M 28 44.90625 
Q 21.546875 44.90625 17.84375 41.171875 
Q 14.15625 37.453125 13.25 30.84375 
L 40.953125 30.84375 
Q 40.953125 33.953125 40.078125 36.515625 
Q 39.203125 39.09375 37.515625 40.96875 
Q 35.84375 42.84375 33.4375 43.875 
Q 31.046875 44.90625 28 44.90625 
z
" id="Lato-Regular-281"/>
       <path d="M 43.65625 0 
Q 41.75 0 41.25 1.84375 
L 40.453125 8 
Q 37.203125 4.046875 33.015625 1.671875 
Q 28.84375 -0.703125 23.453125 -0.703125 
Q 19.09375 -0.703125 15.546875 0.96875 
Q 12 2.65625 9.5 5.90625 
Q 7 9.15625 5.640625 14 
Q 4.296875 18.84375 4.296875 25.15625 
Q 4.296875 30.75 5.796875 35.578125 
Q 7.296875 40.40625 10.09375 43.953125 
Q 12.90625 47.5 16.96875 49.515625 
Q 21.046875 51.546875 26.15625 51.546875 
Q 30.796875 51.546875 34.125 49.96875 
Q 37.453125 48.40625 40.046875 45.546875 
L 40.046875 73.65625 
L 48.953125 73.65625 
L 48.953125 0 
z
M 26.34375 6.5 
Q 30.75 6.5 34.015625 8.5 
Q 37.296875 10.5 40.046875 14.15625 
L 40.046875 38.59375 
Q 37.546875 41.90625 34.640625 43.25 
Q 31.75 44.59375 28.15625 44.59375 
Q 21.09375 44.59375 17.296875 39.546875 
Q 13.5 34.5 13.5 25.15625 
Q 13.5 20.203125 14.34375 16.671875 
Q 15.203125 13.15625 16.84375 10.875 
Q 18.5 8.59375 20.890625 7.546875 
Q 23.296875 6.5 26.34375 6.5 
z
" id="Lato-Regular-100"/>
       <path d="M 42 46.84375 
Q 42 45.90625 41.671875 45 
Q 41.34375 44.09375 40.796875 43.453125 
L 13.34375 6.953125 
L 41.046875 6.953125 
L 41.046875 0 
L 2.90625 0 
L 2.90625 3.703125 
Q 2.90625 4.34375 3.203125 5.21875 
Q 3.5 6.09375 4.09375 6.90625 
L 31.703125 43.65625 
L 4.453125 43.65625 
L 4.453125 50.65625 
L 42 50.65625 
z
" id="Lato-Regular-122"/>
       <path d="M 16.453125 50.65625 
L 16.453125 0 
L 7.546875 0 
L 7.546875 50.65625 
z
M 18.34375 66.546875 
Q 18.34375 65.25 17.8125 64.125 
Q 17.296875 63 16.421875 62.125 
Q 15.546875 61.25 14.375 60.75 
Q 13.203125 60.25 11.90625 60.25 
Q 10.59375 60.25 9.46875 60.75 
Q 8.34375 61.25 7.5 62.125 
Q 6.65625 63 6.15625 64.125 
Q 5.65625 65.25 5.65625 66.546875 
Q 5.65625 67.84375 6.15625 69.015625 
Q 6.65625 70.203125 7.5 71.078125 
Q 8.34375 71.953125 9.46875 72.453125 
Q 10.59375 72.953125 11.90625 72.953125 
Q 13.203125 72.953125 14.375 72.453125 
Q 15.546875 71.953125 16.421875 71.078125 
Q 17.296875 70.203125 17.8125 69.015625 
Q 18.34375 67.84375 18.34375 66.546875 
z
" id="Lato-Regular-105"/>
       <path d="M 27.796875 51.453125 
Q 32.34375 51.453125 36.21875 49.921875 
Q 40.09375 48.40625 42.921875 45.53125 
Q 45.75 42.65625 47.34375 38.421875 
Q 48.953125 34.203125 48.953125 28.796875 
Q 48.953125 26.703125 48.5 26 
Q 48.046875 25.296875 46.796875 25.296875 
L 12.953125 25.296875 
Q 13.046875 20.5 14.25 16.953125 
Q 15.453125 13.40625 17.546875 11.03125 
Q 19.65625 8.65625 22.546875 7.46875 
Q 25.453125 6.296875 29.046875 6.296875 
Q 32.40625 6.296875 34.828125 7.0625 
Q 37.25 7.84375 39 8.75 
Q 40.75 9.65625 41.921875 10.421875 
Q 43.09375 11.203125 43.953125 11.203125 
Q 45.046875 11.203125 45.65625 10.34375 
L 48.15625 7.09375 
Q 46.5 5.09375 44.203125 3.625 
Q 41.90625 2.15625 39.28125 1.203125 
Q 36.65625 0.25 33.84375 -0.21875 
Q 31.046875 -0.703125 28.296875 -0.703125 
Q 23.046875 -0.703125 18.625 1.0625 
Q 14.203125 2.84375 10.96875 6.265625 
Q 7.75 9.703125 5.953125 14.75 
Q 4.15625 19.796875 4.15625 26.34375 
Q 4.15625 31.65625 5.78125 36.25 
Q 7.40625 40.84375 10.453125 44.21875 
Q 13.5 47.59375 17.890625 49.515625 
Q 22.296875 51.453125 27.796875 51.453125 
z
M 28 44.90625 
Q 21.546875 44.90625 17.84375 41.171875 
Q 14.15625 37.453125 13.25 30.84375 
L 40.953125 30.84375 
Q 40.953125 33.953125 40.078125 36.515625 
Q 39.203125 39.09375 37.515625 40.96875 
Q 35.84375 42.84375 33.4375 43.875 
Q 31.046875 44.90625 28 44.90625 
z
" id="Lato-Regular-101"/>
       <path id="Lato-Regular-32"/>
       <path d="M 7.046875 -17.15625 
L 7.046875 50.65625 
L 12.40625 50.65625 
Q 14.296875 50.65625 14.75 48.796875 
L 15.5 42.796875 
Q 18.75 46.75 22.953125 49.140625 
Q 27.15625 51.546875 32.546875 51.546875 
Q 36.953125 51.546875 40.5 49.875 
Q 44.046875 48.203125 46.546875 44.921875 
Q 49.046875 41.65625 50.390625 36.796875 
Q 51.75 31.953125 51.75 25.65625 
Q 51.75 20.046875 50.25 15.21875 
Q 48.75 10.40625 45.921875 6.875 
Q 43.09375 3.34375 39.015625 1.3125 
Q 34.953125 -0.703125 29.84375 -0.703125 
Q 25.203125 -0.703125 21.875 0.84375 
Q 18.546875 2.40625 16 5.25 
L 16 -17.15625 
z
M 29.65625 44.34375 
Q 25.296875 44.34375 22.015625 42.34375 
Q 18.75 40.34375 16 36.703125 
L 16 12.203125 
Q 18.40625 8.90625 21.328125 7.546875 
Q 24.25 6.203125 27.84375 6.203125 
Q 34.953125 6.203125 38.75 11.25 
Q 42.546875 16.296875 42.546875 25.65625 
Q 42.546875 30.59375 41.671875 34.140625 
Q 40.796875 37.703125 39.140625 39.96875 
Q 37.5 42.25 35.09375 43.296875 
Q 32.703125 44.34375 29.65625 44.34375 
z
" id="Lato-Regular-112"/>
       <path d="M 28.40625 51.453125 
Q 33.953125 51.453125 38.390625 49.59375 
Q 42.84375 47.75 46 44.34375 
Q 49.15625 40.953125 50.828125 36.125 
Q 52.5 31.296875 52.5 25.34375 
Q 52.5 19.34375 50.828125 14.546875 
Q 49.15625 9.75 46 6.34375 
Q 42.84375 2.953125 38.390625 1.125 
Q 33.953125 -0.703125 28.40625 -0.703125 
Q 22.796875 -0.703125 18.3125 1.125 
Q 13.84375 2.953125 10.6875 6.34375 
Q 7.546875 9.75 5.875 14.546875 
Q 4.203125 19.34375 4.203125 25.34375 
Q 4.203125 31.296875 5.875 36.125 
Q 7.546875 40.953125 10.6875 44.34375 
Q 13.84375 47.75 18.3125 49.59375 
Q 22.796875 51.453125 28.40625 51.453125 
z
M 28.40625 6.25 
Q 35.90625 6.25 39.59375 11.265625 
Q 43.296875 16.296875 43.296875 25.296875 
Q 43.296875 34.34375 39.59375 39.390625 
Q 35.90625 44.453125 28.40625 44.453125 
Q 24.59375 44.453125 21.765625 43.140625 
Q 18.953125 41.84375 17.078125 39.390625 
Q 15.203125 36.953125 14.265625 33.375 
Q 13.34375 29.796875 13.34375 25.296875 
Q 13.34375 16.296875 17.0625 11.265625 
Q 20.796875 6.25 28.40625 6.25 
z
" id="Lato-Regular-111"/>
       <path d="M 46.40625 -10.546875 
Q 46.75 -10.546875 46.96875 -10.75 
Q 47.203125 -10.953125 47.296875 -11.203125 
L 48.703125 -14.5 
Q 47.203125 -15.65625 44.875 -16.375 
Q 42.546875 -17.09375 40 -17.09375 
Q 35.59375 -17.09375 33.0625 -15.125 
Q 30.546875 -13.15625 30.546875 -9.84375 
Q 30.546875 -8.40625 31.09375 -7 
Q 31.65625 -5.59375 32.625 -4.3125 
Q 33.59375 -3.046875 34.921875 -1.921875 
Q 36.25 -0.796875 37.796875 0.15625 
Q 36.546875 0.5 36.15625 2.09375 
L 35.15625 6.84375 
Q 33.15625 5.046875 31.21875 3.625 
Q 29.296875 2.203125 27.21875 1.21875 
Q 25.15625 0.25 22.78125 -0.265625 
Q 20.40625 -0.796875 17.5 -0.796875 
Q 14.546875 -0.796875 11.9375 0.015625 
Q 9.34375 0.84375 7.421875 2.5 
Q 5.5 4.15625 4.375 6.671875 
Q 3.25 9.203125 3.25 12.65625 
Q 3.25 15.65625 4.890625 18.421875 
Q 6.546875 21.203125 10.25 23.34375 
Q 13.953125 25.5 19.890625 26.875 
Q 25.84375 28.25 34.5 28.453125 
L 34.5 32.40625 
Q 34.5 38.296875 31.953125 41.3125 
Q 29.40625 44.34375 24.5 44.34375 
Q 21.203125 44.34375 18.96875 43.515625 
Q 16.75 42.703125 15.125 41.671875 
Q 13.5 40.65625 12.328125 39.828125 
Q 11.15625 39 10 39 
Q 9.09375 39 8.4375 39.46875 
Q 7.796875 39.953125 7.34375 40.65625 
L 5.75 43.5 
Q 9.953125 47.546875 14.796875 49.546875 
Q 19.65625 51.546875 25.546875 51.546875 
Q 29.796875 51.546875 33.09375 50.140625 
Q 36.40625 48.75 38.65625 46.25 
Q 40.90625 43.75 42.046875 40.203125 
Q 43.203125 36.65625 43.203125 32.40625 
L 43.203125 0 
Q 42.203125 -0.546875 41.140625 -1.3125 
Q 40.09375 -2.09375 39.25 -3.0625 
Q 38.40625 -4.046875 37.84375 -5.21875 
Q 37.296875 -6.40625 37.296875 -7.703125 
Q 37.296875 -9.59375 38.515625 -10.671875 
Q 39.75 -11.75 41.84375 -11.75 
Q 43 -11.75 43.75 -11.578125 
Q 44.5 -11.40625 45 -11.171875 
Q 45.5 -10.953125 45.828125 -10.75 
Q 46.15625 -10.546875 46.40625 -10.546875 
z
M 20.15625 5.453125 
Q 22.5 5.453125 24.453125 5.921875 
Q 26.40625 6.40625 28.125 7.28125 
Q 29.84375 8.15625 31.421875 9.421875 
Q 33 10.703125 34.5 12.296875 
L 34.5 22.796875 
Q 28.34375 22.59375 24.015625 21.8125 
Q 19.703125 21.046875 16.96875 19.796875 
Q 14.25 18.546875 13.015625 16.84375 
Q 11.796875 15.15625 11.796875 13.046875 
Q 11.796875 11.046875 12.4375 9.59375 
Q 13.09375 8.15625 14.21875 7.21875 
Q 15.34375 6.296875 16.875 5.875 
Q 18.40625 5.453125 20.15625 5.453125 
z
" id="Lato-Regular-261"/>
       <path d="M 42.296875 41.65625 
Q 41.90625 41.09375 41.5 40.796875 
Q 41.09375 40.5 40.40625 40.5 
Q 39.65625 40.5 38.75 41.125 
Q 37.84375 41.75 36.515625 42.5 
Q 35.203125 43.25 33.265625 43.875 
Q 31.34375 44.5 28.546875 44.5 
Q 24.796875 44.5 21.9375 43.171875 
Q 19.09375 41.84375 17.171875 39.34375 
Q 15.25 36.84375 14.265625 33.296875 
Q 13.296875 29.75 13.296875 25.34375 
Q 13.296875 20.75 14.34375 17.171875 
Q 15.40625 13.59375 17.328125 11.171875 
Q 19.25 8.75 21.96875 7.46875 
Q 24.703125 6.203125 28.09375 6.203125 
Q 31.34375 6.203125 33.4375 6.96875 
Q 35.546875 7.75 36.921875 8.703125 
Q 38.296875 9.65625 39.21875 10.421875 
Q 40.15625 11.203125 41.046875 11.203125 
Q 42.15625 11.203125 42.75 10.34375 
L 45.25 7.09375 
Q 43.59375 5.046875 41.5 3.59375 
Q 39.40625 2.15625 36.96875 1.171875 
Q 34.546875 0.203125 31.890625 -0.25 
Q 29.25 -0.703125 26.5 -0.703125 
Q 21.75 -0.703125 17.671875 1.046875 
Q 13.59375 2.796875 10.59375 6.125 
Q 7.59375 9.453125 5.890625 14.296875 
Q 4.203125 19.15625 4.203125 25.34375 
Q 4.203125 31 5.765625 35.796875 
Q 7.34375 40.59375 10.375 44.0625 
Q 13.40625 47.546875 17.828125 49.5 
Q 22.25 51.453125 28 51.453125 
Q 33.34375 51.453125 37.421875 49.71875 
Q 41.5 48 44.65625 44.84375 
z
" id="Lato-Regular-99"/>
       <path d="M 36.546875 42.296875 
Q 35.953125 41.203125 34.703125 41.203125 
Q 33.953125 41.203125 33 41.75 
Q 32.046875 42.296875 30.671875 42.96875 
Q 29.296875 43.65625 27.390625 44.21875 
Q 25.5 44.796875 22.90625 44.796875 
Q 20.65625 44.796875 18.84375 44.21875 
Q 17.046875 43.65625 15.765625 42.65625 
Q 14.5 41.65625 13.828125 40.328125 
Q 13.15625 39 13.15625 37.453125 
Q 13.15625 35.5 14.28125 34.203125 
Q 15.40625 32.90625 17.25 31.953125 
Q 19.09375 31 21.4375 30.265625 
Q 23.796875 29.546875 26.265625 28.71875 
Q 28.75 27.90625 31.09375 26.90625 
Q 33.453125 25.90625 35.296875 24.40625 
Q 37.15625 22.90625 38.28125 20.71875 
Q 39.40625 18.546875 39.40625 15.5 
Q 39.40625 12 38.15625 9.015625 
Q 36.90625 6.046875 34.453125 3.875 
Q 32 1.703125 28.453125 0.453125 
Q 24.90625 -0.796875 20.25 -0.796875 
Q 14.953125 -0.796875 10.640625 0.921875 
Q 6.34375 2.65625 3.34375 5.34375 
L 5.453125 8.75 
Q 5.84375 9.40625 6.390625 9.75 
Q 6.953125 10.09375 7.796875 10.09375 
Q 8.703125 10.09375 9.703125 9.390625 
Q 10.703125 8.703125 12.125 7.84375 
Q 13.546875 7 15.59375 6.296875 
Q 17.65625 5.59375 20.703125 5.59375 
Q 23.296875 5.59375 25.25 6.265625 
Q 27.203125 6.953125 28.5 8.09375 
Q 29.796875 9.25 30.421875 10.75 
Q 31.046875 12.25 31.046875 13.953125 
Q 31.046875 16.046875 29.921875 17.421875 
Q 28.796875 18.796875 26.9375 19.765625 
Q 25.09375 20.75 22.71875 21.46875 
Q 20.34375 22.203125 17.875 23 
Q 15.40625 23.796875 13.03125 24.8125 
Q 10.65625 25.84375 8.796875 27.390625 
Q 6.953125 28.953125 5.828125 31.21875 
Q 4.703125 33.5 4.703125 36.75 
Q 4.703125 39.65625 5.890625 42.328125 
Q 7.09375 45 9.390625 47.015625 
Q 11.703125 49.046875 15.046875 50.25 
Q 18.40625 51.453125 22.703125 51.453125 
Q 27.703125 51.453125 31.671875 49.875 
Q 35.65625 48.296875 38.546875 45.546875 
z
" id="Lato-Regular-115"/>
       <path d="M 22.59375 -0.796875 
Q 16.59375 -0.796875 13.375 2.546875 
Q 10.15625 5.90625 10.15625 12.203125 
L 10.15625 43.203125 
L 4.046875 43.203125 
Q 3.25 43.203125 2.703125 43.671875 
Q 2.15625 44.15625 2.15625 45.15625 
L 2.15625 48.703125 
L 10.453125 49.75 
L 12.5 65.40625 
Q 12.65625 66.15625 13.171875 66.625 
Q 13.703125 67.09375 14.546875 67.09375 
L 19.046875 67.09375 
L 19.046875 49.65625 
L 33.703125 49.65625 
L 33.703125 43.203125 
L 19.046875 43.203125 
L 19.046875 12.796875 
Q 19.046875 9.59375 20.59375 8.046875 
Q 22.15625 6.5 24.59375 6.5 
Q 26 6.5 27.015625 6.875 
Q 28.046875 7.25 28.796875 7.703125 
Q 29.546875 8.15625 30.0625 8.53125 
Q 30.59375 8.90625 31 8.90625 
Q 31.703125 8.90625 32.25 8.046875 
L 34.84375 3.796875 
Q 32.546875 1.65625 29.296875 0.421875 
Q 26.046875 -0.796875 22.59375 -0.796875 
z
" id="Lato-Regular-116"/>
       <path d="M 7.046875 0 
L 7.046875 50.65625 
L 12.40625 50.65625 
Q 14.296875 50.65625 14.75 48.796875 
L 15.453125 43.296875 
Q 18.75 46.953125 22.84375 49.203125 
Q 26.953125 51.453125 32.296875 51.453125 
Q 36.453125 51.453125 39.625 50.078125 
Q 42.796875 48.703125 44.921875 46.171875 
Q 47.046875 43.65625 48.140625 40.09375 
Q 49.25 36.546875 49.25 32.25 
L 49.25 0 
L 40.296875 0 
L 40.296875 32.25 
Q 40.296875 38 37.671875 41.171875 
Q 35.046875 44.34375 29.703125 44.34375 
Q 25.703125 44.34375 22.265625 42.4375 
Q 18.84375 40.546875 16 37.296875 
L 16 0 
z
" id="Lato-Regular-110"/>
       <path d="M 22.5 -14.953125 
Q 22.046875 -15.953125 21.375 -16.546875 
Q 20.703125 -17.15625 19.296875 -17.15625 
L 12.703125 -17.15625 
L 21.953125 2.953125 
L 1.046875 50.65625 
L 8.75 50.65625 
Q 9.90625 50.65625 10.578125 50.078125 
Q 11.25 49.5 11.5 48.796875 
L 25.046875 16.90625 
Q 25.453125 15.75 25.796875 14.671875 
Q 26.15625 13.59375 26.40625 12.453125 
Q 27.046875 14.703125 27.90625 16.953125 
L 41.046875 48.796875 
Q 41.34375 49.59375 42.0625 50.125 
Q 42.796875 50.65625 43.703125 50.65625 
L 50.75 50.65625 
z
" id="Lato-Regular-121"/>
      </defs>
      <use xlink:href="#Lato-Regular-75"/>
      <use x="66.250015" xlink:href="#Lato-Regular-114"/>
      <use x="101.900024" xlink:href="#Lato-Regular-97"/>
      <use x="151.350037" xlink:href="#Lato-Regular-119"/>
      <use x="229.900055" xlink:href="#Lato-Regular-281"/>
      <use x="282.700058" xlink:href="#Lato-Regular-100"/>
      <use x="338.700058" xlink:href="#Lato-Regular-122"/>
      <use x="383.900055" xlink:href="#Lato-Regular-105"/>
      <use x="407.900055" xlink:href="#Lato-Regular-101"/>
      <use x="460.700058" xlink:href="#Lato-Regular-32"/>
      <use x="486.300064" xlink:href="#Lato-Regular-112"/>
      <use x="542.350067" xlink:href="#Lato-Regular-114"/>
      <use x="576.750076" xlink:href="#Lato-Regular-111"/>
      <use x="632.700089" xlink:href="#Lato-Regular-119"/>
      <use x="710.625107" xlink:href="#Lato-Regular-97"/>
      <use x="760.325119" xlink:href="#Lato-Regular-100"/>
      <use x="816.325119" xlink:href="#Lato-Regular-122"/>
      <use x="861.525116" xlink:href="#Lato-Regular-261"/>
      <use x="911.225128" xlink:href="#Lato-Regular-99"/>
      <use x="958.100128" xlink:href="#Lato-Regular-101"/>
      <use x="1010.900131" xlink:href="#Lato-Regular-32"/>
      <use x="1036.500137" xlink:href="#Lato-Regular-100"/>
      <use x="1092.500137" xlink:href="#Lato-Regular-111"/>
      <use x="1149.20015" xlink:href="#Lato-Regular-32"/>
      <use x="1174.800156" xlink:href="#Lato-Regular-115"/>
      <use x="1218.100159" xlink:href="#Lato-Regular-116"/>
      <use x="1253.950165" xlink:href="#Lato-Regular-114"/>
      <use x="1288.350174" xlink:href="#Lato-Regular-111"/>
      <use x="1345.050186" xlink:href="#Lato-Regular-110"/>
      <use x="1399.600189" xlink:href="#Lato-Regular-121"/>
     </g>
    </g>
   </g>
   <g id="matplotlib.axis_2">
    <g id="ytick_1">
     <g id="line2d_32">
      <defs>
       <path d="M 0 0 
L -3.5 0 
" id="mced0f471c6" style="stroke:#000000;stroke-width:0.8;"/>
      </defs>
      <g>
       <use style="stroke:#000000;stroke-width:0.8;" x="180" xlink:href="#mced0f471c6" y="907.936364"/>
      </g>
     </g>
     <g id="text_6">
      <!-- $\mathdefault{10^{0}}$ -->
      <g transform="translate(147.24 913.828864)scale(0.16 -0.16)">
       <use transform="translate(0 0.823438)" xlink:href="#Lato-Regular-49"/>
       <use transform="translate(58 0.823438)" xlink:href="#Lato-Regular-48"/>
       <use transform="translate(116.886484 36.282813)scale(0.7)" xlink:href="#Lato-Regular-48"/>
      </g>
     </g>
    </g>
    <g id="ytick_2">
     <g id="line2d_33">
      <g>
       <use style="stroke:#000000;stroke-width:0.8;" x="180" xlink:href="#mced0f471c6" y="699.958614"/>
      </g>
     </g>
     <g id="text_7">
      <!-- $\mathdefault{10^{1}}$ -->
      <g transform="translate(147.24 705.851114)scale(0.16 -0.16)">
       <use transform="translate(0 0.282813)" xlink:href="#Lato-Regular-49"/>
       <use transform="translate(58 0.282813)" xlink:href="#Lato-Regular-48"/>
       <use transform="translate(116.886484 35.742188)scale(0.7)" xlink:href="#Lato-Regular-49"/>
      </g>
     </g>
    </g>
    <g id="ytick_3">
     <g id="line2d_34">
      <g>
       <use style="stroke:#000000;stroke-width:0.8;" x="180" xlink:href="#mced0f471c6" y="491.980864"/>
      </g>
     </g>
     <g id="text_8">
      <!-- $\mathdefault{10^{2}}$ -->
      <g transform="translate(147.24 497.873364)scale(0.16 -0.16)">
       <use transform="translate(0 0.823438)" xlink:href="#Lato-Regular-49"/>
       <use transform="translate(58 0.823438)" xlink:href="#Lato-Regular-48"/>
       <use transform="translate(116.886484 36.282813)scale(0.7)" xlink:href="#Lato-Regular-50"/>
      </g>
     </g>
    </g>
    <g id="ytick_4">
     <g id="line2d_35">
      <g>
       <use style="stroke:#000000;stroke-width:0.8;" x="180" xlink:href="#mced0f471c6" y="284.003115"/>
      </g>
     </g>
     <g id="text_9">
      <!-- $\mathdefault{10^{3}}$ -->
      <g transform="translate(147.24 289.895615)scale(0.16 -0.16)">
       <use transform="translate(0 0.823438)" xlink:href="#Lato-Regular-49"/>
       <use transform="translate(58 0.823438)" xlink:href="#Lato-Regular-48"/>
       <use transform="translate(116.886484 36.282813)scale(0.7)" xlink:href="#Lato-Regular-51"/>
      </g>
     </g>
    </g>
    <g id="ytick_5">
     <g id="line2d_36">
      <defs>
       <path d="M 0 0 
L -2 0 
" id="m2aaf3ba119" style="stroke:#000000;stroke-width:0.6;"/>
      </defs>
      <g>
       <use style="stroke:#000000;stroke-width:0.6;" x="180" xlink:href="#m2aaf3ba119" y="940.152525"/>
      </g>
     </g>
    </g>
    <g id="ytick_6">
     <g id="line2d_37">
      <g>
       <use style="stroke:#000000;stroke-width:0.6;" x="180" xlink:href="#m2aaf3ba119" y="928.09149"/>
      </g>
     </g>
    </g>
    <g id="ytick_7">
     <g id="line2d_38">
      <g>
       <use style="stroke:#000000;stroke-width:0.6;" x="180" xlink:href="#m2aaf3ba119" y="917.452904"/>
      </g>
     </g>
    </g>
    <g id="ytick_8">
     <g id="line2d_39">
      <g>
       <use style="stroke:#000000;stroke-width:0.6;" x="180" xlink:href="#m2aaf3ba119" y="845.328823"/>
      </g>
     </g>
    </g>
    <g id="ytick_9">
     <g id="line2d_40">
      <g>
       <use style="stroke:#000000;stroke-width:0.6;" x="180" xlink:href="#m2aaf3ba119" y="808.705759"/>
      </g>
     </g>
    </g>
    <g id="ytick_10">
     <g id="line2d_41">
      <g>
       <use style="stroke:#000000;stroke-width:0.6;" x="180" xlink:href="#m2aaf3ba119" y="782.721281"/>
      </g>
     </g>
    </g>
    <g id="ytick_11">
     <g id="line2d_42">
      <g>
       <use style="stroke:#000000;stroke-width:0.6;" x="180" xlink:href="#m2aaf3ba119" y="762.566155"/>
      </g>
     </g>
    </g>
    <g id="ytick_12">
     <g id="line2d_43">
      <g>
       <use style="stroke:#000000;stroke-width:0.6;" x="180" xlink:href="#m2aaf3ba119" y="746.098218"/>
      </g>
     </g>
    </g>
    <g id="ytick_13">
     <g id="line2d_44">
      <g>
       <use style="stroke:#000000;stroke-width:0.6;" x="180" xlink:href="#m2aaf3ba119" y="732.174775"/>
      </g>
     </g>
    </g>
    <g id="ytick_14">
     <g id="line2d_45">
      <g>
       <use style="stroke:#000000;stroke-width:0.6;" x="180" xlink:href="#m2aaf3ba119" y="720.11374"/>
      </g>
     </g>
    </g>
    <g id="ytick_15">
     <g id="line2d_46">
      <g>
       <use style="stroke:#000000;stroke-width:0.6;" x="180" xlink:href="#m2aaf3ba119" y="709.475154"/>
      </g>
     </g>
    </g>
    <g id="ytick_16">
     <g id="line2d_47">
      <g>
       <use style="stroke:#000000;stroke-width:0.6;" x="180" xlink:href="#m2aaf3ba119" y="637.351073"/>
      </g>
     </g>
    </g>
    <g id="ytick_17">
     <g id="line2d_48">
      <g>
       <use style="stroke:#000000;stroke-width:0.6;" x="180" xlink:href="#m2aaf3ba119" y="600.728009"/>
      </g>
     </g>
    </g>
    <g id="ytick_18">
     <g id="line2d_49">
      <g>
       <use style="stroke:#000000;stroke-width:0.6;" x="180" xlink:href="#m2aaf3ba119" y="574.743532"/>
      </g>
     </g>
    </g>
    <g id="ytick_19">
     <g id="line2d_50">
      <g>
       <use style="stroke:#000000;stroke-width:0.6;" x="180" xlink:href="#m2aaf3ba119" y="554.588405"/>
      </g>
     </g>
    </g>
    <g id="ytick_20">
     <g id="line2d_51">
      <g>
       <use style="stroke:#000000;stroke-width:0.6;" x="180" xlink:href="#m2aaf3ba119" y="538.120468"/>
      </g>
     </g>
    </g>
    <g id="ytick_21">
     <g id="line2d_52">
      <g>
       <use style="stroke:#000000;stroke-width:0.6;" x="180" xlink:href="#m2aaf3ba119" y="524.197025"/>
      </g>
     </g>
    </g>
    <g id="ytick_22">
     <g id="line2d_53">
      <g>
       <use style="stroke:#000000;stroke-width:0.6;" x="180" xlink:href="#m2aaf3ba119" y="512.135991"/>
      </g>
     </g>
    </g>
    <g id="ytick_23">
     <g id="line2d_54">
      <g>
       <use style="stroke:#000000;stroke-width:0.6;" x="180" xlink:href="#m2aaf3ba119" y="501.497404"/>
      </g>
     </g>
    </g>
    <g id="ytick_24">
     <g id="line2d_55">
      <g>
       <use style="stroke:#000000;stroke-width:0.6;" x="180" xlink:href="#m2aaf3ba119" y="429.373323"/>
      </g>
     </g>
    </g>
    <g id="ytick_25">
     <g id="line2d_56">
      <g>
       <use style="stroke:#000000;stroke-width:0.6;" x="180" xlink:href="#m2aaf3ba119" y="392.750259"/>
      </g>
     </g>
    </g>
    <g id="ytick_26">
     <g id="line2d_57">
      <g>
       <use style="stroke:#000000;stroke-width:0.6;" x="180" xlink:href="#m2aaf3ba119" y="366.765782"/>
      </g>
     </g>
    </g>
    <g id="ytick_27">
     <g id="line2d_58">
      <g>
       <use style="stroke:#000000;stroke-width:0.6;" x="180" xlink:href="#m2aaf3ba119" y="346.610656"/>
      </g>
     </g>
    </g>
    <g id="ytick_28">
     <g id="line2d_59">
      <g>
       <use style="stroke:#000000;stroke-width:0.6;" x="180" xlink:href="#m2aaf3ba119" y="330.142718"/>
      </g>
     </g>
    </g>
    <g id="ytick_29">
     <g id="line2d_60">
      <g>
       <use style="stroke:#000000;stroke-width:0.6;" x="180" xlink:href="#m2aaf3ba119" y="316.219276"/>
      </g>
     </g>
    </g>
    <g id="ytick_30">
     <g id="line2d_61">
      <g>
       <use style="stroke:#000000;stroke-width:0.6;" x="180" xlink:href="#m2aaf3ba119" y="304.158241"/>
      </g>
     </g>
    </g>
    <g id="ytick_31">
     <g id="line2d_62">
      <g>
       <use style="stroke:#000000;stroke-width:0.6;" x="180" xlink:href="#m2aaf3ba119" y="293.519655"/>
      </g>
     </g>
    </g>
    <g id="ytick_32">
     <g id="line2d_63">
      <g>
       <use style="stroke:#000000;stroke-width:0.6;" x="180" xlink:href="#m2aaf3ba119" y="221.395574"/>
      </g>
     </g>
    </g>
    <g id="ytick_33">
     <g id="line2d_64">
      <g>
       <use style="stroke:#000000;stroke-width:0.6;" x="180" xlink:href="#m2aaf3ba119" y="184.77251"/>
      </g>
     </g>
    </g>
    <g id="ytick_34">
     <g id="line2d_65">
      <g>
       <use style="stroke:#000000;stroke-width:0.6;" x="180" xlink:href="#m2aaf3ba119" y="158.788033"/>
      </g>
     </g>
    </g>
    <g id="ytick_35">
     <g id="line2d_66">
      <g>
       <use style="stroke:#000000;stroke-width:0.6;" x="180" xlink:href="#m2aaf3ba119" y="138.632906"/>
      </g>
     </g>
    </g>
    <g id="text_10">
     <!-- Ilość stron -->
     <g transform="translate(140.495 573.31875)rotate(-90)scale(0.16 -0.16)">
      <defs>
       <path d="M 18.84375 0 
L 9.15625 0 
L 9.15625 71.65625 
L 18.84375 71.65625 
z
" id="Lato-Regular-73"/>
       <path d="M 16.25 73.65625 
L 16.25 0 
L 7.34375 0 
L 7.34375 73.65625 
z
" id="Lato-Regular-108"/>
       <path d="M 3.34375 0 
z
M 36.546875 42.296875 
Q 35.953125 41.203125 34.703125 41.203125 
Q 33.953125 41.203125 33 41.75 
Q 32.046875 42.296875 30.671875 42.96875 
Q 29.296875 43.65625 27.390625 44.21875 
Q 25.5 44.796875 22.90625 44.796875 
Q 20.65625 44.796875 18.84375 44.21875 
Q 17.046875 43.65625 15.765625 42.65625 
Q 14.5 41.65625 13.828125 40.328125 
Q 13.15625 39 13.15625 37.453125 
Q 13.15625 35.5 14.28125 34.203125 
Q 15.40625 32.90625 17.25 31.953125 
Q 19.09375 31 21.4375 30.265625 
Q 23.796875 29.546875 26.265625 28.71875 
Q 28.75 27.90625 31.09375 26.90625 
Q 33.453125 25.90625 35.296875 24.40625 
Q 37.15625 22.90625 38.28125 20.71875 
Q 39.40625 18.546875 39.40625 15.5 
Q 39.40625 12 38.15625 9.015625 
Q 36.90625 6.046875 34.453125 3.875 
Q 32 1.703125 28.453125 0.453125 
Q 24.90625 -0.796875 20.25 -0.796875 
Q 14.953125 -0.796875 10.640625 0.921875 
Q 6.34375 2.65625 3.34375 5.34375 
L 5.453125 8.75 
Q 5.84375 9.40625 6.390625 9.75 
Q 6.953125 10.09375 7.796875 10.09375 
Q 8.703125 10.09375 9.703125 9.390625 
Q 10.703125 8.703125 12.125 7.84375 
Q 13.546875 7 15.59375 6.296875 
Q 17.65625 5.59375 20.703125 5.59375 
Q 23.296875 5.59375 25.25 6.265625 
Q 27.203125 6.953125 28.5 8.09375 
Q 29.796875 9.25 30.421875 10.75 
Q 31.046875 12.25 31.046875 13.953125 
Q 31.046875 16.046875 29.921875 17.421875 
Q 28.796875 18.796875 26.9375 19.765625 
Q 25.09375 20.75 22.71875 21.46875 
Q 20.34375 22.203125 17.875 23 
Q 15.40625 23.796875 13.03125 24.8125 
Q 10.65625 25.84375 8.796875 27.390625 
Q 6.953125 28.953125 5.828125 31.21875 
Q 4.703125 33.5 4.703125 36.75 
Q 4.703125 39.65625 5.890625 42.328125 
Q 7.09375 45 9.390625 47.015625 
Q 11.703125 49.046875 15.046875 50.25 
Q 18.40625 51.453125 22.703125 51.453125 
Q 27.703125 51.453125 31.671875 49.875 
Q 35.65625 48.296875 38.546875 45.546875 
z
M 36.953125 72.453125 
L 25.296875 59.546875 
Q 24.59375 58.796875 23.921875 58.46875 
Q 23.25 58.15625 22.203125 58.15625 
L 16.90625 58.15625 
L 24.296875 70.25 
Q 25 71.40625 25.828125 71.921875 
Q 26.65625 72.453125 28.25 72.453125 
z
" id="Lato-Regular-347"/>
       <path d="M 4.203125 0 
z
M 42.296875 41.65625 
Q 41.90625 41.09375 41.5 40.796875 
Q 41.09375 40.5 40.40625 40.5 
Q 39.65625 40.5 38.75 41.125 
Q 37.84375 41.75 36.515625 42.5 
Q 35.203125 43.25 33.265625 43.875 
Q 31.34375 44.5 28.546875 44.5 
Q 24.796875 44.5 21.9375 43.171875 
Q 19.09375 41.84375 17.171875 39.34375 
Q 15.25 36.84375 14.265625 33.296875 
Q 13.296875 29.75 13.296875 25.34375 
Q 13.296875 20.75 14.34375 17.171875 
Q 15.40625 13.59375 17.328125 11.171875 
Q 19.25 8.75 21.96875 7.46875 
Q 24.703125 6.203125 28.09375 6.203125 
Q 31.34375 6.203125 33.4375 6.96875 
Q 35.546875 7.75 36.921875 8.703125 
Q 38.296875 9.65625 39.21875 10.421875 
Q 40.15625 11.203125 41.046875 11.203125 
Q 42.15625 11.203125 42.75 10.34375 
L 45.25 7.09375 
Q 43.59375 5.046875 41.5 3.59375 
Q 39.40625 2.15625 36.96875 1.171875 
Q 34.546875 0.203125 31.890625 -0.25 
Q 29.25 -0.703125 26.5 -0.703125 
Q 21.75 -0.703125 17.671875 1.046875 
Q 13.59375 2.796875 10.59375 6.125 
Q 7.59375 9.453125 5.890625 14.296875 
Q 4.203125 19.15625 4.203125 25.34375 
Q 4.203125 31 5.765625 35.796875 
Q 7.34375 40.59375 10.375 44.0625 
Q 13.40625 47.546875 17.828125 49.5 
Q 22.25 51.453125 28 51.453125 
Q 33.34375 51.453125 37.421875 49.71875 
Q 41.5 48 44.65625 44.84375 
z
M 42.359375 72.453125 
L 30.703125 59.546875 
Q 30 58.796875 29.328125 58.46875 
Q 28.65625 58.15625 27.609375 58.15625 
L 22.296875 58.15625 
L 29.703125 70.25 
Q 30.40625 71.40625 31.21875 71.921875 
Q 32.046875 72.453125 33.65625 72.453125 
z
" id="Lato-Regular-263"/>
      </defs>
      <use xlink:href="#Lato-Regular-73"/>
      <use x="27.25" xlink:href="#Lato-Regular-108"/>
      <use x="50.850006" xlink:href="#Lato-Regular-111"/>
      <use x="107.550018" xlink:href="#Lato-Regular-347"/>
      <use x="150.850021" xlink:href="#Lato-Regular-263"/>
      <use x="198.600021" xlink:href="#Lato-Regular-32"/>
      <use x="224.200027" xlink:href="#Lato-Regular-115"/>
      <use x="267.500031" xlink:href="#Lato-Regular-116"/>
      <use x="303.350037" xlink:href="#Lato-Regular-114"/>
      <use x="337.750046" xlink:href="#Lato-Regular-111"/>
      <use x="394.450058" xlink:href="#Lato-Regular-110"/>
     </g>
    </g>
   </g>
   <g id="patch_12">
    <path d="M 180 945 
L 180 129.6 
" style="fill:none;stroke:#000000;stroke-linecap:square;stroke-linejoin:miter;stroke-width:0.8;"/>
   </g>
   <g id="patch_13">
    <path d="M 1296 945 
L 1296 129.6 
" style="fill:none;stroke:#000000;stroke-linecap:square;stroke-linejoin:miter;stroke-width:0.8;"/>
   </g>
   <g id="patch_14">
    <path d="M 180 945 
L 1296 945 
" style="fill:none;stroke:#000000;stroke-linecap:square;stroke-linejoin:miter;stroke-width:0.8;"/>
   </g>
   <g id="patch_15">
    <path d="M 180 129.6 
L 1296 129.6 
" style="fill:none;stroke:#000000;stroke-linecap:square;stroke-linejoin:miter;stroke-width:0.8;"/>
   </g>
  </g>
 </g>
 <defs>
  <clipPath id="pf56ee8f295">
   <rect height="815.4" width="1116" x="180" y="129.6"/>
  </clipPath>
 </defs>
</svg>
