{
	"validUsername": "JohnBoBo",
	"email": "JohnBoBo@gmail.com",
	"validPassword": "someValidPassword",
	"first_name": "John",
	"last_name": "Goe",
	"address1": "exampleAddress1Check 123 Main St",
	"address2": "exampleAddress2 456 Main St",
	"state": "Middle Thailand",
	"city": "Bangkok",
	"zipcode": "10600",
	"mobile_number": "0811111111",
	"invalidEmail": "BohnJoJo@gmail.com",
	"invalidPassword": "XXXsomeInValidPasswordXXX"
}
