{
    "Taylor Swift": {
        "twitter": "taylorswift13",
        "facebook": "TaylorSwift",
        "youtube": [
            "9s1kO6ND9BE",
            "XnbCSboujF4",
            "ZVpkFb9-fts",
            "hLaXcgd5w3s",
            "IQoYZPVoLF8",
            "iyYhqYELWtA"
        ]
    },
    "Nicki Minaj": {
        "twitter": "nickiminaj",
        "facebook": "nickiminaj",
        "youtube": [
            "0qTROr7cgCY",
            "F3618Xm0ZAQ",
            "olWhr_bstNU",
            "qmj5uVbM-RA",
            "VaDM8XArafc",
            "ZkjNghZcvf8",
            "zW_1DjPmIkk",
            "x8d3zRoc-N8",
            "ldqaxKYHYcs",
            "rz1ZhPg23Rs",
            "nUG1dOaBVp4"
        ]
    },
    "Billie Eilish": {
        "twitter": "billieeilish",
        "facebook": "billieeilish",
        "youtube": [
            "hS2x1zl4rn0",
            "I0L1MYciVuw",
            "NHmXtsoxvVE",
            "cw5gCoIbUbg"
        ]
    },
    "Ariana Grande": {
        "twitter": "ArianaGrande",
        "facebook": "arianagrande",
        "youtube": [
            "94tM31Y2Mm8",
            "BE9GDcQEIlk",
            "dfBLEqnQnP0",
            "ao3ucb7Gh3g",
            "ga8cfWN8Q6g",
            "n2wIqXBz4os",
            "fnBLd65NZok",
            "6G8-LNVRaTM",
            "HNirl0yNxiE"
        ]
    },
    "Donald Trump": {
        "twitter": "DonaldTrump",
        "facebook": "donaldtrump",
        "youtube": [
            "pHtNOoN5rhk",
            "RhL9iFkBaus"
        ]
    },
    "Elon Musk": {
        "twitter": "elonmusk",
        "facebook": "TheElonmusk",
        "youtube": [
            "fCF8I_X1qKI",
            "MxZpaJK74Y4",
            "464puoD09dM",
            "lA77zsJ31nA"
        ]
    },
    "Joe Rogan": {
        "twitter": "joerogan",
        "facebook": "JOEROGAN",
        "youtube": [
            "G8XXolic4Yk",
            "u4taz6dfPQc",
            "ZY4bKcczPLw",
            "Sdu_1_A0dcM",
            "ysTGb27yCcc"
        ]
    },
    "Kanye West": {
        "twitter": "kanyewest",
        "youtube": [
            "mueeKk6GweI",
            "S2-bjGkcaJI",
            "Thf-EELF0PE",
            "c0Re2hRqMPA",
            "C7dwOcuOg9Y",
            "Goood8R6Zjo",
            "ZjG-riNVRG4",
            "YJ_zkYOca18&"
        ]
    }
}
