{
  "manifest_version": 3,
  "action": {
    "default_icon": {
      "48": "icons/twitch-48x48.png"
    },
    "default_title": "Twitch Tools",
    "default_popup": "popup/menu.html"
  },
  "name": "Twitch Tools",
  "description": "Move twitch chat to the left side",
  "permissions": [
    "storage"
  ],
  "content_scripts": [
    {
      "matches": [
        "https://www.twitch.tv/*"
      ],
      "js": [
        "lib/backgroundRunner.js",
        "lib/pluginHandler.js"
      ]
    }
  ],
  "icons": {
    "48": "icons/twitch-48x48.png",
    "128": "icons/twitch-128x128.png"
  },
  "web_accessible_resources": [
    {
      "resources": [
        "plugins/*",
        "lib/*",
        "popup/*"
      ],
      "use_dynamic_url": true,
      "matches": [
        "https://www.twitch.tv/*"
      ]
    }
  ]
}