<svg width="64" height="64" viewBox="0 0 64 64" fill="none" xmlns="http://www.w3.org/2000/svg">
<mask id="path-1-inside-1" fill="white">
<path fill-rule="evenodd" clip-rule="evenodd" d="M19.1968 10.1806C21.8328 5.87382 26.5808 3 32 3C37.4192 3 42.1672 5.87382 44.8032 10.1806C46.3756 9.42396 48.1383 9 50 9C56.6274 9 62 14.3726 62 21C62 26.946 57.6754 31.8819 52 32.8341V56C52 58.2091 50.2091 60 48 60H16C13.7909 60 12 58.2091 12 56V32.8341C6.32457 31.8819 2 26.946 2 21C2 14.3726 7.37258 9 14 9C15.8617 9 17.6244 9.42396 19.1968 10.1806Z"/>
</mask>
<path fill-rule="evenodd" clip-rule="evenodd" d="M19.1968 10.1806C21.8328 5.87382 26.5808 3 32 3C37.4192 3 42.1672 5.87382 44.8032 10.1806C46.3756 9.42396 48.1383 9 50 9C56.6274 9 62 14.3726 62 21C62 26.946 57.6754 31.8819 52 32.8341V56C52 58.2091 50.2091 60 48 60H16C13.7909 60 12 58.2091 12 56V32.8341C6.32457 31.8819 2 26.946 2 21C2 14.3726 7.37258 9 14 9C15.8617 9 17.6244 9.42396 19.1968 10.1806Z" fill="white"/>
<path d="M19.1968 10.1806L18.3296 11.9828L19.9588 12.7668L20.9027 11.2247L19.1968 10.1806ZM44.8032 10.1806L43.0973 11.2247L44.0412 12.7668L45.6704 11.9828L44.8032 10.1806ZM52 32.8341L51.6691 30.8616L50 31.1417V32.8341H52ZM12 32.8341H14V31.1417L12.3309 30.8616L12 32.8341ZM20.9027 11.2247C23.1904 7.4869 27.3056 5 32 5V1C25.8559 1 20.4752 4.26073 17.491 9.13654L20.9027 11.2247ZM32 5C36.6944 5 40.8097 7.4869 43.0973 11.2247L46.509 9.13654C43.5248 4.26073 38.1441 1 32 1V5ZM45.6704 11.9828C46.9781 11.3536 48.4449 11 50 11V7C47.8316 7 45.7731 7.49437 43.936 8.3784L45.6704 11.9828ZM50 11C55.5229 11 60 15.4772 60 21H64C64 13.268 57.732 7 50 7V11ZM60 21C60 25.953 56.3971 30.0684 51.6691 30.8616L52.3309 34.8065C58.9538 33.6954 64 27.939 64 21H60ZM50 32.8341V56H54V32.8341H50ZM50 56C50 57.1046 49.1046 58 48 58V62C51.3137 62 54 59.3137 54 56H50ZM48 58H16V62H48V58ZM16 58C14.8954 58 14 57.1046 14 56H10C10 59.3137 12.6863 62 16 62V58ZM14 56V32.8341H10V56H14ZM12.3309 30.8616C7.60291 30.0684 4 25.953 4 21H0C0 27.939 5.04624 33.6954 11.6691 34.8065L12.3309 30.8616ZM4 21C4 15.4772 8.47715 11 14 11V7C6.26801 7 0 13.268 0 21H4ZM14 11C15.5551 11 17.0219 11.3536 18.3296 11.9828L20.064 8.3784C18.2269 7.49437 16.1684 7 14 7V11Z" fill="#F74F18" mask="url(#path-1-inside-1)"/>
<rect x="12" y="47" width="40" height="2" fill="#F74F18"/>
<path d="M31 49L31 34C31 33.4477 31.4477 33 32 33C32.5523 33 33 33.4477 33 34L33 49L31 49Z" fill="#F74F18"/>
<path d="M40 49L40 34C40 33.4477 40.4477 33 41 33C41.5523 33 42 33.4477 42 34L42 49L40 49Z" fill="#F74F18"/>
<path d="M22 49L22 34C22 33.4477 22.4477 33 23 33C23.5523 33 24 33.4477 24 34L24 49L22 49Z" fill="#F74F18"/>
</svg>
