Shell/mempool: log advertiser errors

111 jobs for raphael@minor-mempool-improvements in 19 minutes (queued for 2 seconds)
latest
Status Job ID Name Coverage
  Build
passed #251040149
gitlab-org
build

00:06:41

passed #251040148
gitlab-org
check_indentation

00:01:26

passed #251040146
gitlab-org
check_opam_deps

00:02:28

passed #251040147
gitlab-org
check_opam_lint

00:01:28

 
  Test
failed #251042590
gitlab-org
documentation:build

00:03:06

failed #251042378
gitlab-org allowed to fail
documentation:linkcheck

00:03:08

failed #251041864
gitlab-org
integration:baker_endorser

00:02:29

failed #251041814
gitlab-org
integration:basic

00:01:04

failed #251041441
gitlab-org
integration:basic.sh

00:02:27

failed #251042231
gitlab-org
integration:contract

00:02:33

failed #251042175
gitlab-org
integration:contract_baker

00:02:30

failed #251041957
gitlab-org
integration:contracts.sh

00:01:08

failed #251041764
gitlab-org
integration:contracts_macros.sh

00:00:42

failed #251042116
gitlab-org
integration:contracts_mini_scenarios.sh

00:00:41

failed #251042011
gitlab-org
integration:contracts_opcode.sh

00:02:31

failed #251041794
gitlab-org
integration:cors

00:00:42

failed #251041445
gitlab-org
integration:double_endorsement

00:00:49

failed #251041432
gitlab-org
integration:inject.sh

00:00:45

failed #251041878
gitlab-org
integration:injection

00:01:10

failed #251041925
gitlab-org
integration:many_bakers

00:01:09

failed #251041927
gitlab-org
integration:many_nodes

00:01:09

failed #251041806
gitlab-org
integration:mempool

00:00:39

failed #251042212
gitlab-org
integration:multinode

00:00:55

failed #251041767
gitlab-org
integration:multinode.sh

00:01:01

passed #251040175
gitlab-org
integration:proto:sandbox

00:02:32

failed #251041996
gitlab-org
integration:proto_demo_noops

00:02:31

failed #251041821
gitlab-org
integration:rpc

00:01:04

failed #251041923
gitlab-org
integration:sandboxes:acc-baking

00:02:43

failed #251041942
gitlab-org
integration:sandboxes:acc-endorsement

00:02:50

failed #251041954
gitlab-org allowed to fail
integration:sandboxes:voting

00:03:02

failed #251041924
gitlab-org
integration:snapshot

00:00:51

failed #251041833
gitlab-org
integration:tls

00:01:01

failed #251041807
gitlab-org
integration:voting

00:00:42

failed #251041772
gitlab-org
integration:voting.sh

00:00:47

failed #251041956
gitlab-org
unit:client_alpha:vote

00:01:03

passed #251040154
gitlab-org
unit:crypto

00:02:15

passed #251040152
gitlab-org
unit:data_encoding

00:02:28

passed #251040166
gitlab-org
unit:micheline

00:02:24

passed #251040163
gitlab-org
unit:p2p:banned_peers

00:02:22

passed #251040156
gitlab-org
unit:p2p:io-scheduler

00:02:31

passed #251040162
gitlab-org
unit:p2p:ipv6set

00:00:58

passed #251040161
gitlab-org
unit:p2p:peerset

00:02:23

passed #251040158
gitlab-org
unit:p2p:pool

00:02:27

passed #251040157
gitlab-org
unit:p2p:socket

00:02:16

passed #251040160
gitlab-org
unit:proto_alpha:lib_client

00:02:22

passed #251040159
gitlab-org
unit:proto_alpha:lib_protocol

00:05:31

passed #251040155
gitlab-org
unit:shell

00:02:38

passed #251040150
gitlab-org
unit:stdlib

00:02:26

passed #251040151
gitlab-org
unit:stdlib_unix

00:02:18

passed #251040153
gitlab-org
unit:storage

00:02:22

passed #251040165
gitlab-org
unit:validation

00:02:18

failed #251040195
gitlab-org
documentation:build

00:03:02

failed #251041915
gitlab-org
documentation:build

00:03:14

failed #251041697
gitlab-org allowed to fail
documentation:linkcheck

00:03:12

failed #251040196
gitlab-org allowed to fail
documentation:linkcheck

00:01:49

failed #251040179
gitlab-org
integration:baker_endorser

00:02:30

failed #251041574
gitlab-org
integration:baker_endorser

00:01:06

failed #251040180
gitlab-org
integration:basic

00:02:21

failed #251041562
gitlab-org
integration:basic

00:00:53

failed #251041211
gitlab-org
integration:basic.sh

00:01:05

failed #251040167
gitlab-org
integration:basic.sh

00:02:21

failed #251040181
gitlab-org
integration:contract

00:02:37

failed #251041756
gitlab-org
integration:contract

00:02:28

failed #251041651
gitlab-org
integration:contract_baker

00:02:22

failed #251040182
gitlab-org
integration:contract_baker

00:02:25

failed #251041402
gitlab-org
integration:contracts.sh

00:02:30

failed #251040168
gitlab-org
integration:contracts.sh

00:02:22

failed #251041448
gitlab-org
integration:contracts_macros.sh

00:00:40

failed #251040170
gitlab-org
integration:contracts_macros.sh

00:02:31

failed #251041446
gitlab-org
integration:contracts_mini_scenarios.sh

00:02:28

failed #251040171
gitlab-org
integration:contracts_mini_scenarios.sh

00:02:26

failed #251041447
gitlab-org
integration:contracts_opcode.sh

00:02:23

failed #251040169
gitlab-org
integration:contracts_opcode.sh

00:02:32

failed #251041674
gitlab-org
integration:cors

00:00:39

failed #251040183
gitlab-org
integration:cors

00:02:26

failed #251041216
gitlab-org
integration:double_endorsement

00:01:07

failed #251040192
gitlab-org
integration:double_endorsement

00:02:24

failed #251040173
gitlab-org
integration:inject.sh

00:00:42

failed #251040940
gitlab-org
integration:inject.sh

00:01:02

failed #251040184
gitlab-org
integration:injection

00:01:05

failed #251041323
gitlab-org
integration:injection

00:02:21

failed #251040185
gitlab-org
integration:many_bakers

00:02:31

failed #251041763
gitlab-org
integration:many_bakers

00:01:08

failed #251040186
gitlab-org
integration:many_nodes

00:02:39

failed #251041777
gitlab-org
integration:many_nodes

00:01:00

failed #251040187
gitlab-org
integration:mempool

00:02:23

failed #251041696
gitlab-org
integration:mempool

00:00:40

failed #251040188
gitlab-org
integration:multinode

00:02:21

failed #251041692
gitlab-org
integration:multinode

00:02:28

failed #251041450
gitlab-org
integration:multinode.sh

00:00:41

failed #251040172
gitlab-org
integration:multinode.sh

00:02:23

failed #251041796
gitlab-org
integration:proto_demo_noops

00:01:07

failed #251040194
gitlab-org
integration:proto_demo_noops

00:02:31

failed #251041702
gitlab-org
integration:rpc

00:00:43

failed #251040189
gitlab-org
integration:rpc

00:02:22

failed #251040177
gitlab-org
integration:sandboxes:acc-baking

00:02:50

failed #251041754
gitlab-org
integration:sandboxes:acc-baking

00:01:06

failed #251041770
gitlab-org
integration:sandboxes:acc-endorsement

00:01:15

failed #251040178
gitlab-org
integration:sandboxes:acc-endorsement

00:02:49

failed #251040176
gitlab-org allowed to fail
integration:sandboxes:voting

00:02:58

failed #251041757
gitlab-org allowed to fail
integration:sandboxes:voting

00:01:25

failed #251041774
gitlab-org
integration:snapshot

00:01:02

failed #251040193
gitlab-org
integration:snapshot

00:02:28

failed #251040190
gitlab-org
integration:tls

00:02:29

failed #251041768
gitlab-org
integration:tls

00:00:39

failed #251041751
gitlab-org
integration:voting

00:00:39

failed #251040191
gitlab-org
integration:voting

00:02:23

failed #251041453
gitlab-org
integration:voting.sh

00:00:41

failed #251040174
gitlab-org
integration:voting.sh

00:02:25

failed #251040164
gitlab-org
unit:client_alpha:vote

00:02:26

failed #251041414
gitlab-org
unit:client_alpha:vote

00:02:23

 
Name Stage Failure
failed
documentation:build Test
File "src/lib_shell/store.mli", line 55, characters 20-77:
Paragraph should begin on its own line.
make[1]: Entering directory '/builds/nomadic-labs/tezos/docs'
../_build/default/docs/doc_gen/errors/error_doc.exe > api/errors.rst
Fatal error: exception (Invalid_argument "The tag 10 appears twice in an union.")
make[1]: Leaving directory '/builds/nomadic-labs/tezos/docs'
make[1]: *** [Makefile:19: api/errors.rst] Error 2
make: *** [Makefile:73: doc-html] Error 2
ERROR: Job failed: exit code 1
failed
documentation:linkcheck Test
File "src/lib_shell/store.mli", line 55, characters 20-77:
Paragraph should begin on its own line.
make[1]: Entering directory '/builds/nomadic-labs/tezos/docs'
../_build/default/docs/doc_gen/errors/error_doc.exe > api/errors.rst
Fatal error: exception (Invalid_argument "The tag 10 appears twice in an union.")
make[1]: *** [Makefile:19: api/errors.rst] Error 2
make[1]: Leaving directory '/builds/nomadic-labs/tezos/docs'
make: *** [Makefile:73: doc-html] Error 2
ERROR: Job failed: exit code 1
failed
integration:contract Test
tests_python/launchers/sandbox.py:179: in add_node
node.init_id()
tests_python/daemons/node.py:146: in init_id
subprocess.run(node_identity, check=True)
/usr/lib/python3.6/subprocess.py:438: in run
output=stdout, stderr=stderr)
E subprocess.CalledProcessError: Command '['/builds/nomadic-labs/tezos/tezos-node', 'identity', 'generate', '0.0', '--data-dir', '/tmp/tezos-node.dupt83tr']' returned non-zero exit status 2.
===================== 1 passed, 96 error in 10.79 seconds ======================
ERROR: Job failed: exit code 1
failed
integration:sandboxes:voting Test
Flextesa.voting[2019-07-13T15:57:00-00:00]: Waiting for processes to all die.
Flextesa.voting[2019-07-13T15:57:00-00:00]:
ERROR:
Client-command-error:
Client-command failure: bake for baker-0 --force --minimal-timestamp (args: "bake", "for", "baker-0", "--force", "--minimal-timestamp")
Uploading artifacts...
flextesa-voting-demo-noops: found 179 matching files
Uploading artifacts to coordinator... ok
id=251041954 responseStatus=201 Created token=UsEhrpSv
ERROR: Job failed: exit code 1
failed
integration:contract_baker Test
Fatal error: exception (Invalid_argument "The tag 10 appears twice in an union.")
Raised at file "stdlib.ml", line 34, characters 20-45
Called from file "src/lib_data_encoding/encoding.ml", line 586, characters 13-115
Called from file "list.ml", line 117, characters 24-34
Called from file "src/lib_data_encoding/encoding.ml", line 580, characters 2-444
Called from file "src/lib_data_encoding/encoding.ml", line 596, characters 2-28
Called from file "src/lib_shell/mempool_validator_events.ml", line 42, characters 2-1023
====================== 3 xfailed, 1 error in 0.26 seconds ======================
ERROR: Job failed: exit code 1
failed
integration:sandboxes:acc-endorsement Test
  Waiting for processes to all die.
Flextesa.accusing[2019-07-13T15:56:46-00:00]:
ERROR:
Client-command-error:
Client-command failure: bake for b0 --force --minimal-timestamp (args: "bake", "for", "b0", "--force", "--minimal-timestamp")
Uploading artifacts...
flextesa-acc-sde: found 165 matching files
Uploading artifacts to coordinator... ok
id=251041942 responseStatus=201 Created token=G9s8wesr
ERROR: Job failed: exit code 1
failed
integration:sandboxes:acc-baking Test
  Waiting for processes to all die.
Flextesa.accusing[2019-07-13T15:56:36-00:00]:
ERROR:
Client-command-error:
Client-command failure: bake for b0 --force --minimal-timestamp (args: "bake", "for", "b0", "--force", "--minimal-timestamp")
Uploading artifacts...
flextesa-acc-sdb: found 165 matching files
Uploading artifacts to coordinator... ok
id=251041923 responseStatus=201 Created token=wqANmc__
ERROR: Job failed: exit code 1
failed
integration:contracts_opcode.sh Test

Info: creating file vendors/ocplib-resto/lib_resto-json/dune-project with this contents:
| (lang dune 1.8)
| (name ocplib-resto-json)

$ dune build @src/bin_client/runtest_contracts_opcode.sh
bash alias src/bin_client/test/runtest_contracts_opcode.sh (exit 2)
(cd _build/default/src/bin_client/test && /bin/bash test_contracts_opcode.sh ../../../../install/default/bin/tezos-sandboxed-node.sh ../../../../install/default/bin/tezos-node ../../../../install/default/bin/tezos-init-sandboxed-client.sh ../../../../install/default/bin/tezos-client ../../../../install/default/bin/tezos-admin-client)
ERROR: Job failed: exit code 1
failed
integration:proto_demo_noops Test
Fatal error: exception (Invalid_argument "The tag 10 appears twice in an union.")
Raised at file "stdlib.ml", line 34, characters 20-45
Called from file "src/lib_data_encoding/encoding.ml", line 586, characters 13-115
Called from file "list.ml", line 117, characters 24-34
Called from file "src/lib_data_encoding/encoding.ml", line 580, characters 2-444
Called from file "src/lib_data_encoding/encoding.ml", line 596, characters 2-28
Called from file "src/lib_shell/mempool_validator_events.ml", line 42, characters 2-1023
====================== 6 xfailed, 1 error in 0.28 seconds ======================
ERROR: Job failed: exit code 1
failed
integration:baker_endorser Test
Fatal error: exception (Invalid_argument "The tag 10 appears twice in an union.")
Raised at file "stdlib.ml", line 34, characters 20-45
Called from file "src/lib_data_encoding/encoding.ml", line 586, characters 13-115
Called from file "list.ml", line 117, characters 24-34
Called from file "src/lib_data_encoding/encoding.ml", line 580, characters 2-444
Called from file "src/lib_data_encoding/encoding.ml", line 596, characters 2-28
Called from file "src/lib_shell/mempool_validator_events.ml", line 42, characters 2-1023
===================== 1 failed, 6 xfailed in 0.28 seconds ======================
ERROR: Job failed: exit code 1
failed
integration:multinode Test
Fatal error: exception (Invalid_argument "The tag 10 appears twice in an union.")
Raised at file "stdlib.ml", line 34, characters 20-45
Called from file "src/lib_data_encoding/encoding.ml", line 586, characters 13-115
Called from file "list.ml", line 117, characters 24-34
Called from file "src/lib_data_encoding/encoding.ml", line 580, characters 2-444
Called from file "src/lib_data_encoding/encoding.ml", line 596, characters 2-28
Called from file "src/lib_shell/mempool_validator_events.ml", line 42, characters 2-1023
====================== 7 xfailed, 1 error in 0.30 seconds ======================
ERROR: Job failed: exit code 1
failed
integration:contracts.sh Test

Info: creating file vendors/ocplib-resto/lib_resto-json/dune-project with this contents:
| (lang dune 1.8)
| (name ocplib-resto-json)

$ dune build @src/bin_client/runtest_contracts.sh
bash alias src/bin_client/test/runtest_contracts.sh (exit 2)
(cd _build/default/src/bin_client/test && /bin/bash test_contracts.sh ../../../../install/default/bin/tezos-sandboxed-node.sh ../../../../install/default/bin/tezos-node ../../../../install/default/bin/tezos-init-sandboxed-client.sh ../../../../install/default/bin/tezos-client ../../../../install/default/bin/tezos-admin-client)
ERROR: Job failed: exit code 1
failed
unit:client_alpha:vote Test
Called from file "list.ml", line 117, characters 24-34
Called from file "src/lib_data_encoding/encoding.ml", line 580, characters 2-444
Called from file "src/lib_data_encoding/encoding.ml", line 596, characters 2-28
Called from file "src/lib_shell/mempool_validator_events.ml", line 42, characters 2-1023
[exception] Node_helpers.Node_exited_prematurely

The full test results are available in `/builds/nomadic-labs/tezos/_build/default/_build/_tests/8B82140E-9AD6-46C0-AD90-530F96A128C2`.
1 error! in 0.002s. 1 test run.
ERROR: Job failed: exit code 1
failed
integration:many_nodes Test
Fatal error: exception (Invalid_argument "The tag 10 appears twice in an union.")
Raised at file "stdlib.ml", line 34, characters 20-45
Called from file "src/lib_data_encoding/encoding.ml", line 586, characters 13-115
Called from file "list.ml", line 117, characters 24-34
Called from file "src/lib_data_encoding/encoding.ml", line 580, characters 2-444
Called from file "src/lib_data_encoding/encoding.ml", line 596, characters 2-28
Called from file "src/lib_shell/mempool_validator_events.ml", line 42, characters 2-1023
===================== 1 failed, 6 xfailed in 0.28 seconds ======================
ERROR: Job failed: exit code 1
failed
integration:injection Test
Fatal error: exception (Invalid_argument "The tag 10 appears twice in an union.")
Raised at file "stdlib.ml", line 34, characters 20-45
Called from file "src/lib_data_encoding/encoding.ml", line 586, characters 13-115
Called from file "list.ml", line 117, characters 24-34
Called from file "src/lib_data_encoding/encoding.ml", line 580, characters 2-444
Called from file "src/lib_data_encoding/encoding.ml", line 596, characters 2-28
Called from file "src/lib_shell/mempool_validator_events.ml", line 42, characters 2-1023
================= 2 passed, 7 xfailed, 2 error in 0.47 seconds =================
ERROR: Job failed: exit code 1
failed
integration:many_bakers Test
Fatal error: exception (Invalid_argument "The tag 10 appears twice in an union.")
Raised at file "stdlib.ml", line 34, characters 20-45
Called from file "src/lib_data_encoding/encoding.ml", line 586, characters 13-115
Called from file "list.ml", line 117, characters 24-34
Called from file "src/lib_data_encoding/encoding.ml", line 580, characters 2-444
Called from file "src/lib_data_encoding/encoding.ml", line 596, characters 2-28
Called from file "src/lib_shell/mempool_validator_events.ml", line 42, characters 2-1023
===================== 1 failed, 2 xfailed in 0.25 seconds ======================
ERROR: Job failed: exit code 1
failed
integration:contracts_mini_scenarios.sh Test

Info: creating file vendors/ocplib-resto/lib_resto-json/dune-project with this contents:
| (lang dune 1.8)
| (name ocplib-resto-json)

$ dune build @src/bin_client/runtest_contracts_mini_scenarios.sh
bash alias src/bin_client/test/runtest_contracts_mini_scenarios.sh (exit 2)
(cd _build/default/src/bin_client/test && /bin/bash test_contracts_mini_scenarios.sh ../../../../install/default/bin/tezos-sandboxed-node.sh ../../../../install/default/bin/tezos-node ../../../../install/default/bin/tezos-init-sandboxed-client.sh ../../../../install/default/bin/tezos-client ../../../../install/default/bin/tezos-admin-client)
ERROR: Job failed: exit code 1
failed
integration:snapshot Test
Fatal error: exception (Invalid_argument "The tag 10 appears twice in an union.")
Raised at file "stdlib.ml", line 34, characters 20-45
Called from file "src/lib_data_encoding/encoding.ml", line 586, characters 13-115
Called from file "list.ml", line 117, characters 24-34
Called from file "src/lib_data_encoding/encoding.ml", line 580, characters 2-444
Called from file "src/lib_data_encoding/encoding.ml", line 596, characters 2-28
Called from file "src/lib_shell/mempool_validator_events.ml", line 42, characters 2-1023
===================== 1 failed, 8 xfailed in 0.31 seconds ======================
ERROR: Job failed: exit code 1
failed
integration:tls Test
Fatal error: exception (Invalid_argument "The tag 10 appears twice in an union.")
Raised at file "stdlib.ml", line 34, characters 20-45
Called from file "src/lib_data_encoding/encoding.ml", line 586, characters 13-115
Called from file "list.ml", line 117, characters 24-34
Called from file "src/lib_data_encoding/encoding.ml", line 580, characters 2-444
Called from file "src/lib_data_encoding/encoding.ml", line 596, characters 2-28
Called from file "src/lib_shell/mempool_validator_events.ml", line 42, characters 2-1023
=========================== 1 error in 0.23 seconds ============================
ERROR: Job failed: exit code 1
failed
integration:rpc Test
E   KeyError: 1
__________________________ TestRPCs.test_stat_memory ___________________________
tests_python/tests/test_rpc.py:523: in test_stat_memory
assert sandbox.client(1).rpc('get', "/stats/memory")
tests_python/launchers/sandbox.py:308: in client
return self.clients[node_id]
E KeyError: 1
==================== 72 failed, 26 skipped in 3.41 seconds =====================
ERROR: Job failed: exit code 1
failed
integration:basic Test
Fatal error: exception (Invalid_argument "The tag 10 appears twice in an union.")
Raised at file "stdlib.ml", line 34, characters 20-45
Called from file "src/lib_data_encoding/encoding.ml", line 586, characters 13-115
Called from file "list.ml", line 117, characters 24-34
Called from file "src/lib_data_encoding/encoding.ml", line 580, characters 2-444
Called from file "src/lib_data_encoding/encoding.ml", line 596, characters 2-28
Called from file "src/lib_shell/mempool_validator_events.ml", line 42, characters 2-1023
====================== 5 xfailed, 1 error in 0.28 seconds ======================
ERROR: Job failed: exit code 1
failed
integration:basic.sh Test

Info: creating file vendors/ocplib-resto/lib_resto-json/dune-project with this contents:
| (lang dune 1.8)
| (name ocplib-resto-json)

$ dune build @src/bin_client/runtest_basic.sh
bash alias src/bin_client/test/runtest_basic.sh (exit 2)
(cd _build/default/src/bin_client/test && /bin/bash test_basic.sh ../../../../install/default/bin/tezos-sandboxed-node.sh ../../../../install/default/bin/tezos-node ../../../../install/default/bin/tezos-init-sandboxed-client.sh ../../../../install/default/bin/tezos-client ../../../../install/default/bin/tezos-admin-client)
ERROR: Job failed: exit code 1
failed
integration:voting Test
Fatal error: exception (Invalid_argument "The tag 10 appears twice in an union.")
Raised at file "stdlib.ml", line 34, characters 20-45
Called from file "src/lib_data_encoding/encoding.ml", line 586, characters 13-115
Called from file "list.ml", line 117, characters 24-34
Called from file "src/lib_data_encoding/encoding.ml", line 580, characters 2-444
Called from file "src/lib_data_encoding/encoding.ml", line 596, characters 2-28
Called from file "src/lib_shell/mempool_validator_events.ml", line 42, characters 2-1023
===================== 23 xfailed, 1 error in 0.46 seconds ======================
ERROR: Job failed: exit code 1
failed
integration:mempool Test
Fatal error: exception (Invalid_argument "The tag 10 appears twice in an union.")
Raised at file "stdlib.ml", line 34, characters 20-45
Called from file "src/lib_data_encoding/encoding.ml", line 586, characters 13-115
Called from file "list.ml", line 117, characters 24-34
Called from file "src/lib_data_encoding/encoding.ml", line 580, characters 2-444
Called from file "src/lib_data_encoding/encoding.ml", line 596, characters 2-28
Called from file "src/lib_shell/mempool_validator_events.ml", line 42, characters 2-1023
===================== 1 failed, 9 xfailed in 0.31 seconds ======================
ERROR: Job failed: exit code 1
failed
integration:cors Test
tests_python/launchers/sandbox.py:179: in add_node
node.init_id()
tests_python/daemons/node.py:146: in init_id
subprocess.run(node_identity, check=True)
/usr/lib/python3.6/subprocess.py:438: in run
output=stdout, stderr=stderr)
E subprocess.CalledProcessError: Command '['/builds/nomadic-labs/tezos/tezos-node', 'identity', 'generate', '0.0', '--data-dir', '/tmp/tezos-node.v5v4x19r']' returned non-zero exit status 2.
=========================== 2 error in 0.32 seconds ============================
ERROR: Job failed: exit code 1
failed
integration:multinode.sh Test
| (name ocplib-resto-json)

$ dune build @src/bin_client/runtest_multinode.sh
bash alias src/bin_client/test/runtest_multinode.sh (exit 2)
(cd _build/default/src/bin_client/test && /bin/bash test_multinode.sh ../../../../install/default/bin/tezos-sandboxed-node.sh ../../../../install/default/bin/tezos-node ../../../../install/default/bin/tezos-init-sandboxed-client.sh ../../../../install/default/bin/tezos-client ../../../../install/default/bin/tezos-admin-client)

## Starting node 1.

ERROR: Job failed: exit code 1
failed
integration:voting.sh Test
Info: creating file vendors/ocplib-resto/lib_resto-json/dune-project with this contents:
| (lang dune 1.8)
| (name ocplib-resto-json)

$ dune build @src/bin_client/runtest_voting.sh
bash alias src/bin_client/test/runtest_voting.sh (exit 2)
(cd _build/default/src/bin_client/test && /bin/bash test_voting.sh ../../../../install/default/bin/tezos-sandboxed-node.sh ../../../../install/default/bin/tezos-node ../../../../install/default/bin/tezos-init-sandboxed-client.sh ../../../../install/default/bin/tezos-client ../../../../install/default/bin/tezos-admin-client)
params=/tmp/tmp.mKiilh/parameters.json
ERROR: Job failed: exit code 1
failed
integration:contracts_macros.sh Test

Info: creating file vendors/ocplib-resto/lib_resto-json/dune-project with this contents:
| (lang dune 1.8)
| (name ocplib-resto-json)

$ dune build @src/bin_client/runtest_contracts_macros.sh
bash alias src/bin_client/test/runtest_contracts_macros.sh (exit 2)
(cd _build/default/src/bin_client/test && /bin/bash test_contracts_macros.sh ../../../../install/default/bin/tezos-sandboxed-node.sh ../../../../install/default/bin/tezos-node ../../../../install/default/bin/tezos-init-sandboxed-client.sh ../../../../install/default/bin/tezos-client ../../../../install/default/bin/tezos-admin-client)
ERROR: Job failed: exit code 1
failed
integration:double_endorsement Test
Fatal error: exception (Invalid_argument "The tag 10 appears twice in an union.")
Raised at file "stdlib.ml", line 34, characters 20-45
Called from file "src/lib_data_encoding/encoding.ml", line 586, characters 13-115
Called from file "list.ml", line 117, characters 24-34
Called from file "src/lib_data_encoding/encoding.ml", line 580, characters 2-444
Called from file "src/lib_data_encoding/encoding.ml", line 596, characters 2-28
Called from file "src/lib_shell/mempool_validator_events.ml", line 42, characters 2-1023
===================== 1 failed, 12 xfailed in 0.34 seconds =====================
ERROR: Job failed: exit code 1
failed
integration:inject.sh Test
| (name ocplib-resto-json)

$ dune build @src/bin_client/runtest_injection.sh
bash alias src/bin_client/test/runtest_injection.sh (exit 2)
(cd _build/default/src/bin_client/test && /bin/bash test_injection.sh ../../../../install/default/bin/tezos-sandboxed-node.sh ../../../../install/default/bin/tezos-node ../../../../install/default/bin/tezos-init-sandboxed-client.sh ../../../../install/default/bin/tezos-client ../../../../install/default/bin/tezos-admin-client ../../../../install/default/bin/tezos-protocol-compiler)

## Starting node 1.

ERROR: Job failed: exit code 1