%YAML 1.1
%TAG !u! tag:unity3d.com,2011:
--- !u!78 &1
TagManager:
  serializedVersion: 2
  tags:
  - Enemy
  - Score
  - TextCard
  - CardButton
  - Canvas
  layers:
  - Default
  - TransparentFX
  - Ignore Raycast
  - Obstacles
  - Water
  - UI
  - Background
  - 
  - 
  - 
  - 
  - 
  - 
  - 
  - 
  - 
  - 
  - 
  - 
  - 
  - 
  - 
  - 
  - 
  - 
  - 
  - 
  - 
  - 
  - 
  - 
  - 
  m_SortingLayers:
  - name: Background
    uniqueID: 527619063
    locked: 0
  - name: Default
    uniqueID: 0
    locked: 0
  - name: Obstacles
    uniqueID: 3221797747
    locked: 0
  - name: Player
    uniqueID: 82838011
    locked: 0
