0 silly argv {
0 silly argv   _: [ 'bootstrap' ],
0 silly argv   lernaVersion: '3.20.2',
0 silly argv   '$0': '/home/mbetancourt/.yarn/bin/lerna'
0 silly argv }
1 notice cli v3.20.2
2 verbose rootPath /home/mbetancourt/Projects/apartments-clone
3 info versioning independent
4 error JSONError: Unexpected token } in JSON at position 116 while parsing near '...  "license": "MIT",}' in packages/shared/package.json
4 error     at module.exports (/home/mbetancourt/.config/yarn/global/node_modules/parse-json/index.js:26:19)
4 error     at parse (/home/mbetancourt/.config/yarn/global/node_modules/load-json-file/index.js:15:9)
