<?xml version="1.0" encoding="utf-8"?>
<!-- Generator: Adobe Illustrator 24.0.0, SVG Export Plug-In . SVG Version: 6.00 Build 0)  -->
<svg version="1.1" id="Capa_2" xmlns="http://www.w3.org/2000/svg" xmlns:xlink="http://www.w3.org/1999/xlink" x="0px" y="0px"
	 viewBox="0 0 483.43 164.57" style="enable-background:new 0 0 483.43 164.57;" xml:space="preserve">
<style type="text/css">
	.st0{fill:url(#SVGID_1_);}
</style>
<g>
	<path d="M21.64,104.18V79.23h10.42v3.92h-5.61v5.98h5.61v3.86h-5.61v11.19H21.64z"/>
	<g>
		<path d="M35.26,82.67c0-0.66,0.24-1.22,0.71-1.69c0.48-0.47,1.06-0.7,1.74-0.7c0.71,0,1.3,0.23,1.78,0.69
			c0.48,0.46,0.72,1.03,0.72,1.7c0,0.66-0.25,1.21-0.75,1.67c-0.5,0.45-1.08,0.68-1.76,0.68c-0.66,0-1.23-0.23-1.72-0.7
			C35.51,83.84,35.26,83.29,35.26,82.67z M35.55,104.18V86.7h4.42v17.48H35.55z"/>
	</g>
	<path d="M43.66,104.18V87.07h4.13v2.73c0.51-1.03,1.12-1.8,1.83-2.31c0.71-0.51,1.54-0.76,2.48-0.76c1.26,0,2.16,0.37,2.68,1.11
		c0.52,0.74,0.78,2.1,0.78,4.07v12.27H51.2V93.45c0-1.25-0.11-2.09-0.33-2.53c-0.22-0.44-0.62-0.66-1.19-0.66
		c-0.55,0-0.96,0.26-1.24,0.78c-0.27,0.52-0.41,1.29-0.41,2.32v10.82H43.66z"/>
	<path d="M67.32,104v-3.27c-0.4,1.14-0.92,2-1.56,2.58c-0.63,0.58-1.38,0.86-2.23,0.86c-1.49,0-2.62-0.75-3.4-2.25
		c-0.78-1.5-1.17-3.68-1.17-6.52c0-2.97,0.36-5.18,1.09-6.63c0.73-1.45,1.83-2.18,3.3-2.18c0.97,0,1.78,0.29,2.42,0.86
		c0.64,0.57,1.16,1.47,1.55,2.69V76.87h4.61V104H67.32z M67.55,95.31c0-1.61-0.17-2.83-0.5-3.67c-0.33-0.84-0.82-1.26-1.47-1.26
		c-0.68,0-1.17,0.4-1.47,1.2c-0.3,0.8-0.45,2.11-0.45,3.93c0,1.68,0.15,2.93,0.46,3.74c0.31,0.81,0.78,1.21,1.43,1.21
		c0.68,0,1.18-0.42,1.51-1.26C67.39,98.35,67.55,97.06,67.55,95.31z"/>
	<path d="M85.87,104.18V93.51l-5.69-14.02h5.31l1.88,6.21c0.3,0.98,0.53,1.85,0.69,2.6s0.29,1.53,0.39,2.33
		c0.12-1,0.26-1.92,0.43-2.77c0.17-0.85,0.37-1.63,0.59-2.35l1.9-6.02h5.18l-5.76,14.17v10.52H85.87z"/>
	<path d="M94.67,95.47c0-2.94,0.56-5.12,1.69-6.56c1.13-1.44,2.84-2.16,5.15-2.16c2.33,0,4.06,0.72,5.19,2.16
		c1.13,1.44,1.7,3.63,1.7,6.56c0,2.95-0.57,5.13-1.7,6.56c-1.13,1.43-2.86,2.14-5.19,2.14c-2.31,0-4.02-0.72-5.15-2.15
		C95.24,100.59,94.67,98.41,94.67,95.47z M101.53,100.33c0.93,0,1.59-0.37,1.98-1.11c0.39-0.74,0.59-2.02,0.59-3.83
		c0-1.78-0.2-3.06-0.6-3.82c-0.4-0.76-1.06-1.14-1.97-1.14c-0.91,0-1.56,0.39-1.96,1.16c-0.4,0.77-0.61,2.04-0.61,3.8
		c0,1.77,0.2,3.03,0.61,3.8C99.97,99.95,100.62,100.33,101.53,100.33z"/>
	<path d="M111.12,96.68v-9.93h4.55v10.01c0,1.51,0.12,2.54,0.37,3.1c0.25,0.56,0.67,0.83,1.27,0.83c0.58,0,1-0.28,1.23-0.83
		c0.24-0.55,0.36-1.58,0.36-3.1V86.75h4.56v9.93c0,2.55-0.5,4.44-1.51,5.67c-1.01,1.23-2.56,1.84-4.64,1.84
		c-2.1,0-3.66-0.61-4.67-1.85C111.63,101.1,111.12,99.22,111.12,96.68z"/>
	<path d="M126.89,104.18V87.07h4.08v4.26h0.2c0.35-1.5,0.92-2.65,1.72-3.44c0.8-0.79,1.78-1.19,2.96-1.19h0.18v4.44
		c-0.13-0.01-0.27-0.02-0.42-0.02c-0.15,0-0.35-0.01-0.62-0.01c-1.3,0-2.25,0.32-2.86,0.95c-0.61,0.63-0.92,1.61-0.92,2.94v9.19
		H126.89z"/>
	<path d="M176.56,99.2c-0.41,1.64-1.15,2.88-2.22,3.72s-2.46,1.26-4.18,1.26c-2.35,0-4.08-0.69-5.19-2.08
		c-1.1-1.39-1.65-3.56-1.65-6.51c0-3.04,0.55-5.27,1.66-6.7c1.11-1.43,2.85-2.14,5.21-2.14c2.24,0,3.93,0.65,5.08,1.95
		c1.14,1.3,1.71,3.23,1.71,5.79v2.7h-9.08v-0.74c0,1.57,0.18,2.71,0.54,3.41c0.36,0.7,0.93,1.06,1.72,1.06
		c0.57,0,1.04-0.22,1.4-0.66c0.37-0.44,0.61-1.08,0.72-1.92L176.56,99.2z M167.9,93.99h4.58c-0.01-1.3-0.21-2.25-0.58-2.85
		c-0.38-0.6-0.97-0.9-1.77-0.9c-0.72,0-1.27,0.31-1.64,0.94C168.12,91.8,167.92,92.74,167.9,93.99z"/>
	<path d="M176.98,104.18l4.49-8.78l-4.14-8.24h4.58l1,2.45c0.17,0.44,0.35,0.99,0.54,1.64c0.18,0.65,0.36,1.38,0.54,2.19
		c0.15-0.78,0.32-1.48,0.5-2.11c0.18-0.63,0.34-1.14,0.5-1.51l1.13-2.65h4.52l-4.24,8.12l4.43,8.9h-4.58l-1.26-3.2
		c-0.22-0.56-0.42-1.18-0.58-1.85c-0.16-0.67-0.3-1.42-0.41-2.25c-0.17,0.93-0.35,1.73-0.52,2.4c-0.17,0.67-0.35,1.2-0.52,1.61
		l-1.41,3.29H176.98z"/>
	<path d="M198.36,87.42v-4.91h-4.49v4.91h-1.79v3.39h1.79v13.36h4.49V90.82h1.96v-3.39H198.36z"/>
	<polygon points="144.84,79.18 144.84,104.18 149.61,104.18 149.61,86.7 155.93,104.18 160.64,104.18 160.64,79.18 155.93,79.18 
		155.93,94.87 150.14,79.18 	"/>
	<linearGradient id="SVGID_1_" gradientUnits="userSpaceOnUse" x1="238.1071" y1="146.25" x2="238.1071" y2="18.3215">
		<stop  offset="0" style="stop-color:#EDAF2A"/>
		<stop  offset="0.2009" style="stop-color:#EEAB29"/>
		<stop  offset="0.3858" style="stop-color:#EFA026"/>
		<stop  offset="0.5638" style="stop-color:#F28E21"/>
		<stop  offset="0.7235" style="stop-color:#F5761B"/>
	</linearGradient>
	<path class="st0" d="M319.36,134.61l15.71-2.14c-33.96-9.78-75.76-11.74-111.86-10.88V65.25h-19.5l48.43-34.07l41.57,23.14
		l14.14-1.5l-15.64-9.61V24.75H280V35.7l-28.29-17.38l-70.07,50.14h31.93v53.41c-40.99,1.56-72.43,6.37-72.43,6.37
		c138.21-9.36,154.29,18,154.29,18l12.43-7.79c0,0-14.21-11.57-69.75-13.86C238.11,124.61,283.36,121.75,319.36,134.61z"/>
	<path d="M234.07,110.18l8.66-38.57h7.98l8.44,38.57h-7.78l-1.05-6.26h-7.59l-1.27,6.26H234.07z M243.83,98.05h5.39l-1.76-12.15
		c-0.13-0.99-0.26-2.23-0.38-3.72c-0.12-1.49-0.22-3.16-0.3-5h-0.46c-0.16,2.18-0.32,4.1-0.46,5.74c-0.14,1.64-0.26,2.69-0.34,3.13
		L243.83,98.05z"/>
	<path d="M262.24,110.11v-38.5h8.64c3.85,0,6.72,0.93,8.61,2.79c1.89,1.86,2.83,4.68,2.83,8.45c0,3.53-1.05,6.28-3.16,8.27
		c-2.11,1.99-5.05,2.99-8.82,2.99h-0.71v16H262.24z M269.64,77.57v11.35h0.29c1.59,0,2.8-0.53,3.62-1.6
		c0.82-1.06,1.23-2.62,1.23-4.68c0-2.01-0.42-3.51-1.26-4.51C272.69,77.15,271.39,77.63,269.64,77.57z"/>
	<path d="M282.08,110.18l8.66-38.57h7.98l8.44,38.57h-7.78l-1.05-6.26h-7.59l-1.27,6.26H282.08z M291.84,98.05h5.39l-1.76-12.15
		c-0.13-0.99-0.26-2.23-0.38-3.72c-0.12-1.49-0.22-3.16-0.3-5h-0.46c-0.16,2.18-0.32,4.1-0.46,5.74c-0.14,1.64-0.26,2.69-0.34,3.13
		L291.84,98.05z"/>
	<path d="M310.25,110.18V71.61h9.2c4.02,0,7.05,0.91,9.11,2.74c2.06,1.82,3.09,4.52,3.09,8.08c0,2.46-0.54,4.54-1.61,6.22
		c-1.07,1.68-2.6,2.86-4.59,3.51l6.88,18.02h-7.68l-6.44-18.16h-0.71v18.16H310.25z M317.5,88.12c0.1,0,0.24,0.01,0.43,0.02
		c0.19,0.02,0.33,0.03,0.43,0.03c1.89,0,3.35-0.48,4.39-1.44c1.04-0.96,1.56-2.31,1.56-4.05c0-1.74-0.51-3.06-1.54-3.96
		c-1.02-0.9-2.53-1.34-4.51-1.34h-0.76V88.12z"/>
	<path d="M339.23,110.18V78.06h-5.83v-6.46h19.12v6.46h-5.9v32.11H339.23z"/>
	<path d="M392.14,110.18V71.61h16.03v6.06h-8.64v9.24h8.64v5.96h-8.64v11.09h8.64v6.21H392.14z"/>
	<path d="M414.93,110.18V71.61h8.17l5.58,18.39c0.29,0.9,0.73,2.51,1.32,4.82c0.59,2.31,1.29,5.18,2.1,8.61h0.54
		c-0.66-4.68-1.19-8.82-1.56-12.42c-0.38-3.6-0.57-6.28-0.57-8.03V71.61h7.39v38.57h-8.01L424.48,93c-0.07-0.25-0.2-0.66-0.38-1.23
		c-1.53-4.78-2.61-8.96-3.26-12.52h-0.49c0.65,4.63,1.14,8.77,1.48,12.42c0.34,3.65,0.51,6.69,0.51,9.12v9.39H414.93z"/>
	<path d="M448.49,110.18V78.06h-5.83v-6.46h19.12v6.46h-5.9v32.11H448.49z"/>
	<polygon points="384.64,71.61 374.57,71.61 371.48,98.31 368.39,71.61 358.32,71.61 354.46,110.18 362.07,110.18 364.11,79.18 
		368.82,110.18 371.46,110.18 371.5,110.18 374.14,110.18 378.86,79.18 380.89,110.18 388.5,110.18 	"/>
	<polyline points="354.46,110.18 362.07,110.18 364.11,79.18 	"/>
</g>
</svg>
