{
  "training_data_set": "path/to/training/data.jsonl",
  "validation_data_set": "path/to/validation/data.jsonl",
  "test_data_set": "path/to/test/data.jsonl",
  "eval_data_set": "path/to/eval/data.jsonl",
  "csv_ratings_path": "path/to//ratings.csv",
  "training_set_size": 7349946,
  "validation_set_size": 815617,
  "test_set_size": 2038822,
  "sequence_size": 3,
  "target_size": 1,
  "position_size":3,
  "user_size": 270896,
  "movie_size": 43332,
  "learning_rate": 0.01,
  "epochs": 5,
  "batch_size": 500,
  "num_heads": 3,
  "dropout_rate": 0.1,
  "hidden_state": [256, 128],
  "model_dir":"path/to/model/dir/",
  "log_dir": "path/to/log/dir/"
}