%YAML 1.1
%TAG !u! tag:unity3d.com,2011:
--- !u!114 &11400000
MonoBehaviour:
  m_ObjectHideFlags: 0
  m_CorrespondingSourceObject: {fileID: 0}
  m_PrefabInstance: {fileID: 0}
  m_PrefabAsset: {fileID: 0}
  m_GameObject: {fileID: 0}
  m_Enabled: 1
  m_EditorHideFlags: 0
  m_Script: {fileID: 11500000, guid: a3b6e326a4e9e4142a52e753c9a2f87c, type: 3}
  m_Name: CableMision
  m_EditorClassIdentifier: 
  MissionPanelText: "Em falta connectar la corrent i ja podr\xE9 comen\xE7ar, necessitaria
    que em busquessis un cable"
  TasksPanelText: '- Troba el cable de corrent'
  MissionItemPrefab:
  - {fileID: 3791564865259084111, guid: 0c33ba48279e47048b4dd18943966d9f, type: 3}
  spawnPosition:
  - {fileID: 8619271758415342813, guid: dbfc146572fd832499e0b761e2595c1e, type: 3}
  completed: 0
