{
    "home_team_url": "https://www.lnr.fr/rugby-top-14/club-rugby/perpignan-rugby-top-14",
    "home_team_name": "Perpignan",
    "home_team_score": "32",
    "away_team_url": "https://www.lnr.fr/rugby-top-14/club-rugby/toulouse-rugby-top-14",
    "away_team_name": "Toulouse",
    "away_team_score": "8",
    "raw_gamedate": "Vendredi 06 Mars 2009",
    "raw_gametime": "21h00"
}