{
    "home_team_url": "https://www.lnr.fr/rugby-pro-d2/club-rugby/brive-rugby-pro-d2",
    "home_team_name": "Brive",
    "home_team_score": "29",
    "away_team_url": "https://www.lnr.fr/rugby-top-14/club-rugby/la-rochelle-rugby-top-14",
    "away_team_name": "La Rochelle",
    "away_team_score": "28",
    "raw_gamedate": "Samedi 17 Septembre 2016",
    "raw_gametime": "18h30"
}