{
    "home_team_url": "https://www.lnr.fr/rugby-top-14/club-rugby/paris-rugby-top-14",
    "home_team_name": "Paris",
    "home_team_score": "21",
    "away_team_url": "https://www.lnr.fr/rugby-top-14/club-rugby/grenoble-rugby-top-14",
    "away_team_name": "Grenoble",
    "away_team_score": "30",
    "raw_gamedate": "Samedi 14 Mars 2015",
    "raw_gametime": "18h30"
}