{
    "home_team_url": "https://www.lnr.fr/rugby-pro-d2/club-rugby/bayonne-rugby-pro-d2",
    "home_team_name": "Bayonne",
    "home_team_score": "20",
    "away_team_url": "https://www.lnr.fr/rugby-top-14/club-rugby/toulon-rugby-top-14",
    "away_team_name": "Toulon",
    "away_team_score": "9",
    "raw_gamedate": "Mercredi 29 D\u00e9cembre 2010",
    "raw_gametime": "19h00"
}