{
    "home_team_url": "https://www.lnr.fr/rugby-pro-d2/club-rugby/bayonne-rugby-pro-d2",
    "home_team_name": "Bayonne",
    "home_team_score": "19",
    "away_team_url": "https://www.lnr.fr/rugby-pro-d2/club-rugby/biarritz-rugby-pro-d2",
    "away_team_name": "Biarritz",
    "away_team_score": "22",
    "raw_gamedate": "Samedi 02 Octobre 2010",
    "raw_gametime": "20h45"
}