{
    "home_team_url": "https://www.lnr.fr/rugby-pro-d2/club-rugby/biarritz-rugby-pro-d2",
    "home_team_name": "Biarritz",
    "home_team_score": "3",
    "away_team_url": "https://www.lnr.fr/rugby-top-14/club-rugby/toulon-rugby-top-14",
    "away_team_name": "Toulon",
    "away_team_score": "13",
    "raw_gamedate": "Vendredi 20 Ao\u00fbt 2010",
    "raw_gametime": "21h00"
}