{
    "home_team_url": "https://www.lnr.fr/rugby-top-14/club-rugby/paris-rugby-top-14",
    "home_team_name": "Paris",
    "home_team_score": "13",
    "away_team_url": "https://www.lnr.fr/rugby-pro-d2/club-rugby/bayonne-rugby-pro-d2",
    "away_team_name": "Bayonne",
    "away_team_score": "9",
    "raw_gamedate": "Samedi 02 Novembre 2013",
    "raw_gametime": "20h30"
}