{
    "home_team_url": "https://www.lnr.fr/rugby-pro-d2/club-rugby/bayonne-rugby-pro-d2",
    "home_team_name": "Bayonne",
    "home_team_score": "43",
    "away_team_url": "https://www.lnr.fr/rugby-top-14/club-rugby/grenoble-rugby-top-14",
    "away_team_name": "Grenoble",
    "away_team_score": "35",
    "raw_gamedate": "Samedi 29 Avril 2017",
    "raw_gametime": "18h30"
}