{
    "home_team_url": "https://www.lnr.fr/rugby-pro-d2/club-rugby/bayonne-rugby-pro-d2",
    "home_team_name": "Bayonne",
    "home_team_score": "18",
    "away_team_url": "https://www.lnr.fr/rugby-top-14/club-rugby/perpignan-rugby-top-14",
    "away_team_name": "Perpignan",
    "away_team_score": "16",
    "raw_gamedate": "Samedi 29 Octobre 2011",
    "raw_gametime": "14h15"
}