{
    "home_team_url": "https://www.lnr.fr/rugby-top-14/club-rugby/clermont-rugby-top-14",
    "home_team_name": "Clermont",
    "home_team_score": "21",
    "away_team_url": "https://www.lnr.fr/rugby-top-14/club-rugby/la-rochelle-rugby-top-14",
    "away_team_name": "La Rochelle",
    "away_team_score": "17",
    "raw_gamedate": "Dimanche 04 Mars 2018",
    "raw_gametime": "16h50"
}