{
    "home_team_url": "https://www.lnr.fr/rugby-pro-d2/club-rugby/mont-de-marsan-rugby-pro-d2",
    "home_team_name": "Mont-de-Marsan",
    "home_team_score": "15",
    "away_team_url": "https://www.lnr.fr/rugby-top-14/club-rugby/castres-rugby-top-14",
    "away_team_name": "Castres",
    "away_team_score": "31",
    "raw_gamedate": "Samedi 01 D\u00e9cembre 2012",
    "raw_gametime": "18h30"
}