{
    "home_team_url": "https://www.lnr.fr/rugby-top-14/club-rugby/toulouse-rugby-top-14",
    "home_team_name": "Toulouse",
    "home_team_score": "19",
    "away_team_url": "https://www.lnr.fr/rugby-pro-d2/club-rugby/biarritz-rugby-pro-d2",
    "away_team_name": "Biarritz",
    "away_team_score": "14",
    "raw_gamedate": "Vendredi 25 Janvier 2013",
    "raw_gametime": "21h00"
}