{
    "home_team_url": "https://www.lnr.fr/rugby-top-14/club-rugby/la-rochelle-rugby-top-14",
    "home_team_name": "La Rochelle",
    "home_team_score": "33",
    "away_team_url": "https://www.lnr.fr/rugby-pro-d2/club-rugby/brive-rugby-pro-d2",
    "away_team_name": "Brive",
    "away_team_score": "24",
    "raw_gamedate": "Samedi 27 Janvier 2018",
    "raw_gametime": "18h00"
}