{
    "home_team_url": "https://www.lnr.fr/rugby-top-14/club-rugby/paris-rugby-top-14",
    "home_team_name": "Paris",
    "home_team_score": "0",
    "away_team_url": "https://www.lnr.fr/rugby-top-14/club-rugby/perpignan-rugby-top-14",
    "away_team_name": "Perpignan",
    "away_team_score": "0",
    "raw_gamedate": "Vendredi 04 Mars 2005",
    "raw_gametime": "19h30"
}