{
    "home_team_url": "https://www.lnr.fr/rugby-pro-d2/club-rugby/mont-de-marsan-rugby-pro-d2",
    "home_team_name": "Mont-de-Marsan",
    "home_team_score": "28",
    "away_team_url": "https://www.lnr.fr/rugby-top-14/club-rugby/paris-rugby-top-14",
    "away_team_name": "Paris",
    "away_team_score": "30",
    "raw_gamedate": "Samedi 06 Octobre 2012",
    "raw_gametime": "18h30"
}