{
    "home_team_url": "https://www.lnr.fr/club-rugby/bourgoin",
    "home_team_name": "Bourgoin",
    "home_team_score": "11",
    "away_team_url": "https://www.lnr.fr/rugby-top-14/club-rugby/toulouse-rugby-top-14",
    "away_team_name": "Toulouse",
    "away_team_score": "35",
    "raw_gamedate": "Jeudi 04 Novembre 2010",
    "raw_gametime": "21h00"
}