{
    "home_team_url": "https://www.lnr.fr/rugby-pro-d2/club-rugby/montauban-rugby-pro-d2",
    "home_team_name": "Montauban",
    "home_team_score": "15",
    "away_team_url": "https://www.lnr.fr/rugby-top-14/club-rugby/paris-rugby-top-14",
    "away_team_name": "Paris",
    "away_team_score": "9",
    "raw_gamedate": "Vendredi 06 Octobre 2006",
    "raw_gametime": null
}