{
    "home_team_url": "https://www.lnr.fr/club-rugby/bourgoin",
    "home_team_name": "Bourgoin",
    "home_team_score": "22",
    "away_team_url": "https://www.lnr.fr/rugby-top-14/club-rugby/clermont-rugby-top-14",
    "away_team_name": "Clermont",
    "away_team_score": "11",
    "raw_gamedate": "Samedi 03 D\u00e9cembre 2005",
    "raw_gametime": null
}