{
    "home_team_url": "https://www.lnr.fr/rugby-top-14/club-rugby/toulon-rugby-top-14",
    "home_team_name": "Toulon",
    "home_team_score": "16",
    "away_team_url": "https://www.lnr.fr/rugby-top-14/club-rugby/racing-92-rugby-top-14",
    "away_team_name": "Racing 92",
    "away_team_score": "6",
    "raw_gamedate": "Vendredi 16 Mai 2014",
    "raw_gametime": "20h45"
}