{
    "home_team_url": "https://www.lnr.fr/rugby-top-14/club-rugby/toulon-rugby-top-14",
    "home_team_name": "Toulon",
    "home_team_score": "3",
    "away_team_url": "https://www.lnr.fr/rugby-top-14/club-rugby/racing-92-rugby-top-14",
    "away_team_name": "Racing 92",
    "away_team_score": "3",
    "raw_gamedate": "Dimanche 01 Janvier 2017",
    "raw_gametime": "20h45"
}