{
    "home_team_url": "https://www.lnr.fr/rugby-top-14/club-rugby/clermont-rugby-top-14",
    "home_team_name": "Clermont",
    "home_team_score": "41",
    "away_team_url": "https://www.lnr.fr/rugby-pro-d2/club-rugby/biarritz-rugby-pro-d2",
    "away_team_name": "Biarritz",
    "away_team_score": "0",
    "raw_gamedate": "Samedi 29 Octobre 2011",
    "raw_gametime": "14h15"
}