{
    "home_team_url": "https://www.lnr.fr/rugby-top-14/club-rugby/lyon-rugby-top-14",
    "home_team_name": "Lyon",
    "home_team_score": "16",
    "away_team_url": "https://www.lnr.fr/rugby-top-14/club-rugby/clermont-rugby-top-14",
    "away_team_name": "Clermont",
    "away_team_score": "13",
    "raw_gamedate": "Dimanche 28 D\u00e9cembre 2014",
    "raw_gametime": "19h00"
}