{
    "home_team_url": "https://www.lnr.fr/rugby-top-14/club-rugby/bordeaux-begles-rugby-top-14",
    "home_team_name": "Bordeaux-B\u00e8gles",
    "home_team_score": "59",
    "away_team_url": "https://www.lnr.fr/rugby-top-14/club-rugby/castres-rugby-top-14",
    "away_team_name": "Castres",
    "away_team_score": "7",
    "raw_gamedate": "Samedi 11 Octobre 2014",
    "raw_gametime": "14h35"
}