{
    "home_team_url": "https://www.lnr.fr/rugby-pro-d2/club-rugby/montauban-rugby-pro-d2",
    "home_team_name": "Montauban",
    "home_team_score": "6",
    "away_team_url": "https://www.lnr.fr/rugby-top-14/club-rugby/montpellier-rugby-top-14",
    "away_team_name": "Montpellier",
    "away_team_score": "19",
    "raw_gamedate": "Samedi 17 Avril 2010",
    "raw_gametime": "14h30"
}