{
    "home_team_url": "https://www.lnr.fr/rugby-pro-d2/club-rugby/biarritz-rugby-pro-d2",
    "home_team_name": "Biarritz",
    "home_team_score": "57",
    "away_team_url": "https://www.lnr.fr/rugby-top-14/club-rugby/montpellier-rugby-top-14",
    "away_team_name": "Montpellier",
    "away_team_score": "7",
    "raw_gamedate": "Vendredi 12 Mai 2006",
    "raw_gametime": null
}