{
    "home_team_url": "https://www.lnr.fr/rugby-top-14/club-rugby/clermont-rugby-top-14",
    "home_team_name": "Clermont",
    "home_team_score": "48",
    "away_team_url": "https://www.lnr.fr/rugby-pro-d2/club-rugby/bayonne-rugby-pro-d2",
    "away_team_name": "Bayonne",
    "away_team_score": "3",
    "raw_gamedate": "Dimanche 30 D\u00e9cembre 2012",
    "raw_gametime": "15h00"
}