{
    "home_team_url": "https://www.lnr.fr/rugby-top-14/club-rugby/toulouse-rugby-top-14",
    "home_team_name": "Toulouse",
    "home_team_score": "20",
    "away_team_url": "https://www.lnr.fr/rugby-top-14/club-rugby/lyon-rugby-top-14",
    "away_team_name": "Lyon",
    "away_team_score": "27",
    "raw_gamedate": "Dimanche 11 Mars 2018",
    "raw_gametime": "16h50"
}