{
    "home_team_url": "https://www.lnr.fr/rugby-pro-d2/club-rugby/brive-rugby-pro-d2",
    "home_team_name": "Brive",
    "home_team_score": "3",
    "away_team_url": "https://www.lnr.fr/rugby-top-14/club-rugby/agen-rugby-top-14",
    "away_team_name": "Agen",
    "away_team_score": "3",
    "raw_gamedate": "Samedi 24 Mars 2018",
    "raw_gametime": "18h45"
}