{
    "home_team_url": "https://www.lnr.fr/rugby-pro-d2/club-rugby/brive-rugby-pro-d2",
    "home_team_name": "Brive",
    "home_team_score": "53",
    "away_team_url": "https://www.lnr.fr/rugby-pro-d2/club-rugby/mont-de-marsan-rugby-pro-d2",
    "away_team_name": "Mont-de-Marsan",
    "away_team_score": "11",
    "raw_gamedate": "Samedi 04 Octobre 2008",
    "raw_gametime": "14h30"
}