{
    "home_team_url": "https://www.lnr.fr/rugby-top-14/club-rugby/toulon-rugby-top-14",
    "home_team_name": "Toulon",
    "home_team_score": "50",
    "away_team_url": "https://www.lnr.fr/rugby-pro-d2/club-rugby/biarritz-rugby-pro-d2",
    "away_team_name": "Biarritz",
    "away_team_score": "15",
    "raw_gamedate": "Samedi 09 Mars 2013",
    "raw_gametime": "15h00"
}