{
    "home_team_url": "https://www.lnr.fr/rugby-top-14/club-rugby/castres-rugby-top-14",
    "home_team_name": "Castres",
    "home_team_score": "17",
    "away_team_url": "https://www.lnr.fr/rugby-top-14/club-rugby/montpellier-rugby-top-14",
    "away_team_name": "Montpellier",
    "away_team_score": "18",
    "raw_gamedate": "Samedi 14 Mai 2011",
    "raw_gametime": "16h25"
}