{
    "home_team_url": "https://www.lnr.fr/rugby-top-14/club-rugby/toulouse-rugby-top-14",
    "home_team_name": "Toulouse",
    "home_team_score": "21",
    "away_team_url": "https://www.lnr.fr/rugby-top-14/club-rugby/agen-rugby-top-14",
    "away_team_name": "Agen",
    "away_team_score": "10",
    "raw_gamedate": "Samedi 18 F\u00e9vrier 2012",
    "raw_gametime": "14h15"
}