{
    "home_team_url": "https://www.lnr.fr/rugby-pro-d2/club-rugby/brive-rugby-pro-d2",
    "home_team_name": "Brive",
    "home_team_score": "27",
    "away_team_url": "https://www.lnr.fr/rugby-top-14/club-rugby/paris-rugby-top-14",
    "away_team_name": "Paris",
    "away_team_score": "0",
    "raw_gamedate": "Samedi 23 Mai 2015",
    "raw_gametime": "16h15"
}