{
    "home_team_url": "https://www.lnr.fr/rugby-top-14/club-rugby/racing-92-rugby-top-14",
    "home_team_name": "Racing 92",
    "home_team_score": "17",
    "away_team_url": "https://www.lnr.fr/rugby-pro-d2/club-rugby/oyonnax-rugby-pro-d2",
    "away_team_name": "Oyonnax",
    "away_team_score": "21",
    "raw_gamedate": "Samedi 01 Novembre 2014",
    "raw_gametime": "18h30"
}