{
    "home_team_url": "https://www.lnr.fr/rugby-top-14/club-rugby/montpellier-rugby-top-14",
    "home_team_name": "Montpellier",
    "home_team_score": "35",
    "away_team_url": "https://www.lnr.fr/rugby-pro-d2/club-rugby/oyonnax-rugby-pro-d2",
    "away_team_name": "Oyonnax",
    "away_team_score": "19",
    "raw_gamedate": "Samedi 22 Ao\u00fbt 2015",
    "raw_gametime": "18h30"
}