{
    "home_team_url": "https://www.lnr.fr/rugby-top-14/club-rugby/toulouse-rugby-top-14",
    "home_team_name": "Toulouse",
    "home_team_score": "28",
    "away_team_url": "https://www.lnr.fr/rugby-top-14/club-rugby/racing-92-rugby-top-14",
    "away_team_name": "Racing 92",
    "away_team_score": "23",
    "raw_gamedate": "Samedi 02 Octobre 2010",
    "raw_gametime": "16h25"
}