{
    "home_team_url": "https://www.lnr.fr/rugby-top-14/club-rugby/toulon-rugby-top-14",
    "home_team_name": "Toulon",
    "home_team_score": "59",
    "away_team_url": "https://www.lnr.fr/rugby-pro-d2/club-rugby/bayonne-rugby-pro-d2",
    "away_team_name": "Bayonne",
    "away_team_score": "0",
    "raw_gamedate": "Samedi 27 Octobre 2012",
    "raw_gametime": "18h30"
}