{
    "home_team_url": "https://www.lnr.fr/rugby-top-14/club-rugby/castres-rugby-top-14",
    "home_team_name": "Castres",
    "home_team_score": "38",
    "away_team_url": "https://www.lnr.fr/rugby-top-14/club-rugby/paris-rugby-top-14",
    "away_team_name": "Paris",
    "away_team_score": "10",
    "raw_gamedate": "Mercredi 04 Septembre 2013",
    "raw_gametime": "18h45"
}