{
    "home_team_url": "https://www.lnr.fr/rugby-pro-d2/club-rugby/montauban-rugby-pro-d2",
    "home_team_name": "Montauban",
    "home_team_score": "6",
    "away_team_url": "https://www.lnr.fr/rugby-top-14/club-rugby/perpignan-rugby-top-14",
    "away_team_name": "Perpignan",
    "away_team_score": "9",
    "raw_gamedate": "Samedi 29 Novembre 2008",
    "raw_gametime": "14h30"
}