{
    "home_team_url": "https://www.lnr.fr/rugby-top-14/club-rugby/grenoble-rugby-top-14",
    "home_team_name": "Grenoble",
    "home_team_score": "27",
    "away_team_url": "https://www.lnr.fr/rugby-top-14/club-rugby/agen-rugby-top-14",
    "away_team_name": "Agen",
    "away_team_score": "13",
    "raw_gamedate": "Samedi 16 F\u00e9vrier 2013",
    "raw_gametime": "18h30"
}