{
    "home_team_url": "https://www.lnr.fr/rugby-pro-d2/club-rugby/bayonne-rugby-pro-d2",
    "home_team_name": "Bayonne",
    "home_team_score": "22",
    "away_team_url": "https://www.lnr.fr/rugby-top-14/club-rugby/lyon-rugby-top-14",
    "away_team_name": "Lyon",
    "away_team_score": "22",
    "raw_gamedate": "Samedi 01 Octobre 2016",
    "raw_gametime": "18h30"
}