{
    "home_team_url": "https://www.lnr.fr/rugby-top-14/club-rugby/toulouse-rugby-top-14",
    "home_team_name": "Toulouse",
    "home_team_score": "37",
    "away_team_url": "https://www.lnr.fr/rugby-pro-d2/club-rugby/mont-de-marsan-rugby-pro-d2",
    "away_team_name": "Mont-de-Marsan",
    "away_team_score": "22",
    "raw_gamedate": "Samedi 25 Ao\u00fbt 2012",
    "raw_gametime": "18h30"
}