{
    "home_team_url": "https://www.lnr.fr/rugby-top-14/club-rugby/racing-92-rugby-top-14",
    "home_team_name": "Racing 92",
    "home_team_score": "51",
    "away_team_url": "https://www.lnr.fr/club-rugby/bourgoin",
    "away_team_name": "Bourgoin",
    "away_team_score": "20",
    "raw_gamedate": "Samedi 18 Septembre 2010",
    "raw_gametime": "14h30"
}