{
    "home_team_url": "https://www.lnr.fr/rugby-top-14/club-rugby/bordeaux-begles-rugby-top-14",
    "home_team_name": "Bordeaux-B\u00e8gles",
    "home_team_score": "24",
    "away_team_url": "https://www.lnr.fr/rugby-top-14/club-rugby/agen-rugby-top-14",
    "away_team_name": "Agen",
    "away_team_score": "19",
    "raw_gamedate": "Samedi 20 F\u00e9vrier 2016",
    "raw_gametime": "18h30"
}