{
    "home_team_url": "https://www.lnr.fr/rugby-top-14/club-rugby/racing-92-rugby-top-14",
    "home_team_name": "Racing 92",
    "home_team_score": "58",
    "away_team_url": "https://www.lnr.fr/rugby-top-14/club-rugby/clermont-rugby-top-14",
    "away_team_name": "Clermont",
    "away_team_score": "6",
    "raw_gamedate": "Dimanche 07 Janvier 2018",
    "raw_gametime": "21h00"
}