{
    "home_team_url": "https://www.lnr.fr/rugby-top-14/club-rugby/montpellier-rugby-top-14",
    "home_team_name": "Montpellier",
    "home_team_score": "29",
    "away_team_url": "https://www.lnr.fr/rugby-top-14/club-rugby/clermont-rugby-top-14",
    "away_team_name": "Clermont",
    "away_team_score": "9",
    "raw_gamedate": "Samedi 12 F\u00e9vrier 2011",
    "raw_gametime": "14h00"
}