{
    "home_team_url": "https://www.lnr.fr/rugby-top-14/club-rugby/castres-rugby-top-14",
    "home_team_name": "Castres",
    "home_team_score": "11",
    "away_team_url": "https://www.lnr.fr/rugby-top-14/club-rugby/perpignan-rugby-top-14",
    "away_team_name": "Perpignan",
    "away_team_score": "17",
    "raw_gamedate": "Samedi 03 Avril 2010",
    "raw_gametime": "20h45"
}