{
    "home_team_url": "https://www.lnr.fr/rugby-top-14/club-rugby/bordeaux-begles-rugby-top-14",
    "home_team_name": "Bordeaux-B\u00e8gles",
    "home_team_score": "30",
    "away_team_url": "https://www.lnr.fr/rugby-top-14/club-rugby/paris-rugby-top-14",
    "away_team_name": "Paris",
    "away_team_score": "22",
    "raw_gamedate": "Samedi 15 Septembre 2012",
    "raw_gametime": "20h40"
}