{
    "home_team_url": "https://www.lnr.fr/rugby-top-14/club-rugby/toulon-rugby-top-14",
    "home_team_name": "Toulon",
    "home_team_score": "22",
    "away_team_url": "https://www.lnr.fr/rugby-top-14/club-rugby/clermont-rugby-top-14",
    "away_team_name": "Clermont",
    "away_team_score": "16",
    "raw_gamedate": "Mardi 26 Ao\u00fbt 2008",
    "raw_gametime": "21h00"
}