{
    "home_team_url": "https://www.lnr.fr/rugby-top-14/club-rugby/paris-rugby-top-14",
    "home_team_name": "Paris",
    "home_team_score": "42",
    "away_team_url": "https://www.lnr.fr/rugby-pro-d2/club-rugby/mont-de-marsan-rugby-pro-d2",
    "away_team_name": "Mont-de-Marsan",
    "away_team_score": "14",
    "raw_gamedate": "Samedi 09 Mars 2013",
    "raw_gametime": "15h00"
}