{
    "home_team_url": "https://www.lnr.fr/rugby-top-14/club-rugby/lyon-rugby-top-14",
    "home_team_name": "Lyon",
    "home_team_score": "19",
    "away_team_url": "https://www.lnr.fr/rugby-top-14/club-rugby/agen-rugby-top-14",
    "away_team_name": "Agen",
    "away_team_score": "11",
    "raw_gamedate": "Samedi 28 Janvier 2012",
    "raw_gametime": "14h15"
}