{
    "home_team_url": "https://www.lnr.fr/rugby-top-14/club-rugby/toulouse-rugby-top-14",
    "home_team_name": "Toulouse",
    "home_team_score": "44",
    "away_team_url": "https://www.lnr.fr/rugby-top-14/club-rugby/toulon-rugby-top-14",
    "away_team_name": "Toulon",
    "away_team_score": "5",
    "raw_gamedate": "Samedi 30 Octobre 2010",
    "raw_gametime": "16h25"
}