{
    "home_team_url": "https://www.lnr.fr/rugby-top-14/club-rugby/la-rochelle-rugby-top-14",
    "home_team_name": "La Rochelle",
    "home_team_score": "26",
    "away_team_url": "https://www.lnr.fr/rugby-top-14/club-rugby/bordeaux-begles-rugby-top-14",
    "away_team_name": "Bordeaux-B\u00e8gles",
    "away_team_score": "29",
    "raw_gamedate": "Samedi 20 Septembre 2014",
    "raw_gametime": "18h30"
}