{
    "home_team_url": "https://www.lnr.fr/rugby-top-14/club-rugby/toulon-rugby-top-14",
    "home_team_name": "Toulon",
    "home_team_score": "45",
    "away_team_url": "https://www.lnr.fr/rugby-top-14/club-rugby/la-rochelle-rugby-top-14",
    "away_team_name": "La Rochelle",
    "away_team_score": "24",
    "raw_gamedate": "Samedi 12 Septembre 2015",
    "raw_gametime": "14h45"
}