{
    "home_team_url": "https://www.lnr.fr/rugby-top-14/club-rugby/grenoble-rugby-top-14",
    "home_team_name": "Grenoble",
    "home_team_score": "19",
    "away_team_url": "https://www.lnr.fr/rugby-top-14/club-rugby/la-rochelle-rugby-top-14",
    "away_team_name": "La Rochelle",
    "away_team_score": "22",
    "raw_gamedate": "Samedi 27 Ao\u00fbt 2016",
    "raw_gametime": "18h30"
}