{
    "home_team_url": "https://www.lnr.fr/rugby-top-14/club-rugby/castres-rugby-top-14",
    "home_team_name": "Castres",
    "home_team_score": "38",
    "away_team_url": "https://www.lnr.fr/rugby-pro-d2/club-rugby/brive-rugby-pro-d2",
    "away_team_name": "Brive",
    "away_team_score": "6",
    "raw_gamedate": "Samedi 22 Mars 2014",
    "raw_gametime": "18h30"
}