{
    "home_team_url": "https://www.lnr.fr/rugby-top-14/club-rugby/perpignan-rugby-top-14",
    "home_team_name": "Perpignan",
    "home_team_score": "44",
    "away_team_url": "https://www.lnr.fr/rugby-top-14/club-rugby/paris-rugby-top-14",
    "away_team_name": "Paris",
    "away_team_score": "23",
    "raw_gamedate": "Samedi 27 Mars 2010",
    "raw_gametime": "14h30"
}