{
    "home_team_url": "https://www.lnr.fr/rugby-top-14/club-rugby/grenoble-rugby-top-14",
    "home_team_name": "Grenoble",
    "home_team_score": "34",
    "away_team_url": "https://www.lnr.fr/rugby-top-14/club-rugby/lyon-rugby-top-14",
    "away_team_name": "Lyon",
    "away_team_score": "30",
    "raw_gamedate": "Samedi 08 Novembre 2014",
    "raw_gametime": "20h00"
}