{
    "home_team_url": "https://www.lnr.fr/club-rugby/bourgoin",
    "home_team_name": "Bourgoin",
    "home_team_score": "31",
    "away_team_url": "https://www.lnr.fr/rugby-top-14/club-rugby/castres-rugby-top-14",
    "away_team_name": "Castres",
    "away_team_score": "23",
    "raw_gamedate": "Samedi 09 Mai 2009",
    "raw_gametime": "14h30"
}