{
    "home_team_url": "https://www.lnr.fr/rugby-top-14/club-rugby/toulouse-rugby-top-14",
    "home_team_name": "Toulouse",
    "home_team_score": "22",
    "away_team_url": "https://www.lnr.fr/rugby-top-14/club-rugby/grenoble-rugby-top-14",
    "away_team_name": "Grenoble",
    "away_team_score": "25",
    "raw_gamedate": "Samedi 29 Novembre 2014",
    "raw_gametime": "20h45"
}