{
    "home_team_url": "https://www.lnr.fr/rugby-top-14/club-rugby/montpellier-rugby-top-14",
    "home_team_name": "Montpellier",
    "home_team_score": "17",
    "away_team_url": "https://www.lnr.fr/rugby-top-14/club-rugby/toulouse-rugby-top-14",
    "away_team_name": "Toulouse",
    "away_team_score": "15",
    "raw_gamedate": "Dimanche 11 Mai 2008",
    "raw_gametime": "19h00"
}