{
    "home_team_url": "https://www.lnr.fr/club-rugby/albi",
    "home_team_name": "Albi",
    "home_team_score": "38",
    "away_team_url": "https://www.lnr.fr/rugby-top-14/club-rugby/paris-rugby-top-14",
    "away_team_name": "Paris",
    "away_team_score": "24",
    "raw_gamedate": "Samedi 17 Avril 2010",
    "raw_gametime": "14h30"
}