{
    "home_team_url": "https://www.lnr.fr/rugby-top-14/club-rugby/clermont-rugby-top-14",
    "home_team_name": "Clermont",
    "home_team_score": "40",
    "away_team_url": "https://www.lnr.fr/rugby-top-14/club-rugby/bordeaux-begles-rugby-top-14",
    "away_team_name": "Bordeaux-B\u00e8gles",
    "away_team_score": "11",
    "raw_gamedate": "Dimanche 29 Septembre 2013",
    "raw_gametime": "12h30"
}