{
    "home_team_url": "https://www.lnr.fr/rugby-top-14/club-rugby/racing-92-rugby-top-14",
    "home_team_name": "Racing 92",
    "home_team_score": "17",
    "away_team_url": "https://www.lnr.fr/rugby-top-14/club-rugby/lyon-rugby-top-14",
    "away_team_name": "Lyon",
    "away_team_score": "20",
    "raw_gamedate": "Samedi 30 Septembre 2017",
    "raw_gametime": "20h45"
}