{
    "home_team_url": "https://www.lnr.fr/rugby-top-14/club-rugby/castres-rugby-top-14",
    "home_team_name": "Castres",
    "home_team_score": "17",
    "away_team_url": "https://www.lnr.fr/rugby-pro-d2/club-rugby/oyonnax-rugby-pro-d2",
    "away_team_name": "Oyonnax",
    "away_team_score": "16",
    "raw_gamedate": "Samedi 08 F\u00e9vrier 2014",
    "raw_gametime": "18h30"
}