{
    "home_team_url": "https://www.lnr.fr/rugby-pro-d2/club-rugby/brive-rugby-pro-d2",
    "home_team_name": "Brive",
    "home_team_score": "19",
    "away_team_url": "https://www.lnr.fr/rugby-pro-d2/club-rugby/oyonnax-rugby-pro-d2",
    "away_team_name": "Oyonnax",
    "away_team_score": "17",
    "raw_gamedate": "Samedi 03 Mai 2014",
    "raw_gametime": "14h45"
}