{
    "home_team_url": "https://www.lnr.fr/rugby-top-14/club-rugby/clermont-rugby-top-14",
    "home_team_name": "Clermont",
    "home_team_score": "31",
    "away_team_url": "https://www.lnr.fr/rugby-top-14/club-rugby/racing-92-rugby-top-14",
    "away_team_name": "Racing 92",
    "away_team_score": "13",
    "raw_gamedate": "Samedi 11 F\u00e9vrier 2012",
    "raw_gametime": "14h30"
}