{
    "home_team_url": "https://www.lnr.fr/rugby-top-14/club-rugby/perpignan-rugby-top-14",
    "home_team_name": "Perpignan",
    "home_team_score": "47",
    "away_team_url": "https://www.lnr.fr/rugby-pro-d2/club-rugby/bayonne-rugby-pro-d2",
    "away_team_name": "Bayonne",
    "away_team_score": "9",
    "raw_gamedate": "Samedi 31 Mars 2012",
    "raw_gametime": "14h15"
}