{
    "home_team_url": "https://www.lnr.fr/rugby-pro-d2/club-rugby/oyonnax-rugby-pro-d2",
    "home_team_name": "Oyonnax",
    "home_team_score": "24",
    "away_team_url": "https://www.lnr.fr/rugby-pro-d2/club-rugby/biarritz-rugby-pro-d2",
    "away_team_name": "Biarritz",
    "away_team_score": "22",
    "raw_gamedate": "Mercredi 04 Septembre 2013",
    "raw_gametime": "19h00"
}