{
    "home_team_url": "https://www.lnr.fr/rugby-top-14/club-rugby/toulouse-rugby-top-14",
    "home_team_name": "Toulouse",
    "home_team_score": "12",
    "away_team_url": "https://www.lnr.fr/rugby-top-14/club-rugby/montpellier-rugby-top-14",
    "away_team_name": "Montpellier",
    "away_team_score": "15",
    "raw_gamedate": "Samedi 08 F\u00e9vrier 2014",
    "raw_gametime": "20h35"
}