{
    "home_team_url": "https://www.lnr.fr/rugby-top-14/club-rugby/clermont-rugby-top-14",
    "home_team_name": "Clermont",
    "home_team_score": "22",
    "away_team_url": "https://www.lnr.fr/rugby-top-14/club-rugby/toulon-rugby-top-14",
    "away_team_name": "Toulon",
    "away_team_score": "16",
    "raw_gamedate": "Dimanche 04 Juin 2017",
    "raw_gametime": "20h45"
}