{
    "home_team_url": "https://www.lnr.fr/rugby-pro-d2/club-rugby/biarritz-rugby-pro-d2",
    "home_team_name": "Biarritz",
    "home_team_score": "15",
    "away_team_url": "https://www.lnr.fr/rugby-top-14/club-rugby/bordeaux-begles-rugby-top-14",
    "away_team_name": "Bordeaux-B\u00e8gles",
    "away_team_score": "22",
    "raw_gamedate": "Samedi 30 Novembre 2013",
    "raw_gametime": "18h30"
}