{
    "home_team_url": "https://www.lnr.fr/rugby-pro-d2/club-rugby/oyonnax-rugby-pro-d2",
    "home_team_name": "Oyonnax",
    "home_team_score": "40",
    "away_team_url": "https://www.lnr.fr/rugby-top-14/club-rugby/grenoble-rugby-top-14",
    "away_team_name": "Grenoble",
    "away_team_score": "27",
    "raw_gamedate": "Samedi 13 Septembre 2014",
    "raw_gametime": "18h30"
}