{
    "home_team_url": "https://www.lnr.fr/rugby-top-14/club-rugby/clermont-rugby-top-14",
    "home_team_name": "Clermont",
    "home_team_score": "55",
    "away_team_url": "https://www.lnr.fr/rugby-pro-d2/club-rugby/bayonne-rugby-pro-d2",
    "away_team_name": "Bayonne",
    "away_team_score": "0",
    "raw_gamedate": "Mercredi 04 Septembre 2013",
    "raw_gametime": "19h00"
}