{
    "home_team_url": "https://www.lnr.fr/rugby-top-14/club-rugby/toulouse-rugby-top-14",
    "home_team_name": "Toulouse",
    "home_team_score": "25",
    "away_team_url": "https://www.lnr.fr/club-rugby/bourgoin",
    "away_team_name": "Bourgoin",
    "away_team_score": "15",
    "raw_gamedate": "Vendredi 10 Novembre 2006",
    "raw_gametime": null
}