{
    "home_team_url": "https://www.lnr.fr/rugby-top-14/club-rugby/paris-rugby-top-14",
    "home_team_name": "Paris",
    "home_team_score": "22",
    "away_team_url": "https://www.lnr.fr/rugby-top-14/club-rugby/toulon-rugby-top-14",
    "away_team_name": "Toulon",
    "away_team_score": "15",
    "raw_gamedate": "Samedi 23 Octobre 2010",
    "raw_gametime": "16h25"
}