{
    "home_team_url": "https://www.lnr.fr/rugby-top-14/club-rugby/bordeaux-begles-rugby-top-14",
    "home_team_name": "Bordeaux-B\u00e8gles",
    "home_team_score": "33",
    "away_team_url": "https://www.lnr.fr/rugby-top-14/club-rugby/agen-rugby-top-14",
    "away_team_name": "Agen",
    "away_team_score": "23",
    "raw_gamedate": "Samedi 18 Novembre 2017",
    "raw_gametime": "18h00"
}