{
    "home_team_url": "https://www.lnr.fr/rugby-top-14/club-rugby/toulouse-rugby-top-14",
    "home_team_name": "Toulouse",
    "home_team_score": "33",
    "away_team_url": "https://www.lnr.fr/club-rugby/bourgoin",
    "away_team_name": "Bourgoin",
    "away_team_score": "0",
    "raw_gamedate": "Samedi 23 Avril 2011",
    "raw_gametime": "14h30"
}