{
    "home_team_url": "https://www.lnr.fr/rugby-top-14/club-rugby/la-rochelle-rugby-top-14",
    "home_team_name": "La Rochelle",
    "home_team_score": "37",
    "away_team_url": "https://www.lnr.fr/rugby-top-14/club-rugby/paris-rugby-top-14",
    "away_team_name": "Paris",
    "away_team_score": "18",
    "raw_gamedate": "Samedi 18 F\u00e9vrier 2017",
    "raw_gametime": "14h45"
}