{
    "home_team_url": "https://www.lnr.fr/rugby-top-14/club-rugby/toulon-rugby-top-14",
    "home_team_name": "Toulon",
    "home_team_score": "43",
    "away_team_url": "https://www.lnr.fr/rugby-top-14/club-rugby/perpignan-rugby-top-14",
    "away_team_name": "Perpignan",
    "away_team_score": "12",
    "raw_gamedate": "Samedi 23 Avril 2011",
    "raw_gametime": "16h25"
}