{
    "home_team_url": "https://www.lnr.fr/rugby-pro-d2/club-rugby/mont-de-marsan-rugby-pro-d2",
    "home_team_name": "Mont-de-Marsan",
    "home_team_score": "33",
    "away_team_url": "https://www.lnr.fr/rugby-pro-d2/club-rugby/bayonne-rugby-pro-d2",
    "away_team_name": "Bayonne",
    "away_team_score": "36",
    "raw_gamedate": "Samedi 04 Mai 2013",
    "raw_gametime": "14h45"
}