{
    "home_team_url": "https://www.lnr.fr/rugby-top-14/club-rugby/grenoble-rugby-top-14",
    "home_team_name": "Grenoble",
    "home_team_score": "21",
    "away_team_url": "https://www.lnr.fr/rugby-pro-d2/club-rugby/bayonne-rugby-pro-d2",
    "away_team_name": "Bayonne",
    "away_team_score": "21",
    "raw_gamedate": "Samedi 19 Avril 2014",
    "raw_gametime": "18h30"
}