{
    "home_team_url": "https://www.lnr.fr/rugby-pro-d2/club-rugby/brive-rugby-pro-d2",
    "home_team_name": "Brive",
    "home_team_score": "6",
    "away_team_url": "https://www.lnr.fr/rugby-top-14/club-rugby/clermont-rugby-top-14",
    "away_team_name": "Clermont",
    "away_team_score": "9",
    "raw_gamedate": "Vendredi 23 D\u00e9cembre 2011",
    "raw_gametime": "19h00"
}