{
    "home_team_url": "https://www.lnr.fr/rugby-top-14/club-rugby/racing-92-rugby-top-14",
    "home_team_name": "Racing 92",
    "home_team_score": "29",
    "away_team_url": "https://www.lnr.fr/rugby-top-14/club-rugby/grenoble-rugby-top-14",
    "away_team_name": "Grenoble",
    "away_team_score": "24",
    "raw_gamedate": "Samedi 19 Novembre 2016",
    "raw_gametime": "17h00"
}