{
    "home_team_url": "https://www.lnr.fr/rugby-top-14/club-rugby/toulon-rugby-top-14",
    "home_team_name": "Toulon",
    "home_team_score": "18",
    "away_team_url": "https://www.lnr.fr/rugby-top-14/club-rugby/bordeaux-begles-rugby-top-14",
    "away_team_name": "Bordeaux-B\u00e8gles",
    "away_team_score": "13",
    "raw_gamedate": "Samedi 06 Septembre 2014",
    "raw_gametime": "20h45"
}