{
    "home_team_url": "https://www.lnr.fr/rugby-pro-d2/club-rugby/oyonnax-rugby-pro-d2",
    "home_team_name": "Oyonnax",
    "home_team_score": "19",
    "away_team_url": "https://www.lnr.fr/rugby-top-14/club-rugby/castres-rugby-top-14",
    "away_team_name": "Castres",
    "away_team_score": "32",
    "raw_gamedate": "Samedi 04 Novembre 2017",
    "raw_gametime": "18h30"
}