{
    "home_team_url": "https://www.lnr.fr/rugby-top-14/club-rugby/toulon-rugby-top-14",
    "home_team_name": "Toulon",
    "home_team_score": "28",
    "away_team_url": "https://www.lnr.fr/rugby-top-14/club-rugby/montpellier-rugby-top-14",
    "away_team_name": "Montpellier",
    "away_team_score": "6",
    "raw_gamedate": "Dimanche 02 Octobre 2016",
    "raw_gametime": "16h15"
}