{
    "home_team_url": "https://www.lnr.fr/rugby-pro-d2/club-rugby/biarritz-rugby-pro-d2",
    "home_team_name": "Biarritz",
    "home_team_score": "24",
    "away_team_url": "https://www.lnr.fr/rugby-pro-d2/club-rugby/brive-rugby-pro-d2",
    "away_team_name": "Brive",
    "away_team_score": "5",
    "raw_gamedate": "Samedi 13 Septembre 2008",
    "raw_gametime": "20h30"
}