{
    "home_team_url": "https://www.lnr.fr/rugby-top-14/club-rugby/clermont-rugby-top-14",
    "home_team_name": "Clermont",
    "home_team_score": "28",
    "away_team_url": "https://www.lnr.fr/rugby-top-14/club-rugby/toulouse-rugby-top-14",
    "away_team_name": "Toulouse",
    "away_team_score": "22",
    "raw_gamedate": "Vendredi 18 Novembre 2005",
    "raw_gametime": null
}