{
    "home_team_url": "https://www.lnr.fr/rugby-top-14/club-rugby/racing-92-rugby-top-14",
    "home_team_name": "Racing 92",
    "home_team_score": "22",
    "away_team_url": "https://www.lnr.fr/rugby-top-14/club-rugby/bordeaux-begles-rugby-top-14",
    "away_team_name": "Bordeaux-B\u00e8gles",
    "away_team_score": "13",
    "raw_gamedate": "Vendredi 09 Mars 2012",
    "raw_gametime": "20h45"
}