{
    "home_team_url": "https://www.lnr.fr/rugby-top-14/club-rugby/toulouse-rugby-top-14",
    "home_team_name": "Toulouse",
    "home_team_score": "22",
    "away_team_url": "https://www.lnr.fr/rugby-top-14/club-rugby/montpellier-rugby-top-14",
    "away_team_name": "Montpellier",
    "away_team_score": "14",
    "raw_gamedate": "Dimanche 18 Mars 2018",
    "raw_gametime": "16h50"
}