{
    "home_team_url": "https://www.lnr.fr/rugby-top-14/club-rugby/grenoble-rugby-top-14",
    "home_team_name": "Grenoble",
    "home_team_score": "36",
    "away_team_url": "https://www.lnr.fr/rugby-pro-d2/club-rugby/brive-rugby-pro-d2",
    "away_team_name": "Brive",
    "away_team_score": "23",
    "raw_gamedate": "Dimanche 11 Septembre 2016",
    "raw_gametime": "12h30"
}