{
    "home_team_url": "https://www.lnr.fr/rugby-pro-d2/club-rugby/brive-rugby-pro-d2",
    "home_team_name": "Brive",
    "home_team_score": "25",
    "away_team_url": "https://www.lnr.fr/club-rugby/bourgoin",
    "away_team_name": "Bourgoin",
    "away_team_score": "15",
    "raw_gamedate": "Samedi 03 Avril 2010",
    "raw_gametime": "14h30"
}