{
    "home_team_url": "https://www.lnr.fr/rugby-top-14/club-rugby/toulouse-rugby-top-14",
    "home_team_name": "Toulouse",
    "home_team_score": "26",
    "away_team_url": "https://www.lnr.fr/rugby-top-14/club-rugby/castres-rugby-top-14",
    "away_team_name": "Castres",
    "away_team_score": "11",
    "raw_gamedate": "Samedi 14 Mars 2009",
    "raw_gametime": "14h15"
}