{
    "home_team_url": "https://www.lnr.fr/rugby-top-14/club-rugby/perpignan-rugby-top-14",
    "home_team_name": "Perpignan",
    "home_team_score": "0",
    "away_team_url": "https://www.lnr.fr/club-rugby/bourgoin",
    "away_team_name": "Bourgoin",
    "away_team_score": "0",
    "raw_gamedate": "Mercredi 18 Ao\u00fbt 2004",
    "raw_gametime": "19h00"
}