{
    "home_team_url": "https://www.lnr.fr/rugby-top-14/club-rugby/paris-rugby-top-14",
    "home_team_name": "Paris",
    "home_team_score": "5",
    "away_team_url": "https://www.lnr.fr/rugby-top-14/club-rugby/pau-rugby-top-14",
    "away_team_name": "Pau",
    "away_team_score": "40",
    "raw_gamedate": "Dimanche 28 Janvier 2018",
    "raw_gametime": "12h30"
}