{
    "home_team_url": "https://www.lnr.fr/rugby-top-14/club-rugby/montpellier-rugby-top-14",
    "home_team_name": "Montpellier",
    "home_team_score": "19",
    "away_team_url": "https://www.lnr.fr/rugby-top-14/club-rugby/castres-rugby-top-14",
    "away_team_name": "Castres",
    "away_team_score": "22",
    "raw_gamedate": "Samedi 17 Mai 2014",
    "raw_gametime": "16h30"
}