{
    "home_team_url": "https://www.lnr.fr/rugby-pro-d2/club-rugby/biarritz-rugby-pro-d2",
    "home_team_name": "Biarritz",
    "home_team_score": "34",
    "away_team_url": "https://www.lnr.fr/rugby-top-14/club-rugby/castres-rugby-top-14",
    "away_team_name": "Castres",
    "away_team_score": "34",
    "raw_gamedate": "Samedi 29 Mars 2014",
    "raw_gametime": "18h30"
}