{
    "home_team_url": "https://www.lnr.fr/rugby-top-14/club-rugby/lyon-rugby-top-14",
    "home_team_name": "Lyon",
    "home_team_score": "15",
    "away_team_url": "https://www.lnr.fr/rugby-top-14/club-rugby/toulon-rugby-top-14",
    "away_team_name": "Toulon",
    "away_team_score": "6",
    "raw_gamedate": "Samedi 03 Mars 2018",
    "raw_gametime": "14h45"
}