{
    "home_team_url": "https://www.lnr.fr/rugby-top-14/club-rugby/agen-rugby-top-14",
    "home_team_name": "Agen",
    "home_team_score": "26",
    "away_team_url": "https://www.lnr.fr/rugby-top-14/club-rugby/pau-rugby-top-14",
    "away_team_name": "Pau",
    "away_team_score": "33",
    "raw_gamedate": "Samedi 02 Avril 2016",
    "raw_gametime": "18h30"
}