{
    "home_team_url": "https://www.lnr.fr/rugby-top-14/club-rugby/pau-rugby-top-14",
    "home_team_name": "Pau",
    "home_team_score": "11",
    "away_team_url": "https://www.lnr.fr/rugby-top-14/club-rugby/toulouse-rugby-top-14",
    "away_team_name": "Toulouse",
    "away_team_score": "10",
    "raw_gamedate": "Dimanche 07 Janvier 2018",
    "raw_gametime": "16h50"
}