{
    "home_team_url": "https://www.lnr.fr/rugby-top-14/club-rugby/toulon-rugby-top-14",
    "home_team_name": "Toulon",
    "home_team_score": "41",
    "away_team_url": "https://www.lnr.fr/rugby-pro-d2/club-rugby/brive-rugby-pro-d2",
    "away_team_name": "Brive",
    "away_team_score": "24",
    "raw_gamedate": "Samedi 28 Octobre 2017",
    "raw_gametime": "14h45"
}