{
    "home_team_url": "https://www.lnr.fr/rugby-pro-d2/club-rugby/brive-rugby-pro-d2",
    "home_team_name": "Brive",
    "home_team_score": "31",
    "away_team_url": "https://www.lnr.fr/rugby-top-14/club-rugby/grenoble-rugby-top-14",
    "away_team_name": "Grenoble",
    "away_team_score": "6",
    "raw_gamedate": "Samedi 01 Mars 2014",
    "raw_gametime": "18h30"
}