{
    "home_team_url": "https://www.lnr.fr/rugby-top-14/club-rugby/perpignan-rugby-top-14",
    "home_team_name": "Perpignan",
    "home_team_score": "14",
    "away_team_url": "https://www.lnr.fr/rugby-top-14/club-rugby/racing-92-rugby-top-14",
    "away_team_name": "Racing 92",
    "away_team_score": "14",
    "raw_gamedate": "Samedi 07 Janvier 2012",
    "raw_gametime": "16h15"
}