{
    "home_team_url": "https://www.lnr.fr/club-rugby/bourgoin",
    "home_team_name": "Bourgoin",
    "home_team_score": "9",
    "away_team_url": "https://www.lnr.fr/rugby-pro-d2/club-rugby/biarritz-rugby-pro-d2",
    "away_team_name": "Biarritz",
    "away_team_score": "0",
    "raw_gamedate": "Vendredi 05 Janvier 2007",
    "raw_gametime": null
}