{
    "home_team_url": "https://www.lnr.fr/rugby-top-14/club-rugby/perpignan-rugby-top-14",
    "home_team_name": "Perpignan",
    "home_team_score": "19",
    "away_team_url": "https://www.lnr.fr/rugby-pro-d2/club-rugby/montauban-rugby-pro-d2",
    "away_team_name": "Montauban",
    "away_team_score": "9",
    "raw_gamedate": "Samedi 09 Mai 2009",
    "raw_gametime": "14h30"
}