{
    "home_team_url": "https://www.lnr.fr/rugby-top-14/club-rugby/racing-92-rugby-top-14",
    "home_team_name": "Racing 92",
    "home_team_score": "17",
    "away_team_url": "https://www.lnr.fr/rugby-pro-d2/club-rugby/montauban-rugby-pro-d2",
    "away_team_name": "Montauban",
    "away_team_score": "12",
    "raw_gamedate": "Samedi 03 Octobre 2009",
    "raw_gametime": "14h30"
}