{
    "home_team_url": "https://www.lnr.fr/rugby-top-14/club-rugby/paris-rugby-top-14",
    "home_team_name": "Paris",
    "home_team_score": "23",
    "away_team_url": "https://www.lnr.fr/rugby-top-14/club-rugby/clermont-rugby-top-14",
    "away_team_name": "Clermont",
    "away_team_score": "18",
    "raw_gamedate": "Samedi 09 Juin 2007",
    "raw_gametime": "20h45"
}