{
    "home_team_url": "https://www.lnr.fr/rugby-pro-d2/club-rugby/bayonne-rugby-pro-d2",
    "home_team_name": "Bayonne",
    "home_team_score": "19",
    "away_team_url": "https://www.lnr.fr/rugby-top-14/club-rugby/toulouse-rugby-top-14",
    "away_team_name": "Toulouse",
    "away_team_score": "13",
    "raw_gamedate": "Samedi 05 Mars 2011",
    "raw_gametime": "16h25"
}