season_order,raw_datetime,home_team,away_team,home_score,away_score,home_win_main_odd,home_loss_main_odd,draw_main_odd,n_bookies
186,24 Jun 2016 19:45,RC Toulonnais,Racing 92,21,29,1.61,2.5,17.98,10
185,18 Jun 2016 19:45,RC Toulonnais,Montpellier Herault RC,27,18,1.57,2.54,19.73,10
184,17 Jun 2016 19:45,Clermont,Racing 92,33,34 OT,1.5,2.83,19.33,10
183,12 Jun 2016 15:15,Montpellier Herault RC,Castres Olympique,28,9,1.31,3.76,21.75,10
182,11 Jun 2016 19:45,Racing 92,Stade Toulousain,21,16,1.32,3.59,20.12,10
181,05 Jun 2016 19:45,Agen,Union Sportive Oyonnax,23,19,1.21,4.23,27.05,9
180,05 Jun 2016 19:45,CA Brive,Section Paloise,46,10,1.02,11.71,45.62,9
179,05 Jun 2016 19:45,Castres Olympique,Stade Francais Paris,35,14,1.03,10.54,42.37,9
178,05 Jun 2016 19:45,Clermont,La Rochelle,57,8,,21.0,42.17,9
177,05 Jun 2016 19:45,Grenoble FC,Stade Toulousain,14,53,2.34,1.62,20.13,9
176,05 Jun 2016 19:45,Racing 92,Montpellier Herault RC,40,25,1.55,2.54,19.84,9
175,05 Jun 2016 19:45,RC Toulonnais,Bordeaux Begles,44,3,1.08,7.41,32.83,9
174,29 May 2016 19:45,Montpellier Herault RC,RC Toulonnais,36,21,1.75,2.18,19.4,9
173,29 May 2016 15:30,Stade Toulousain,Clermont,22,11,1.24,4.33,24.12,9
172,28 May 2016 19:45,Union Sportive Oyonnax,Castres Olympique,20,25,5.09,1.16,30.05,9
171,28 May 2016 17:30,Section Paloise,Grenoble FC,29,12,1.13,5.95,29.72,9
170,28 May 2016 17:30,Stade Francais Paris,Agen,28,26,1.02,14.36,46.8,9
169,28 May 2016 14:30,Bordeaux Begles,CA Brive,34,7,1.08,8.32,33.81,9
168,27 May 2016 19:45,La Rochelle,Racing 92,14,30,3.0,1.41,21.3,9
167,22 May 2016 15:15,Clermont,Stade Francais Paris,36,10,1.03,14.83,42.83,9
166,21 May 2016 15:35,Montpellier Herault RC,Bordeaux Begles,19,16,1.29,3.77,22.96,9
165,21 May 2016 14:00,CA Brive,Grenoble FC,45,24,1.1,7.65,31.63,9
164,21 May 2016 14:00,Castres Olympique,La Rochelle,67,20,1.09,7.95,32.04,9
163,21 May 2016 14:00,Racing 92,Section Paloise,43,13,1.01,17.86,56.38,9
162,21 May 2016 14:00,Union Sportive Oyonnax,Stade Toulousain,17,25,6.04,1.14,27.69,9
161,21 May 2016 13:30,Agen,RC Toulonnais,13,52,8.59,1.08,32.72,9
160,08 May 2016 20:00,RC Toulonnais,Castres Olympique,17,7,1.19,5.17,25.31,9
159,08 May 2016 15:15,Stade Toulousain,Agen,52,19,1.02,14.04,49.13,9
158,07 May 2016 15:30,CA Brive,Racing 92,33,27,1.21,4.66,25.39,9
157,07 May 2016 14:00,La Rochelle,Montpellier Herault RC,36,10,1.41,3.07,21.2,9
156,07 May 2016 14:00,Section Paloise,Clermont,10,16,4.59,1.23,22.46,9
155,07 May 2016 14:00,Stade Francais Paris,Union Sportive Oyonnax,69,8,1.08,8.75,35.71,9
154,06 May 2016 19:45,Grenoble FC,Bordeaux Begles,14,20,2.35,1.64,20.88,9
153,01 May 2016 15:15,Racing 92,Clermont,26,20,1.99,1.88,18.67,9
152,30 Apr 2016 19:45,Bordeaux Begles,Stade Francais Paris,35,25,1.21,4.72,25.75,9
151,30 Apr 2016 17:30,Agen,CA Brive,37,19,2.6,1.54,18.91,9
150,30 Apr 2016 17:30,Castres Olympique,Section Paloise,37,6,1.05,9.76,39.74,9
149,30 Apr 2016 17:30,Montpellier Herault RC,Grenoble FC,51,10,1.04,10.81,42.02,9
148,30 Apr 2016 17:30,Union Sportive Oyonnax,La Rochelle,17,16,1.92,1.95,18.47,9
147,30 Apr 2016 13:45,RC Toulonnais,Stade Toulousain,10,12,1.18,4.97,27.11,9
146,17 Apr 2016 15:15,Stade Toulousain,Racing 92,14,3,1.07,9.03,36.07,9
145,17 Apr 2016 13:30,Stade Francais Paris,Montpellier Herault RC,20,26,1.96,1.91,20.33,9
144,16 Apr 2016 19:45,La Rochelle,Bordeaux Begles,22,15,1.84,2.04,20.15,9
143,16 Apr 2016 17:30,CA Brive,Union Sportive Oyonnax,31,13,1.09,7.84,34.69,9
142,16 Apr 2016 17:30,Clermont,Agen,38,10,1.01,17.36,45.73,9
141,16 Apr 2016 13:45,Section Paloise,RC Toulonnais,9,25,3.52,1.33,21.18,9
140,15 Apr 2016 19:45,Grenoble FC,Castres Olympique,28,33,2.1,1.8,19.3,9
139,03 Apr 2016 15:15,RC Toulonnais,Clermont,18,19,1.29,3.89,23.43,9
138,02 Apr 2016 19:45,Bordeaux Begles,Racing 92,20,28,1.33,3.41,19.52,9
137,02 Apr 2016 17:30,La Rochelle,Stade Francais Paris,21,18,1.29,3.81,22.48,9
136,02 Apr 2016 17:30,Agen,Section Paloise,26,33,1.58,2.48,20.37,9
135,02 Apr 2016 17:30,Union Sportive Oyonnax,Grenoble FC,20,27,1.88,1.99,19.43,9
134,02 Apr 2016 13:45,Castres Olympique,Stade Toulousain,15,9,1.43,3.0,21.17,8
133,01 Apr 2016 19:45,Montpellier Herault RC,CA Brive,19,3,1.07,8.47,37.14,9
132,27 Mar 2016 20:00,Stade Toulousain,Stade Francais Paris,36,3,1.11,6.79,31.58,9
131,27 Mar 2016 15:15,Bordeaux Begles,Clermont,19,24,1.54,2.61,20.16,9
130,26 Mar 2016 19:45,Section Paloise,Union Sportive Oyonnax,25,6,1.15,5.86,26.15,8
129,26 Mar 2016 17:30,Agen,Montpellier Herault RC,21,45,3.44,1.34,22.1,9
128,26 Mar 2016 17:30,CA Brive,Castres Olympique,23,22,1.44,2.92,20.44,9
127,26 Mar 2016 17:30,Grenoble FC,La Rochelle,39,23,1.31,3.58,22.46,9
126,26 Mar 2016 13:45,Racing 92,RC Toulonnais,20,21,1.07,8.92,39.95,9
125,20 Mar 2016 15:15,Clermont,Stade Toulousain,32,23,1.2,4.72,24.65,9
124,20 Mar 2016 13:00,Grenoble FC,CA Brive,26,22,1.27,4.04,24.08,9
123,19 Mar 2016 17:00,Section Paloise,Castres Olympique,21,16,1.57,2.53,19.16,9
122,19 Mar 2016 17:00,Union Sportive Oyonnax,Agen,30,28,1.27,3.9,24.1,9
121,19 Mar 2016 13:30,Montpellier Herault RC,Racing 92,60,7,1.18,5.16,24.52,9
120,19 Mar 2016 13:00,Stade Francais Paris,La Rochelle,33,20,1.29,3.84,22.93,9
119,13 Mar 2016 11:00,Union Sportive Oyonnax,Montpellier Herault RC,10,31,3.07,1.41,21.83,9
118,12 Mar 2016 19:45,RC Toulonnais,Grenoble FC,38,8,1.02,15.46,52.56,9
117,12 Mar 2016 17:30,Castres Olympique,Agen,50,6,1.06,9.47,43.75,9
116,12 Mar 2016 17:30,Clermont,CA Brive,25,6,1.14,5.83,32.08,9
115,12 Mar 2016 17:30,La Rochelle,Section Paloise,35,16,1.08,8.04,36.85,9
114,12 Mar 2016 13:30,Stade Francais Paris,Racing 92,16,34,2.27,1.69,19.38,9
113,11 Mar 2016 19:45,Stade Toulousain,Bordeaux Begles,13,13,1.5,2.75,20.52,9
112,06 Mar 2016 15:15,La Rochelle,RC Toulonnais,19,14,2.41,1.62,19.88,9
111,05 Mar 2016 19:45,Montpellier Herault RC,Castres Olympique,22,19,1.21,4.73,25.43,9
110,05 Mar 2016 17:30,Bordeaux Begles,Union Sportive Oyonnax,48,20,1.05,10.3,38.53,9
109,05 Mar 2016 17:30,Racing 92,Agen,38,13,1.02,16.38,44.77,9
108,05 Mar 2016 17:30,Section Paloise,Stade Francais Paris,19,12,1.61,2.45,18.17,9
107,05 Mar 2016 13:45,CA Brive,Stade Toulousain,21,21,1.44,2.92,20.58,9
106,04 Mar 2016 19:45,Grenoble FC,Clermont,12,45,1.96,1.92,19.69,9
105,28 Feb 2016 15:15,Stade Toulousain,Montpellier Herault RC,29,31,1.52,2.63,20.22,9
104,27 Feb 2016 19:45,Racing 92,Castres Olympique,9,13,1.18,5.17,26.37,9
103,27 Feb 2016 17:30,Agen,La Rochelle,31,27,1.77,2.15,19.44,9
102,27 Feb 2016 17:30,Clermont,Union Sportive Oyonnax,44,16,1.03,13.89,49.68,9
101,27 Feb 2016 17:30,Section Paloise,Bordeaux Begles,3,15,1.61,2.47,18.9,9
100,27 Feb 2016 17:30,Stade Francais Paris,Grenoble FC,18,33,1.32,3.59,22.12,9
99,27 Feb 2016 13:30,RC Toulonnais,CA Brive,44,15,1.09,8.11,33.4,9
98,21 Feb 2016 15:15,Union Sportive Oyonnax,RC Toulonnais,13,44,3.04,1.41,21.9,9
97,20 Feb 2016 19:45,La Rochelle,Stade Toulousain,28,8,1.57,2.55,20.36,9
96,20 Feb 2016 17:30,Bordeaux Begles,Agen,24,19,1.06,9.34,41.56,9
95,20 Feb 2016 17:30,Grenoble FC,Racing 92,35,39,2.05,1.81,18.77,9
94,20 Feb 2016 17:30,Montpellier Herault RC,Section Paloise,16,19,1.06,9.58,42.09,9
93,20 Feb 2016 13:45,Castres Olympique,Clermont,17,28,1.46,2.84,21.37,9
92,19 Feb 2016 19:45,Stade Francais Paris,CA Brive,32,17,1.17,5.43,26.17,8
91,14 Feb 2016 15:15,Bordeaux Begles,RC Toulonnais,15,12,1.53,2.6,20.52,9
90,31 Jan 2016 15:15,RC Toulonnais,Stade Francais Paris,23,16,1.11,6.76,33.06,9
89,30 Jan 2016 19:45,Stade Toulousain,Section Paloise,54,3,1.11,6.74,33.19,9
88,30 Jan 2016 17:30,Castres Olympique,Bordeaux Begles,19,9,1.38,3.24,21.8,9
87,30 Jan 2016 17:30,Racing 92,Union Sportive Oyonnax,26,3,1.05,10.31,43.0,9
86,30 Jan 2016 17:30,Agen,Grenoble FC,27,33,1.78,2.13,20.02,9
85,30 Jan 2016 13:45,Clermont,Montpellier Herault RC,15,19,1.33,3.48,22.72,9
84,29 Jan 2016 19:45,CA Brive,La Rochelle,28,6,1.37,3.29,21.68,9
83,03 Jan 2016 20:00,Stade Francais Paris,Stade Toulousain,18,17,1.44,2.92,21.0,8
82,03 Jan 2016 16:45,RC Toulonnais,Section Paloise,21,17,1.01,18.1,46.77,8
81,02 Jan 2016 19:45,CA Brive,Montpellier Herault RC,19,18,1.63,2.38,19.21,9
80,02 Jan 2016 15:30,Racing 92,Bordeaux Begles,23,18,1.17,5.33,25.45,9
79,02 Jan 2016 14:00,Grenoble FC,Union Sportive Oyonnax,42,17,1.15,5.59,27.41,9
78,02 Jan 2016 14:00,La Rochelle,Castres Olympique,25,21,1.32,3.56,21.98,9
77,02 Jan 2016 13:30,Agen,Clermont,16,33,2.85,1.45,20.05,9
76,27 Dec 2015 20:00,Stade Toulousain,RC Toulonnais,31,8,1.78,2.15,19.93,8
75,27 Dec 2015 17:00,Clermont,Racing 92,16,20,1.16,5.43,27.36,9
74,27 Dec 2015 15:00,Bordeaux Begles,Grenoble FC,25,19,1.16,5.37,27.83,9
73,27 Dec 2015 15:00,Castres Olympique,CA Brive,23,8,1.21,4.62,25.52,9
72,27 Dec 2015 15:00,Montpellier Herault RC,Agen,45,20,1.08,8.62,37.57,9
71,27 Dec 2015 15:00,Section Paloise,La Rochelle,15,11,1.41,3.07,21.89,9
70,27 Dec 2015 13:00,Union Sportive Oyonnax,Stade Francais Paris,25,12,2.13,1.78,19.46,9
69,06 Dec 2015 15:15,CA Brive,Clermont,21,26,1.6,2.47,20.18,9
68,05 Dec 2015 19:45,Stade Toulousain,Union Sportive Oyonnax,27,3,1.06,10.06,41.77,9
67,05 Dec 2015 17:30,Castres Olympique,Montpellier Herault RC,34,19,1.42,2.99,21.99,9
66,05 Dec 2015 17:30,La Rochelle,Grenoble FC,33,16,1.34,3.45,22.22,9
65,05 Dec 2015 17:30,Stade Francais Paris,Bordeaux Begles,21,24,1.24,4.37,25.0,9
64,05 Dec 2015 13:45,RC Toulonnais,Agen,53,23,1.01,19.67,59.2,9
63,04 Dec 2015 19:45,Section Paloise,Racing 92,15,15,2.11,1.8,19.5,9
62,29 Nov 2015 15:15,Grenoble FC,Stade Francais Paris,19,21,1.47,2.8,21.43,9
61,28 Nov 2015 19:45,Clermont,RC Toulonnais,9,35,1.47,2.83,21.78,9
60,28 Nov 2015 17:30,Agen,Castres Olympique,18,23,1.67,2.29,20.05,9
59,28 Nov 2015 17:30,Bordeaux Begles,Section Paloise,46,10,1.13,6.35,28.69,9
58,28 Nov 2015 17:30,Union Sportive Oyonnax,CA Brive,9,34,1.32,3.5,22.99,9
57,28 Nov 2015 13:45,Racing 92,Stade Toulousain,28,13,1.28,3.85,23.4,9
56,27 Nov 2015 19:45,Montpellier Herault RC,La Rochelle,25,20,1.15,5.6,28.35,9
55,08 Nov 2015 15:15,Stade Francais Paris,Clermont,14,9,1.52,2.69,20.57,9
54,08 Nov 2015 11:15,Castres Olympique,Racing 92,34,8,1.31,3.61,23.44,9
53,07 Nov 2015 19:45,Stade Toulousain,Grenoble FC,52,12,1.09,7.7,38.09,9
52,07 Nov 2015 17:30,CA Brive,Bordeaux Begles,16,3,1.4,3.15,22.04,9
51,07 Nov 2015 17:30,La Rochelle,Union Sportive Oyonnax,38,3,1.35,3.37,22.49,9
50,07 Nov 2015 17:30,Section Paloise,Agen,33,31,1.34,3.43,23.35,9
49,07 Nov 2015 13:45,RC Toulonnais,Montpellier Herault RC,52,8,1.08,8.62,38.53,9
48,01 Nov 2015 15:15,Grenoble FC,RC Toulonnais,33,29,1.95,1.92,19.39,9
47,31 Oct 2015 19:45,Clermont,Castres Olympique,42,13,1.1,7.68,32.55,9
46,31 Oct 2015 13:30,Montpellier Herault RC,Stade Toulousain,25,33,1.31,3.67,23.05,9
45,31 Oct 2015 13:00,Agen,Stade Francais Paris,28,23,2.23,1.7,20.33,9
44,31 Oct 2015 13:00,Bordeaux Begles,La Rochelle,21,16,1.2,4.71,26.18,9
43,31 Oct 2015 13:00,Racing 92,CA Brive,17,14,1.08,8.18,35.48,9
42,31 Oct 2015 13:00,Union Sportive Oyonnax,Section Paloise,42,23,1.27,4.0,23.29,9
41,25 Oct 2015 11:30,La Rochelle,Agen,23,6,1.24,4.29,26.11,9
40,24 Oct 2015 19:45,Montpellier Herault RC,Clermont,24,19,1.4,3.15,21.65,9
39,24 Oct 2015 13:30,Bordeaux Begles,Stade Toulousain,12,10,1.49,2.75,20.64,9
38,24 Oct 2015 13:00,Castres Olympique,Grenoble FC,23,31,1.22,4.87,26.37,9
37,24 Oct 2015 13:00,Section Paloise,CA Brive,13,18,1.36,3.35,21.75,9
36,24 Oct 2015 13:00,RC Toulonnais,Union Sportive Oyonnax,61,3,1.07,9.52,39.16,9
35,23 Oct 2015 19:45,Racing 92,Stade Francais Paris,27,18,1.3,3.71,22.31,9
34,17 Oct 2015 13:45,CA Brive,RC Toulonnais,29,26,1.5,2.75,20.32,9
33,16 Oct 2015 20:00,Stade Toulousain,La Rochelle,39,22,1.1,7.51,34.04,9
32,16 Oct 2015 18:45,Agen,Bordeaux Begles,16,31,1.53,2.63,19.96,9
31,16 Oct 2015 18:45,Clermont,Section Paloise,35,10,1.07,9.69,33.47,9
30,16 Oct 2015 18:45,Grenoble FC,Montpellier Herault RC,19,30,1.52,2.67,20.46,9
29,16 Oct 2015 18:45,Stade Francais Paris,Castres Olympique,22,9,1.3,3.74,21.96,9
28,16 Oct 2015 18:45,Union Sportive Oyonnax,Racing 92,9,18,1.57,2.52,19.81,9
27,13 Sep 2015 16:00,Section Paloise,Stade Toulousain,9,6,1.68,2.32,19.5,9
26,13 Sep 2015 11:30,CA Brive,Agen,18,12,1.16,5.45,26.59,9
25,12 Sep 2015 17:30,Clermont,Bordeaux Begles,26,26,1.12,6.69,30.01,9
24,12 Sep 2015 17:30,Montpellier Herault RC,Stade Francais Paris,44,20,1.23,4.43,23.32,9
23,12 Sep 2015 17:30,Racing 92,Grenoble FC,23,14,1.24,4.26,25.02,9
22,12 Sep 2015 13:45,RC Toulonnais,La Rochelle,45,24,1.07,9.61,38.42,9
21,11 Sep 2015 19:45,Castres Olympique,Union Sportive Oyonnax,35,26,1.2,4.9,25.12,9
20,06 Sep 2015 20:00,Stade Francais Paris,RC Toulonnais,13,20,1.34,3.49,22.41,9
19,06 Sep 2015 15:15,Bordeaux Begles,Montpellier Herault RC,22,24,1.39,3.21,21.96,9
18,05 Sep 2015 15:35,Stade Toulousain,Castres Olympique,37,20,1.27,3.97,22.8,9
17,05 Sep 2015 15:00,Agen,Racing 92,30,18,2.4,1.62,19.67,9
16,05 Sep 2015 15:00,Grenoble FC,Section Paloise,41,15,1.13,6.66,27.1,9
15,05 Sep 2015 15:00,La Rochelle,CA Brive,21,18,1.32,3.52,22.03,9
14,05 Sep 2015 13:35,Union Sportive Oyonnax,Clermont,24,41,1.51,2.7,20.33,9
13,30 Aug 2015 16:00,Castres Olympique,RC Toulonnais,24,9,1.35,3.39,22.06,9
12,29 Aug 2015 19:45,CA Brive,Stade Francais Paris,22,13,1.35,3.38,22.46,9
11,29 Aug 2015 17:30,Racing 92,La Rochelle,20,19,1.07,8.69,42.17,9
10,29 Aug 2015 17:30,Section Paloise,Montpellier Herault RC,26,16,1.63,2.35,21.49,9
9,29 Aug 2015 17:30,Union Sportive Oyonnax,Bordeaux Begles,37,19,1.41,3.03,21.79,9
8,29 Aug 2015 13:45,Agen,Stade Toulousain,9,20,2.17,1.73,19.63,9
7,28 Aug 2015 20:00,Clermont,Grenoble FC,25,6,1.08,8.51,33.38,9
6,23 Aug 2015 15:15,Stade Francais Paris,Section Paloise,34,18,1.12,6.85,30.48,9
5,22 Aug 2015 17:30,Bordeaux Begles,Castres Olympique,19,16,1.27,3.9,24.77,9
4,22 Aug 2015 17:30,Grenoble FC,Agen,38,23,1.1,7.67,32.63,9
3,22 Aug 2015 17:30,Montpellier Herault RC,Union Sportive Oyonnax,35,19,1.14,5.98,27.83,9
2,22 Aug 2015 17:30,Stade Toulousain,CA Brive,24,7,1.12,6.66,28.71,9
1,22 Aug 2015 13:45,La Rochelle,Clermont,6,44,1.52,2.61,20.8,9
0,21 Aug 2015 19:45,RC Toulonnais,Racing 92,22,27,1.3,3.73,23.11,9
