{
    "home_team_url": "https://www.lnr.fr/rugby-top-14/club-rugby/paris-rugby-top-14",
    "home_team_name": "Paris",
    "home_team_score": "36",
    "away_team_url": "https://www.lnr.fr/rugby-pro-d2/club-rugby/brive-rugby-pro-d2",
    "away_team_name": "Brive",
    "away_team_score": "7",
    "raw_gamedate": "Vendredi 08 F\u00e9vrier 2008",
    "raw_gametime": null
}