{
    "home_team_url": "https://www.lnr.fr/rugby-pro-d2/club-rugby/montauban-rugby-pro-d2",
    "home_team_name": "Montauban",
    "home_team_score": "14",
    "away_team_url": "https://www.lnr.fr/rugby-pro-d2/club-rugby/biarritz-rugby-pro-d2",
    "away_team_name": "Biarritz",
    "away_team_score": "5",
    "raw_gamedate": "Samedi 31 Octobre 2009",
    "raw_gametime": "20h45"
}