{
    "home_team_url": "https://www.lnr.fr/rugby-top-14/club-rugby/la-rochelle-rugby-top-14",
    "home_team_name": "La Rochelle",
    "home_team_score": "22",
    "away_team_url": "https://www.lnr.fr/rugby-top-14/club-rugby/castres-rugby-top-14",
    "away_team_name": "Castres",
    "away_team_score": "8",
    "raw_gamedate": "Samedi 07 Janvier 2017",
    "raw_gametime": "20h45"
}