{
    "home_team_url": "https://www.lnr.fr/rugby-top-14/club-rugby/montpellier-rugby-top-14",
    "home_team_name": "Montpellier",
    "home_team_score": "28",
    "away_team_url": "https://www.lnr.fr/club-rugby/bourgoin",
    "away_team_name": "Bourgoin",
    "away_team_score": "3",
    "raw_gamedate": "Samedi 23 Octobre 2010",
    "raw_gametime": "14h30"
}