{
    "home_team_url": "https://www.lnr.fr/rugby-top-14/club-rugby/castres-rugby-top-14",
    "home_team_name": "Castres",
    "home_team_score": "22",
    "away_team_url": "https://www.lnr.fr/rugby-top-14/club-rugby/paris-rugby-top-14",
    "away_team_name": "Paris",
    "away_team_score": "25",
    "raw_gamedate": "Samedi 16 Ao\u00fbt 2014",
    "raw_gametime": "18h30"
}