{
    "home_team_url": "https://www.lnr.fr/rugby-top-14/club-rugby/perpignan-rugby-top-14",
    "home_team_name": "Perpignan",
    "home_team_score": "12",
    "away_team_url": "https://www.lnr.fr/rugby-pro-d2/club-rugby/brive-rugby-pro-d2",
    "away_team_name": "Brive",
    "away_team_score": "6",
    "raw_gamedate": "Samedi 22 F\u00e9vrier 2014",
    "raw_gametime": "18h30"
}