{
    "home_team_url": "https://www.lnr.fr/rugby-top-14/club-rugby/la-rochelle-rugby-top-14",
    "home_team_name": "La Rochelle",
    "home_team_score": "22",
    "away_team_url": "https://www.lnr.fr/rugby-top-14/club-rugby/bordeaux-begles-rugby-top-14",
    "away_team_name": "Bordeaux-B\u00e8gles",
    "away_team_score": "15",
    "raw_gamedate": "Samedi 16 Avril 2016",
    "raw_gametime": "20h45"
}