{
    "home_team_url": "https://www.lnr.fr/rugby-top-14/club-rugby/pau-rugby-top-14",
    "home_team_name": "Pau",
    "home_team_score": "22",
    "away_team_url": "https://www.lnr.fr/rugby-top-14/club-rugby/clermont-rugby-top-14",
    "away_team_name": "Clermont",
    "away_team_score": "21",
    "raw_gamedate": "Samedi 23 D\u00e9cembre 2017",
    "raw_gametime": "20h45"
}