{
    "home_team_url": "https://www.lnr.fr/rugby-top-14/club-rugby/agen-rugby-top-14",
    "home_team_name": "Agen",
    "home_team_score": "21",
    "away_team_url": "https://www.lnr.fr/rugby-pro-d2/club-rugby/bayonne-rugby-pro-d2",
    "away_team_name": "Bayonne",
    "away_team_score": "3",
    "raw_gamedate": "Dimanche 02 Janvier 2011",
    "raw_gametime": "15h00"
}