{
    "home_team_url": "https://www.lnr.fr/rugby-pro-d2/club-rugby/oyonnax-rugby-pro-d2",
    "home_team_name": "Oyonnax",
    "home_team_score": "13",
    "away_team_url": "https://www.lnr.fr/rugby-top-14/club-rugby/toulon-rugby-top-14",
    "away_team_name": "Toulon",
    "away_team_score": "44",
    "raw_gamedate": "Dimanche 21 F\u00e9vrier 2016",
    "raw_gametime": "16h15"
}