{
    "home_team_url": "https://www.lnr.fr/rugby-pro-d2/club-rugby/mont-de-marsan-rugby-pro-d2",
    "home_team_name": "Mont-de-Marsan",
    "home_team_score": "16",
    "away_team_url": "https://www.lnr.fr/rugby-pro-d2/club-rugby/brive-rugby-pro-d2",
    "away_team_name": "Brive",
    "away_team_score": "18",
    "raw_gamedate": "Samedi 14 Mars 2009",
    "raw_gametime": "14h30"
}