{
    "home_team_url": "https://www.lnr.fr/club-rugby/dax",
    "home_team_name": "Dax",
    "home_team_score": "10",
    "away_team_url": "https://www.lnr.fr/rugby-top-14/club-rugby/toulouse-rugby-top-14",
    "away_team_name": "Toulouse",
    "away_team_score": "15",
    "raw_gamedate": "Vendredi 26 Octobre 2007",
    "raw_gametime": "20h30"
}