Anio_reporte|Vigencia|NIT_Entidad_reportante|Nombre_Entidad_reportante|Codigo_Presupuestal|Macro_campo_nivel_agregado|Fecha_de_Recaudo|Numero_Recibo|Numero_reconocimiento|identificacion_tercero|Nombre_tercero|Concepto_Recaudo|Valor|Cuenta_Bancaria_Dest|Nombre_banco|No_Cuenta_Banco_Orig|Cta_Contable
2018|actual|123456789|MUNICIPIO DE YOPAL|1.1.01.01.014.01.01|da|2021-01-31|23|0|891855017|23232|RECAUDOMESDEENEROPREDIALGLOBAL|25000|36320932798|Bancolombia|36320932798|1.1.10.06.05.35
2018|actual|123456789|MUNICIPIO DE YOPAL|1.1.01.01.014.01.01|da|2021-01-31|23|0|891855017|23232|RECAUDOMESDEENEROPREDIALGLOBAL|25000|36320932798|Bancolombia|36320932798|1.1.10.06.05.35
2018|actual|123456789|MUNICIPIO DE YOPAL|1.1.01.01.014.01.01|da|2021-01-31|23|0|891855017|23232|RECAUDOMESDEENEROPREDIALGLOBAL|25000|36320932798|Bancolombia|36320932798|1.1.10.06.05.35
2018|actual|123456789|MUNICIPIO DE YOPAL|1.1.01.01.014.01.01|da|2021-01-31|23|0|891855017|23232|RECAUDOMESDEENEROPREDIALGLOBAL|25000|36320932798|Bancolombia|36320932798|1.1.10.06.05.35
2018|actual|123456789|MUNICIPIO DE YOPAL|1.1.01.01.014.01.01|da|2021-01-31|23|0|891855017|23232|RECAUDOMESDEENEROPREDIALGLOBAL|25000|36320932798|Bancolombia|36320932798|1.1.10.06.05.35
2018|actual|123456789|MUNICIPIO DE YOPAL|1.1.01.01.014.01.01|da|2021-01-31|23|0|891855017|23232|RECAUDOMESDEENEROPREDIALGLOBAL|25000|36320932798|Bancolombia|36320932798|1.1.10.06.05.35
2018|actual|123456789|MUNICIPIO DE YOPAL|1.1.01.01.014.01.01|da|2021-01-31|23|0|891855017|23232|RECAUDOMESDEENEROPREDIALGLOBAL|25000|36320932798|Bancolombia|36320932798|1.1.10.06.05.35
2018|actual|123456789|MUNICIPIO DE YOPAL|1.1.01.01.014.01.01|da|2021-01-31|23|0|891855017|23232|RECAUDOMESDEENEROPREDIALGLOBAL|25000|36320932798|Bancolombia|36320932798|1.1.10.06.05.35
2018|actual|123456789|MUNICIPIO DE YOPAL|1.1.01.01.014.01.01|da|2021-01-31|23|0|891855017|23232|RECAUDOMESDEENEROPREDIALGLOBAL|25000|36320932798|Bancolombia|36320932798|1.1.10.06.05.35
2018|actual|123456789|MUNICIPIO DE YOPAL|1.1.01.01.014.01.01|da|2021-01-31|23|0|891855017|23232|RECAUDOMESDEENEROPREDIALGLOBAL|25000|36320932798|Bancolombia|36320932798|1.1.10.06.05.35