module github.com/ariga914/simpleapi_exercise

go 1.20

require (
	github.com/go-sql-driver/mysql v1.7.1
	github.com/google/uuid v1.3.0
	github.com/gorilla/mux v1.8.0
	github.com/jmoiron/sqlx v1.3.5
)
