{
    "image_id": 2, 
    "file_name": "2.jpg", 
    "height": 512, 
    "width": 512, 
    "annotations": [{
        "bbox": [264.0, 128.0, 123.0, 159.0], 
        "bbox_mode": 1, 
        "category_id": "rectangle"}, {
        "bbox": [267.0, 43.0, 92.0, 28.0], 
        "bbox_mode": 1, 
        "category_id": "rectangle"}, {
        "bbox": [417.0, 151.0, 80.0, 80.0], 
        "bbox_mode": 1, 
        "category_id": "circle"}]}