12,Avadavat 12 Red avadavat
31,Babbler 31 White hooded Babbler
83,Barbet 83 Great Barbet
86,Barbet 86 White chicked
130,Bluebird 130 Asian Fairy Bluebird
140,Bulbul 140 Yellow browed Bulbul
143,Bulbul 143 Red whiskered Bulbul
188,Buschat 188 Pied Bushchat
1412,Chiff chaff 1412 common chifchaff
218,Coucal 218 Southern coucal
244,Crow 244 House crow
245,Crow 245 Indian Jungle crow
252,Cuckoo 252 Common Hawk cuckoo
255,Cuckoo 255 Oriental cuckoo
289,Drongo 289 Black Drongo
290,Drongo 290 Ashy Drongo
294,Drongo 294 Greater Racket-tailed Drongo
306,Duck 306 Spot billed duck
15,Eagle 15 Crowned-eagle
1083,Flowerpecker 1083 pale billed
445,Flycatcher 445 Grey headed canery
486,Fowl 486 Red Junglefowl
99,Fowl 99 Grey Jungle
492,Francolin 492 Painted francolin
566,Heron 566 Purple heron
567,Heron 567 Black crowned Night heron
611,Kingfisher 611 White throated Kingfisher
643,Koel 643 Asian Koel
779,Nightjar 779 Jerdon_s
780,Nightjar 780 Indian Nightjar
808,Oriel 808 Black hooded
807,Oriole 807 Indian Golden Oriole
913,Petronia 913 Chestnut shouldered Petronia
997,Prinia 997 Jungle Prinia
1014,Quail 1014 Barred Button quail
1042,Robin 1042 Indian Robin
1070,Sandpiper 1070 Wood Sandpiper
1127,Sibia 1127 Rufous
484,Spurfowl 484 Red Spurfowl
1384,Wagtail 1384 Yellow
1414,Warbler 1414 Greenish Warbler