{
"data": [
	{
		"ID" : 1,
		"Name" : "Chevrolet Europe",
		"md_name" : "Spark + Matiz (M200) [GEN]",
		"ID_region" : 3,
		"ID_mark" : 1,
		"md_id" : 1,
		"md_type" : null,
		"YearFrom" : "2005",
		"YearTo" : "2011",
		"md_code" : "M04",
		"mf_id" : 123,
		"mf_code" : "2005",
		"mf_type" : null,
		"ID_model" : 1,
		"Body" : null,
		"Class" : null,
		"Capasity" : null,
		"Fuell" : null,
		"Transmission" : null,
		"DataRange" : "2005"
	},
	{
		"ID" : 1,
		"Name" : "Chevrolet Europe",
		"md_name" : "Spark + Matiz (M200) [GEN]",
		"ID_region" : 3,
		"ID_mark" : 1,
		"md_id" : 1,
		"md_type" : null,
		"YearFrom" : "2005",
		"YearTo" : "2011",
		"md_code" : "M04",
		"mf_id" : 129,
		"mf_code" : "2006",
		"mf_type" : null,
		"ID_model" : 1,
		"Body" : null,
		"Class" : null,
		"Capasity" : null,
		"Fuell" : null,
		"Transmission" : null,
		"DataRange" : "2006"
	},
	{
		"ID" : 1,
		"Name" : "Chevrolet Europe",
		"md_name" : "Spark + Matiz (M200) [GEN]",
		"ID_region" : 3,
		"ID_mark" : 1,
		"md_id" : 1,
		"md_type" : null,
		"YearFrom" : "2005",
		"YearTo" : "2011",
		"md_code" : "M04",
		"mf_id" : 136,
		"mf_code" : "2007",
		"mf_type" : null,
		"ID_model" : 1,
		"Body" : null,
		"Class" : null,
		"Capasity" : null,
		"Fuell" : null,
		"Transmission" : null,
		"DataRange" : "2007"
	},
	{
		"ID" : 1,
		"Name" : "Chevrolet Europe",
		"md_name" : "Spark + Matiz (M200) [GEN]",
		"ID_region" : 3,
		"ID_mark" : 1,
		"md_id" : 1,
		"md_type" : null,
		"YearFrom" : "2005",
		"YearTo" : "2011",
		"md_code" : "M04",
		"mf_id" : 142,
		"mf_code" : "2008",
		"mf_type" : null,
		"ID_model" : 1,
		"Body" : null,
		"Class" : null,
		"Capasity" : null,
		"Fuell" : null,
		"Transmission" : null,
		"DataRange" : "2008"
	},
	{
		"ID" : 1,
		"Name" : "Chevrolet Europe",
		"md_name" : "Spark + Matiz (M200) [GEN]",
		"ID_region" : 3,
		"ID_mark" : 1,
		"md_id" : 1,
		"md_type" : null,
		"YearFrom" : "2005",
		"YearTo" : "2011",
		"md_code" : "M04",
		"mf_id" : 148,
		"mf_code" : "2009",
		"mf_type" : null,
		"ID_model" : 1,
		"Body" : null,
		"Class" : null,
		"Capasity" : null,
		"Fuell" : null,
		"Transmission" : null,
		"DataRange" : "2009"
	},
	{
		"ID" : 1,
		"Name" : "Chevrolet Europe",
		"md_name" : "Spark + Matiz (M200) [GEN]",
		"ID_region" : 3,
		"ID_mark" : 1,
		"md_id" : 1,
		"md_type" : null,
		"YearFrom" : "2005",
		"YearTo" : "2011",
		"md_code" : "M04",
		"mf_id" : 152,
		"mf_code" : "2010",
		"mf_type" : null,
		"ID_model" : 1,
		"Body" : null,
		"Class" : null,
		"Capasity" : null,
		"Fuell" : null,
		"Transmission" : null,
		"DataRange" : "2010"
	},
	{
		"ID" : 1,
		"Name" : "Chevrolet Europe",
		"md_name" : "Spark + Matiz (M200) [GEN]",
		"ID_region" : 3,
		"ID_mark" : 1,
		"md_id" : 1,
		"md_type" : null,
		"YearFrom" : "2005",
		"YearTo" : "2011",
		"md_code" : "M04",
		"mf_id" : 156,
		"mf_code" : "2011",
		"mf_type" : null,
		"ID_model" : 1,
		"Body" : null,
		"Class" : null,
		"Capasity" : null,
		"Fuell" : null,
		"Transmission" : null,
		"DataRange" : "2011"
	},
	{
		"ID" : 1,
		"Name" : "Chevrolet Europe",
		"md_name" : "Epica (V250) [GEN]",
		"ID_region" : 3,
		"ID_mark" : 1,
		"md_id" : 2,
		"md_type" : null,
		"YearFrom" : "2007",
		"YearTo" : "2011",
		"md_code" : "V06",
		"mf_id" : 137,
		"mf_code" : "2007",
		"mf_type" : null,
		"ID_model" : 2,
		"Body" : null,
		"Class" : null,
		"Capasity" : null,
		"Fuell" : null,
		"Transmission" : null,
		"DataRange" : "2007"
	},
	{
		"ID" : 1,
		"Name" : "Chevrolet Europe",
		"md_name" : "Epica (V250) [GEN]",
		"ID_region" : 3,
		"ID_mark" : 1,
		"md_id" : 2,
		"md_type" : null,
		"YearFrom" : "2007",
		"YearTo" : "2011",
		"md_code" : "V06",
		"mf_id" : 143,
		"mf_code" : "2008",
		"mf_type" : null,
		"ID_model" : 2,
		"Body" : null,
		"Class" : null,
		"Capasity" : null,
		"Fuell" : null,
		"Transmission" : null,
		"DataRange" : "2008"
	},
	{
		"ID" : 1,
		"Name" : "Chevrolet Europe",
		"md_name" : "Epica (V250) [GEN]",
		"ID_region" : 3,
		"ID_mark" : 1,
		"md_id" : 2,
		"md_type" : null,
		"YearFrom" : "2007",
		"YearTo" : "2011",
		"md_code" : "V06",
		"mf_id" : 149,
		"mf_code" : "2009",
		"mf_type" : null,
		"ID_model" : 2,
		"Body" : null,
		"Class" : null,
		"Capasity" : null,
		"Fuell" : null,
		"Transmission" : null,
		"DataRange" : "2009"
	},
	{
		"ID" : 1,
		"Name" : "Chevrolet Europe",
		"md_name" : "Epica (V250) [GEN]",
		"ID_region" : 3,
		"ID_mark" : 1,
		"md_id" : 2,
		"md_type" : null,
		"YearFrom" : "2007",
		"YearTo" : "2011",
		"md_code" : "V06",
		"mf_id" : 153,
		"mf_code" : "2010",
		"mf_type" : null,
		"ID_model" : 2,
		"Body" : null,
		"Class" : null,
		"Capasity" : null,
		"Fuell" : null,
		"Transmission" : null,
		"DataRange" : "2010"
	},
	{
		"ID" : 1,
		"Name" : "Chevrolet Europe",
		"md_name" : "Epica (V250) [GEN]",
		"ID_region" : 3,
		"ID_mark" : 1,
		"md_id" : 2,
		"md_type" : null,
		"YearFrom" : "2007",
		"YearTo" : "2011",
		"md_code" : "V06",
		"mf_id" : 157,
		"mf_code" : "2011",
		"mf_type" : null,
		"ID_model" : 2,
		"Body" : null,
		"Class" : null,
		"Capasity" : null,
		"Fuell" : null,
		"Transmission" : null,
		"DataRange" : "2011"
	},
	{
		"ID" : 1,
		"Name" : "Chevrolet Europe",
		"md_name" : "Aveo (T200) [GEN]",
		"ID_region" : 3,
		"ID_mark" : 1,
		"md_id" : 3,
		"md_type" : null,
		"YearFrom" : "2003",
		"YearTo" : "2008",
		"md_code" : "T02",
		"mf_id" : 112,
		"mf_code" : "2003",
		"mf_type" : null,
		"ID_model" : 3,
		"Body" : null,
		"Class" : null,
		"Capasity" : null,
		"Fuell" : null,
		"Transmission" : null,
		"DataRange" : "2003"
	},
	{
		"ID" : 1,
		"Name" : "Chevrolet Europe",
		"md_name" : "Aveo (T200) [GEN]",
		"ID_region" : 3,
		"ID_mark" : 1,
		"md_id" : 3,
		"md_type" : null,
		"YearFrom" : "2003",
		"YearTo" : "2008",
		"md_code" : "T02",
		"mf_id" : 118,
		"mf_code" : "2004",
		"mf_type" : null,
		"ID_model" : 3,
		"Body" : null,
		"Class" : null,
		"Capasity" : null,
		"Fuell" : null,
		"Transmission" : null,
		"DataRange" : "2004"
	},
	{
		"ID" : 1,
		"Name" : "Chevrolet Europe",
		"md_name" : "Aveo (T200) [GEN]",
		"ID_region" : 3,
		"ID_mark" : 1,
		"md_id" : 3,
		"md_type" : null,
		"YearFrom" : "2003",
		"YearTo" : "2008",
		"md_code" : "T02",
		"mf_id" : 124,
		"mf_code" : "2005",
		"mf_type" : null,
		"ID_model" : 3,
		"Body" : null,
		"Class" : null,
		"Capasity" : null,
		"Fuell" : null,
		"Transmission" : null,
		"DataRange" : "2005"
	},
	{
		"ID" : 1,
		"Name" : "Chevrolet Europe",
		"md_name" : "Aveo (T200) [GEN]",
		"ID_region" : 3,
		"ID_mark" : 1,
		"md_id" : 3,
		"md_type" : null,
		"YearFrom" : "2003",
		"YearTo" : "2008",
		"md_code" : "T02",
		"mf_id" : 130,
		"mf_code" : "2006",
		"mf_type" : null,
		"ID_model" : 3,
		"Body" : null,
		"Class" : null,
		"Capasity" : null,
		"Fuell" : null,
		"Transmission" : null,
		"DataRange" : "2006"
	},
	{
		"ID" : 1,
		"Name" : "Chevrolet Europe",
		"md_name" : "Aveo (T200) [GEN]",
		"ID_region" : 3,
		"ID_mark" : 1,
		"md_id" : 3,
		"md_type" : null,
		"YearFrom" : "2003",
		"YearTo" : "2008",
		"md_code" : "T02",
		"mf_id" : 138,
		"mf_code" : "2007",
		"mf_type" : null,
		"ID_model" : 3,
		"Body" : null,
		"Class" : null,
		"Capasity" : null,
		"Fuell" : null,
		"Transmission" : null,
		"DataRange" : "2007"
	},
	{
		"ID" : 1,
		"Name" : "Chevrolet Europe",
		"md_name" : "Aveo (T200) [GEN]",
		"ID_region" : 3,
		"ID_mark" : 1,
		"md_id" : 3,
		"md_type" : null,
		"YearFrom" : "2003",
		"YearTo" : "2008",
		"md_code" : "T02",
		"mf_id" : 144,
		"mf_code" : "2008",
		"mf_type" : null,
		"ID_model" : 3,
		"Body" : null,
		"Class" : null,
		"Capasity" : null,
		"Fuell" : null,
		"Transmission" : null,
		"DataRange" : "2008"
	},
	{
		"ID" : 1,
		"Name" : "Chevrolet Europe",
		"md_name" : "NUBIRA (J100) [EUR]",
		"ID_region" : 2,
		"ID_mark" : 1,
		"md_id" : 4,
		"md_type" : null,
		"YearFrom" : "1997",
		"YearTo" : "1999",
		"md_code" : "J97",
		"mf_id" : 14,
		"mf_code" : "1997",
		"mf_type" : null,
		"ID_model" : 4,
		"Body" : null,
		"Class" : null,
		"Capasity" : null,
		"Fuell" : null,
		"Transmission" : null,
		"DataRange" : "1997"
	},
	{
		"ID" : 1,
		"Name" : "Chevrolet Europe",
		"md_name" : "NUBIRA (J100) [EUR]",
		"ID_region" : 2,
		"ID_mark" : 1,
		"md_id" : 4,
		"md_type" : null,
		"YearFrom" : "1997",
		"YearTo" : "1999",
		"md_code" : "J97",
		"mf_id" : 16,
		"mf_code" : "1998",
		"mf_type" : null,
		"ID_model" : 4,
		"Body" : null,
		"Class" : null,
		"Capasity" : null,
		"Fuell" : null,
		"Transmission" : null,
		"DataRange" : "1998"
	},
	{
		"ID" : 1,
		"Name" : "Chevrolet Europe",
		"md_name" : "NUBIRA (J100) [EUR]",
		"ID_region" : 2,
		"ID_mark" : 1,
		"md_id" : 4,
		"md_type" : null,
		"YearFrom" : "1997",
		"YearTo" : "1999",
		"md_code" : "J97",
		"mf_id" : 20,
		"mf_code" : "1999",
		"mf_type" : null,
		"ID_model" : 4,
		"Body" : null,
		"Class" : null,
		"Capasity" : null,
		"Fuell" : null,
		"Transmission" : null,
		"DataRange" : "1999"
	},
	{
		"ID" : 1,
		"Name" : "Chevrolet Europe",
		"md_name" : "Leganza (V100) [GEN]",
		"ID_region" : 3,
		"ID_mark" : 1,
		"md_id" : 5,
		"md_type" : null,
		"YearFrom" : "1998",
		"YearTo" : "2002",
		"md_code" : "V97",
		"mf_id" : 88,
		"mf_code" : "1998",
		"mf_type" : null,
		"ID_model" : 5,
		"Body" : null,
		"Class" : null,
		"Capasity" : null,
		"Fuell" : null,
		"Transmission" : null,
		"DataRange" : "1998"
	},
	{
		"ID" : 1,
		"Name" : "Chevrolet Europe",
		"md_name" : "Leganza (V100) [GEN]",
		"ID_region" : 3,
		"ID_mark" : 1,
		"md_id" : 5,
		"md_type" : null,
		"YearFrom" : "1998",
		"YearTo" : "2002",
		"md_code" : "V97",
		"mf_id" : 92,
		"mf_code" : "1999",
		"mf_type" : null,
		"ID_model" : 5,
		"Body" : null,
		"Class" : null,
		"Capasity" : null,
		"Fuell" : null,
		"Transmission" : null,
		"DataRange" : "1999"
	},
	{
		"ID" : 1,
		"Name" : "Chevrolet Europe",
		"md_name" : "Leganza (V100) [GEN]",
		"ID_region" : 3,
		"ID_mark" : 1,
		"md_id" : 5,
		"md_type" : null,
		"YearFrom" : "1998",
		"YearTo" : "2002",
		"md_code" : "V97",
		"mf_id" : 97,
		"mf_code" : "2000",
		"mf_type" : null,
		"ID_model" : 5,
		"Body" : null,
		"Class" : null,
		"Capasity" : null,
		"Fuell" : null,
		"Transmission" : null,
		"DataRange" : "2000"
	},
	{
		"ID" : 1,
		"Name" : "Chevrolet Europe",
		"md_name" : "Leganza (V100) [GEN]",
		"ID_region" : 3,
		"ID_mark" : 1,
		"md_id" : 5,
		"md_type" : null,
		"YearFrom" : "1998",
		"YearTo" : "2002",
		"md_code" : "V97",
		"mf_id" : 102,
		"mf_code" : "2001",
		"mf_type" : null,
		"ID_model" : 5,
		"Body" : null,
		"Class" : null,
		"Capasity" : null,
		"Fuell" : null,
		"Transmission" : null,
		"DataRange" : "2001"
	},
	{
		"ID" : 1,
		"Name" : "Chevrolet Europe",
		"md_name" : "Leganza (V100) [GEN]",
		"ID_region" : 3,
		"ID_mark" : 1,
		"md_id" : 5,
		"md_type" : null,
		"YearFrom" : "1998",
		"YearTo" : "2002",
		"md_code" : "V97",
		"mf_id" : 107,
		"mf_code" : "2002",
		"mf_type" : null,
		"ID_model" : 5,
		"Body" : null,
		"Class" : null,
		"Capasity" : null,
		"Fuell" : null,
		"Transmission" : null,
		"DataRange" : "2002"
	},
	{
		"ID" : 1,
		"Name" : "Chevrolet Europe",
		"md_name" : "MATIZ + SPARK (M100) [EUR]",
		"ID_region" : 2,
		"ID_mark" : 1,
		"md_id" : 6,
		"md_type" : null,
		"YearFrom" : "1998",
		"YearTo" : "2005",
		"md_code" : "M98",
		"mf_id" : 17,
		"mf_code" : "1998",
		"mf_type" : null,
		"ID_model" : 6,
		"Body" : null,
		"Class" : null,
		"Capasity" : null,
		"Fuell" : null,
		"Transmission" : null,
		"DataRange" : "1998"
	},
	{
		"ID" : 1,
		"Name" : "Chevrolet Europe",
		"md_name" : "MATIZ + SPARK (M100) [EUR]",
		"ID_region" : 2,
		"ID_mark" : 1,
		"md_id" : 6,
		"md_type" : null,
		"YearFrom" : "1998",
		"YearTo" : "2005",
		"md_code" : "M98",
		"mf_id" : 21,
		"mf_code" : "1999",
		"mf_type" : null,
		"ID_model" : 6,
		"Body" : null,
		"Class" : null,
		"Capasity" : null,
		"Fuell" : null,
		"Transmission" : null,
		"DataRange" : "1999"
	},
	{
		"ID" : 1,
		"Name" : "Chevrolet Europe",
		"md_name" : "MATIZ + SPARK (M100) [EUR]",
		"ID_region" : 2,
		"ID_mark" : 1,
		"md_id" : 6,
		"md_type" : null,
		"YearFrom" : "1998",
		"YearTo" : "2005",
		"md_code" : "M98",
		"mf_id" : 25,
		"mf_code" : "2000",
		"mf_type" : null,
		"ID_model" : 6,
		"Body" : null,
		"Class" : null,
		"Capasity" : null,
		"Fuell" : null,
		"Transmission" : null,
		"DataRange" : "2000"
	},
	{
		"ID" : 1,
		"Name" : "Chevrolet Europe",
		"md_name" : "MATIZ + SPARK (M100) [EUR]",
		"ID_region" : 2,
		"ID_mark" : 1,
		"md_id" : 6,
		"md_type" : null,
		"YearFrom" : "1998",
		"YearTo" : "2005",
		"md_code" : "M98",
		"mf_id" : 30,
		"mf_code" : "2001",
		"mf_type" : null,
		"ID_model" : 6,
		"Body" : null,
		"Class" : null,
		"Capasity" : null,
		"Fuell" : null,
		"Transmission" : null,
		"DataRange" : "2001"
	},
	{
		"ID" : 1,
		"Name" : "Chevrolet Europe",
		"md_name" : "MATIZ + SPARK (M100) [EUR]",
		"ID_region" : 2,
		"ID_mark" : 1,
		"md_id" : 6,
		"md_type" : null,
		"YearFrom" : "1998",
		"YearTo" : "2005",
		"md_code" : "M98",
		"mf_id" : 35,
		"mf_code" : "2002",
		"mf_type" : null,
		"ID_model" : 6,
		"Body" : null,
		"Class" : null,
		"Capasity" : null,
		"Fuell" : null,
		"Transmission" : null,
		"DataRange" : "2002"
	},
	{
		"ID" : 1,
		"Name" : "Chevrolet Europe",
		"md_name" : "MATIZ + SPARK (M100) [EUR]",
		"ID_region" : 2,
		"ID_mark" : 1,
		"md_id" : 6,
		"md_type" : null,
		"YearFrom" : "1998",
		"YearTo" : "2005",
		"md_code" : "M98",
		"mf_id" : 40,
		"mf_code" : "2003",
		"mf_type" : null,
		"ID_model" : 6,
		"Body" : null,
		"Class" : null,
		"Capasity" : null,
		"Fuell" : null,
		"Transmission" : null,
		"DataRange" : "2003"
	},
	{
		"ID" : 1,
		"Name" : "Chevrolet Europe",
		"md_name" : "MATIZ + SPARK (M100) [EUR]",
		"ID_region" : 2,
		"ID_mark" : 1,
		"md_id" : 6,
		"md_type" : null,
		"YearFrom" : "1998",
		"YearTo" : "2005",
		"md_code" : "M98",
		"mf_id" : 46,
		"mf_code" : "2004",
		"mf_type" : null,
		"ID_model" : 6,
		"Body" : null,
		"Class" : null,
		"Capasity" : null,
		"Fuell" : null,
		"Transmission" : null,
		"DataRange" : "2004"
	},
	{
		"ID" : 1,
		"Name" : "Chevrolet Europe",
		"md_name" : "MATIZ + SPARK (M100) [EUR]",
		"ID_region" : 2,
		"ID_mark" : 1,
		"md_id" : 6,
		"md_type" : null,
		"YearFrom" : "1998",
		"YearTo" : "2005",
		"md_code" : "M98",
		"mf_id" : 51,
		"mf_code" : "2005",
		"mf_type" : null,
		"ID_model" : 6,
		"Body" : null,
		"Class" : null,
		"Capasity" : null,
		"Fuell" : null,
		"Transmission" : null,
		"DataRange" : "2005"
	},
	{
		"ID" : 1,
		"Name" : "Chevrolet Europe",
		"md_name" : "MATIZ + SPARK (M200) [EUR]",
		"ID_region" : 2,
		"ID_mark" : 1,
		"md_id" : 7,
		"md_type" : null,
		"YearFrom" : "2005",
		"YearTo" : "2010",
		"md_code" : "M04",
		"mf_id" : 52,
		"mf_code" : "2005",
		"mf_type" : null,
		"ID_model" : 7,
		"Body" : null,
		"Class" : null,
		"Capasity" : null,
		"Fuell" : null,
		"Transmission" : null,
		"DataRange" : "2005"
	},
	{
		"ID" : 1,
		"Name" : "Chevrolet Europe",
		"md_name" : "MATIZ + SPARK (M200) [EUR]",
		"ID_region" : 2,
		"ID_mark" : 1,
		"md_id" : 7,
		"md_type" : null,
		"YearFrom" : "2005",
		"YearTo" : "2010",
		"md_code" : "M04",
		"mf_id" : 57,
		"mf_code" : "2006",
		"mf_type" : null,
		"ID_model" : 7,
		"Body" : null,
		"Class" : null,
		"Capasity" : null,
		"Fuell" : null,
		"Transmission" : null,
		"DataRange" : "2006"
	},
	{
		"ID" : 1,
		"Name" : "Chevrolet Europe",
		"md_name" : "MATIZ + SPARK (M200) [EUR]",
		"ID_region" : 2,
		"ID_mark" : 1,
		"md_id" : 7,
		"md_type" : null,
		"YearFrom" : "2005",
		"YearTo" : "2010",
		"md_code" : "M04",
		"mf_id" : 63,
		"mf_code" : "2007",
		"mf_type" : null,
		"ID_model" : 7,
		"Body" : null,
		"Class" : null,
		"Capasity" : null,
		"Fuell" : null,
		"Transmission" : null,
		"DataRange" : "2007"
	},
	{
		"ID" : 1,
		"Name" : "Chevrolet Europe",
		"md_name" : "MATIZ + SPARK (M200) [EUR]",
		"ID_region" : 2,
		"ID_mark" : 1,
		"md_id" : 7,
		"md_type" : null,
		"YearFrom" : "2005",
		"YearTo" : "2010",
		"md_code" : "M04",
		"mf_id" : 69,
		"mf_code" : "2008",
		"mf_type" : null,
		"ID_model" : 7,
		"Body" : null,
		"Class" : null,
		"Capasity" : null,
		"Fuell" : null,
		"Transmission" : null,
		"DataRange" : "2008"
	},
	{
		"ID" : 1,
		"Name" : "Chevrolet Europe",
		"md_name" : "MATIZ + SPARK (M200) [EUR]",
		"ID_region" : 2,
		"ID_mark" : 1,
		"md_id" : 7,
		"md_type" : null,
		"YearFrom" : "2005",
		"YearTo" : "2010",
		"md_code" : "M04",
		"mf_id" : 75,
		"mf_code" : "2009",
		"mf_type" : null,
		"ID_model" : 7,
		"Body" : null,
		"Class" : null,
		"Capasity" : null,
		"Fuell" : null,
		"Transmission" : null,
		"DataRange" : "2009"
	},
	{
		"ID" : 1,
		"Name" : "Chevrolet Europe",
		"md_name" : "MATIZ + SPARK (M200) [EUR]",
		"ID_region" : 2,
		"ID_mark" : 1,
		"md_id" : 7,
		"md_type" : null,
		"YearFrom" : "2005",
		"YearTo" : "2010",
		"md_code" : "M04",
		"mf_id" : 79,
		"mf_code" : "2010",
		"mf_type" : null,
		"ID_model" : 7,
		"Body" : null,
		"Class" : null,
		"Capasity" : null,
		"Fuell" : null,
		"Transmission" : null,
		"DataRange" : "2010"
	},
	{
		"ID" : 1,
		"Name" : "Chevrolet Europe",
		"md_name" : "LANOS (T100) [EUR]",
		"ID_region" : 2,
		"ID_mark" : 1,
		"md_id" : 8,
		"md_type" : null,
		"YearFrom" : "1997",
		"YearTo" : "2002",
		"md_code" : "T97",
		"mf_id" : 15,
		"mf_code" : "1997",
		"mf_type" : null,
		"ID_model" : 8,
		"Body" : null,
		"Class" : null,
		"Capasity" : null,
		"Fuell" : null,
		"Transmission" : null,
		"DataRange" : "1997"
	},
	{
		"ID" : 1,
		"Name" : "Chevrolet Europe",
		"md_name" : "LANOS (T100) [EUR]",
		"ID_region" : 2,
		"ID_mark" : 1,
		"md_id" : 8,
		"md_type" : null,
		"YearFrom" : "1997",
		"YearTo" : "2002",
		"md_code" : "T97",
		"mf_id" : 18,
		"mf_code" : "1998",
		"mf_type" : null,
		"ID_model" : 8,
		"Body" : null,
		"Class" : null,
		"Capasity" : null,
		"Fuell" : null,
		"Transmission" : null,
		"DataRange" : "1998"
	},
	{
		"ID" : 1,
		"Name" : "Chevrolet Europe",
		"md_name" : "LANOS (T100) [EUR]",
		"ID_region" : 2,
		"ID_mark" : 1,
		"md_id" : 8,
		"md_type" : null,
		"YearFrom" : "1997",
		"YearTo" : "2002",
		"md_code" : "T97",
		"mf_id" : 22,
		"mf_code" : "1999",
		"mf_type" : null,
		"ID_model" : 8,
		"Body" : null,
		"Class" : null,
		"Capasity" : null,
		"Fuell" : null,
		"Transmission" : null,
		"DataRange" : "1999"
	},
	{
		"ID" : 1,
		"Name" : "Chevrolet Europe",
		"md_name" : "LANOS (T100) [EUR]",
		"ID_region" : 2,
		"ID_mark" : 1,
		"md_id" : 8,
		"md_type" : null,
		"YearFrom" : "1997",
		"YearTo" : "2002",
		"md_code" : "T97",
		"mf_id" : 26,
		"mf_code" : "2000",
		"mf_type" : null,
		"ID_model" : 8,
		"Body" : null,
		"Class" : null,
		"Capasity" : null,
		"Fuell" : null,
		"Transmission" : null,
		"DataRange" : "2000"
	},
	{
		"ID" : 1,
		"Name" : "Chevrolet Europe",
		"md_name" : "LANOS (T100) [EUR]",
		"ID_region" : 2,
		"ID_mark" : 1,
		"md_id" : 8,
		"md_type" : null,
		"YearFrom" : "1997",
		"YearTo" : "2002",
		"md_code" : "T97",
		"mf_id" : 31,
		"mf_code" : "2001",
		"mf_type" : null,
		"ID_model" : 8,
		"Body" : null,
		"Class" : null,
		"Capasity" : null,
		"Fuell" : null,
		"Transmission" : null,
		"DataRange" : "2001"
	},
	{
		"ID" : 1,
		"Name" : "Chevrolet Europe",
		"md_name" : "LANOS (T100) [EUR]",
		"ID_region" : 2,
		"ID_mark" : 1,
		"md_id" : 8,
		"md_type" : null,
		"YearFrom" : "1997",
		"YearTo" : "2002",
		"md_code" : "T97",
		"mf_id" : 36,
		"mf_code" : "2002",
		"mf_type" : null,
		"ID_model" : 8,
		"Body" : null,
		"Class" : null,
		"Capasity" : null,
		"Fuell" : null,
		"Transmission" : null,
		"DataRange" : "2002"
	},
	{
		"ID" : 1,
		"Name" : "Chevrolet Europe",
		"md_name" : "AVEO (T255) [EUR]",
		"ID_region" : 2,
		"ID_mark" : 1,
		"md_id" : 9,
		"md_type" : null,
		"YearFrom" : "2006",
		"YearTo" : "2011",
		"md_code" : "T06",
		"mf_id" : 58,
		"mf_code" : "2006",
		"mf_type" : null,
		"ID_model" : 9,
		"Body" : null,
		"Class" : null,
		"Capasity" : null,
		"Fuell" : null,
		"Transmission" : null,
		"DataRange" : "2006"
	},
	{
		"ID" : 1,
		"Name" : "Chevrolet Europe",
		"md_name" : "AVEO (T255) [EUR]",
		"ID_region" : 2,
		"ID_mark" : 1,
		"md_id" : 9,
		"md_type" : null,
		"YearFrom" : "2006",
		"YearTo" : "2011",
		"md_code" : "T06",
		"mf_id" : 64,
		"mf_code" : "2007",
		"mf_type" : null,
		"ID_model" : 9,
		"Body" : null,
		"Class" : null,
		"Capasity" : null,
		"Fuell" : null,
		"Transmission" : null,
		"DataRange" : "2007"
	},
	{
		"ID" : 1,
		"Name" : "Chevrolet Europe",
		"md_name" : "AVEO (T255) [EUR]",
		"ID_region" : 2,
		"ID_mark" : 1,
		"md_id" : 9,
		"md_type" : null,
		"YearFrom" : "2006",
		"YearTo" : "2011",
		"md_code" : "T06",
		"mf_id" : 70,
		"mf_code" : "2008",
		"mf_type" : null,
		"ID_model" : 9,
		"Body" : null,
		"Class" : null,
		"Capasity" : null,
		"Fuell" : null,
		"Transmission" : null,
		"DataRange" : "2008"
	},
	{
		"ID" : 1,
		"Name" : "Chevrolet Europe",
		"md_name" : "AVEO (T255) [EUR]",
		"ID_region" : 2,
		"ID_mark" : 1,
		"md_id" : 9,
		"md_type" : null,
		"YearFrom" : "2006",
		"YearTo" : "2011",
		"md_code" : "T06",
		"mf_id" : 76,
		"mf_code" : "2009",
		"mf_type" : null,
		"ID_model" : 9,
		"Body" : null,
		"Class" : null,
		"Capasity" : null,
		"Fuell" : null,
		"Transmission" : null,
		"DataRange" : "2009"
	},
	{
		"ID" : 1,
		"Name" : "Chevrolet Europe",
		"md_name" : "AVEO (T255) [EUR]",
		"ID_region" : 2,
		"ID_mark" : 1,
		"md_id" : 9,
		"md_type" : null,
		"YearFrom" : "2006",
		"YearTo" : "2011",
		"md_code" : "T06",
		"mf_id" : 80,
		"mf_code" : "2010",
		"mf_type" : null,
		"ID_model" : 9,
		"Body" : null,
		"Class" : null,
		"Capasity" : null,
		"Fuell" : null,
		"Transmission" : null,
		"DataRange" : "2010"
	},
	{
		"ID" : 1,
		"Name" : "Chevrolet Europe",
		"md_name" : "AVEO (T255) [EUR]",
		"ID_region" : 2,
		"ID_mark" : 1,
		"md_id" : 9,
		"md_type" : null,
		"YearFrom" : "2006",
		"YearTo" : "2011",
		"md_code" : "T06",
		"mf_id" : 83,
		"mf_code" : "2011",
		"mf_type" : null,
		"ID_model" : 9,
		"Body" : null,
		"Class" : null,
		"Capasity" : null,
		"Fuell" : null,
		"Transmission" : null,
		"DataRange" : "2011"
	},
	{
		"ID" : 1,
		"Name" : "Chevrolet Europe",
		"md_name" : "Nubira (J100) [GEN]",
		"ID_region" : 3,
		"ID_mark" : 1,
		"md_id" : 10,
		"md_type" : null,
		"YearFrom" : "1997",
		"YearTo" : "1999",
		"md_code" : "J97",
		"mf_id" : 86,
		"mf_code" : "1997",
		"mf_type" : null,
		"ID_model" : 10,
		"Body" : null,
		"Class" : null,
		"Capasity" : null,
		"Fuell" : null,
		"Transmission" : null,
		"DataRange" : "1997"
	},
	{
		"ID" : 1,
		"Name" : "Chevrolet Europe",
		"md_name" : "Nubira (J100) [GEN]",
		"ID_region" : 3,
		"ID_mark" : 1,
		"md_id" : 10,
		"md_type" : null,
		"YearFrom" : "1997",
		"YearTo" : "1999",
		"md_code" : "J97",
		"mf_id" : 89,
		"mf_code" : "1998",
		"mf_type" : null,
		"ID_model" : 10,
		"Body" : null,
		"Class" : null,
		"Capasity" : null,
		"Fuell" : null,
		"Transmission" : null,
		"DataRange" : "1998"
	},
	{
		"ID" : 1,
		"Name" : "Chevrolet Europe",
		"md_name" : "Nubira (J100) [GEN]",
		"ID_region" : 3,
		"ID_mark" : 1,
		"md_id" : 10,
		"md_type" : null,
		"YearFrom" : "1997",
		"YearTo" : "1999",
		"md_code" : "J97",
		"mf_id" : 93,
		"mf_code" : "1999",
		"mf_type" : null,
		"ID_model" : 10,
		"Body" : null,
		"Class" : null,
		"Capasity" : null,
		"Fuell" : null,
		"Transmission" : null,
		"DataRange" : "1999"
	},
	{
		"ID" : 1,
		"Name" : "Chevrolet Europe",
		"md_name" : "Vivant (U100) [GEN]",
		"ID_region" : 3,
		"ID_mark" : 1,
		"md_id" : 11,
		"md_type" : null,
		"YearFrom" : "2000",
		"YearTo" : "2008",
		"md_code" : "U00",
		"mf_id" : 98,
		"mf_code" : "2000",
		"mf_type" : null,
		"ID_model" : 11,
		"Body" : null,
		"Class" : null,
		"Capasity" : null,
		"Fuell" : null,
		"Transmission" : null,
		"DataRange" : "2000"
	},
	{
		"ID" : 1,
		"Name" : "Chevrolet Europe",
		"md_name" : "Vivant (U100) [GEN]",
		"ID_region" : 3,
		"ID_mark" : 1,
		"md_id" : 11,
		"md_type" : null,
		"YearFrom" : "2000",
		"YearTo" : "2008",
		"md_code" : "U00",
		"mf_id" : 103,
		"mf_code" : "2001",
		"mf_type" : null,
		"ID_model" : 11,
		"Body" : null,
		"Class" : null,
		"Capasity" : null,
		"Fuell" : null,
		"Transmission" : null,
		"DataRange" : "2001"
	},
	{
		"ID" : 1,
		"Name" : "Chevrolet Europe",
		"md_name" : "Vivant (U100) [GEN]",
		"ID_region" : 3,
		"ID_mark" : 1,
		"md_id" : 11,
		"md_type" : null,
		"YearFrom" : "2000",
		"YearTo" : "2008",
		"md_code" : "U00",
		"mf_id" : 108,
		"mf_code" : "2002",
		"mf_type" : null,
		"ID_model" : 11,
		"Body" : null,
		"Class" : null,
		"Capasity" : null,
		"Fuell" : null,
		"Transmission" : null,
		"DataRange" : "2002"
	},
	{
		"ID" : 1,
		"Name" : "Chevrolet Europe",
		"md_name" : "Vivant (U100) [GEN]",
		"ID_region" : 3,
		"ID_mark" : 1,
		"md_id" : 11,
		"md_type" : null,
		"YearFrom" : "2000",
		"YearTo" : "2008",
		"md_code" : "U00",
		"mf_id" : 113,
		"mf_code" : "2003",
		"mf_type" : null,
		"ID_model" : 11,
		"Body" : null,
		"Class" : null,
		"Capasity" : null,
		"Fuell" : null,
		"Transmission" : null,
		"DataRange" : "2003"
	},
	{
		"ID" : 1,
		"Name" : "Chevrolet Europe",
		"md_name" : "Vivant (U100) [GEN]",
		"ID_region" : 3,
		"ID_mark" : 1,
		"md_id" : 11,
		"md_type" : null,
		"YearFrom" : "2000",
		"YearTo" : "2008",
		"md_code" : "U00",
		"mf_id" : 119,
		"mf_code" : "2004",
		"mf_type" : null,
		"ID_model" : 11,
		"Body" : null,
		"Class" : null,
		"Capasity" : null,
		"Fuell" : null,
		"Transmission" : null,
		"DataRange" : "2004"
	},
	{
		"ID" : 1,
		"Name" : "Chevrolet Europe",
		"md_name" : "Vivant (U100) [GEN]",
		"ID_region" : 3,
		"ID_mark" : 1,
		"md_id" : 11,
		"md_type" : null,
		"YearFrom" : "2000",
		"YearTo" : "2008",
		"md_code" : "U00",
		"mf_id" : 125,
		"mf_code" : "2005",
		"mf_type" : null,
		"ID_model" : 11,
		"Body" : null,
		"Class" : null,
		"Capasity" : null,
		"Fuell" : null,
		"Transmission" : null,
		"DataRange" : "2005"
	},
	{
		"ID" : 1,
		"Name" : "Chevrolet Europe",
		"md_name" : "Vivant (U100) [GEN]",
		"ID_region" : 3,
		"ID_mark" : 1,
		"md_id" : 11,
		"md_type" : null,
		"YearFrom" : "2000",
		"YearTo" : "2008",
		"md_code" : "U00",
		"mf_id" : 131,
		"mf_code" : "2006",
		"mf_type" : null,
		"ID_model" : 11,
		"Body" : null,
		"Class" : null,
		"Capasity" : null,
		"Fuell" : null,
		"Transmission" : null,
		"DataRange" : "2006"
	},
	{
		"ID" : 1,
		"Name" : "Chevrolet Europe",
		"md_name" : "Vivant (U100) [GEN]",
		"ID_region" : 3,
		"ID_mark" : 1,
		"md_id" : 11,
		"md_type" : null,
		"YearFrom" : "2000",
		"YearTo" : "2008",
		"md_code" : "U00",
		"mf_id" : 139,
		"mf_code" : "2007",
		"mf_type" : null,
		"ID_model" : 11,
		"Body" : null,
		"Class" : null,
		"Capasity" : null,
		"Fuell" : null,
		"Transmission" : null,
		"DataRange" : "2007"
	},
	{
		"ID" : 1,
		"Name" : "Chevrolet Europe",
		"md_name" : "Vivant (U100) [GEN]",
		"ID_region" : 3,
		"ID_mark" : 1,
		"md_id" : 11,
		"md_type" : null,
		"YearFrom" : "2000",
		"YearTo" : "2008",
		"md_code" : "U00",
		"mf_id" : 145,
		"mf_code" : "2008",
		"mf_type" : null,
		"ID_model" : 11,
		"Body" : null,
		"Class" : null,
		"Capasity" : null,
		"Fuell" : null,
		"Transmission" : null,
		"DataRange" : "2008"
	},
	{
		"ID" : 1,
		"Name" : "Chevrolet Europe",
		"md_name" : "EPICA (V250) [EUR]",
		"ID_region" : 2,
		"ID_mark" : 1,
		"md_id" : 12,
		"md_type" : null,
		"YearFrom" : "2007",
		"YearTo" : "2011",
		"md_code" : "V06",
		"mf_id" : 65,
		"mf_code" : "2007",
		"mf_type" : null,
		"ID_model" : 12,
		"Body" : null,
		"Class" : null,
		"Capasity" : null,
		"Fuell" : null,
		"Transmission" : null,
		"DataRange" : "2007"
	},
	{
		"ID" : 1,
		"Name" : "Chevrolet Europe",
		"md_name" : "EPICA (V250) [EUR]",
		"ID_region" : 2,
		"ID_mark" : 1,
		"md_id" : 12,
		"md_type" : null,
		"YearFrom" : "2007",
		"YearTo" : "2011",
		"md_code" : "V06",
		"mf_id" : 71,
		"mf_code" : "2008",
		"mf_type" : null,
		"ID_model" : 12,
		"Body" : null,
		"Class" : null,
		"Capasity" : null,
		"Fuell" : null,
		"Transmission" : null,
		"DataRange" : "2008"
	},
	{
		"ID" : 1,
		"Name" : "Chevrolet Europe",
		"md_name" : "EPICA (V250) [EUR]",
		"ID_region" : 2,
		"ID_mark" : 1,
		"md_id" : 12,
		"md_type" : null,
		"YearFrom" : "2007",
		"YearTo" : "2011",
		"md_code" : "V06",
		"mf_id" : 77,
		"mf_code" : "2009",
		"mf_type" : null,
		"ID_model" : 12,
		"Body" : null,
		"Class" : null,
		"Capasity" : null,
		"Fuell" : null,
		"Transmission" : null,
		"DataRange" : "2009"
	},
	{
		"ID" : 1,
		"Name" : "Chevrolet Europe",
		"md_name" : "EPICA (V250) [EUR]",
		"ID_region" : 2,
		"ID_mark" : 1,
		"md_id" : 12,
		"md_type" : null,
		"YearFrom" : "2007",
		"YearTo" : "2011",
		"md_code" : "V06",
		"mf_id" : 81,
		"mf_code" : "2010",
		"mf_type" : null,
		"ID_model" : 12,
		"Body" : null,
		"Class" : null,
		"Capasity" : null,
		"Fuell" : null,
		"Transmission" : null,
		"DataRange" : "2010"
	},
	{
		"ID" : 1,
		"Name" : "Chevrolet Europe",
		"md_name" : "EPICA (V250) [EUR]",
		"ID_region" : 2,
		"ID_mark" : 1,
		"md_id" : 12,
		"md_type" : null,
		"YearFrom" : "2007",
		"YearTo" : "2011",
		"md_code" : "V06",
		"mf_id" : 84,
		"mf_code" : "2011",
		"mf_type" : null,
		"ID_model" : 12,
		"Body" : null,
		"Class" : null,
		"Capasity" : null,
		"Fuell" : null,
		"Transmission" : null,
		"DataRange" : "2011"
	},
	{
		"ID" : 1,
		"Name" : "Chevrolet Europe",
		"md_name" : "Aveo (T255) [GEN]",
		"ID_region" : 3,
		"ID_mark" : 1,
		"md_id" : 13,
		"md_type" : null,
		"YearFrom" : "2006",
		"YearTo" : "2011",
		"md_code" : "T06",
		"mf_id" : 132,
		"mf_code" : "2006",
		"mf_type" : null,
		"ID_model" : 13,
		"Body" : null,
		"Class" : null,
		"Capasity" : null,
		"Fuell" : null,
		"Transmission" : null,
		"DataRange" : "2006"
	},
	{
		"ID" : 1,
		"Name" : "Chevrolet Europe",
		"md_name" : "Aveo (T255) [GEN]",
		"ID_region" : 3,
		"ID_mark" : 1,
		"md_id" : 13,
		"md_type" : null,
		"YearFrom" : "2006",
		"YearTo" : "2011",
		"md_code" : "T06",
		"mf_id" : 140,
		"mf_code" : "2007",
		"mf_type" : null,
		"ID_model" : 13,
		"Body" : null,
		"Class" : null,
		"Capasity" : null,
		"Fuell" : null,
		"Transmission" : null,
		"DataRange" : "2007"
	},
	{
		"ID" : 1,
		"Name" : "Chevrolet Europe",
		"md_name" : "Aveo (T255) [GEN]",
		"ID_region" : 3,
		"ID_mark" : 1,
		"md_id" : 13,
		"md_type" : null,
		"YearFrom" : "2006",
		"YearTo" : "2011",
		"md_code" : "T06",
		"mf_id" : 146,
		"mf_code" : "2008",
		"mf_type" : null,
		"ID_model" : 13,
		"Body" : null,
		"Class" : null,
		"Capasity" : null,
		"Fuell" : null,
		"Transmission" : null,
		"DataRange" : "2008"
	},
	{
		"ID" : 1,
		"Name" : "Chevrolet Europe",
		"md_name" : "Aveo (T255) [GEN]",
		"ID_region" : 3,
		"ID_mark" : 1,
		"md_id" : 13,
		"md_type" : null,
		"YearFrom" : "2006",
		"YearTo" : "2011",
		"md_code" : "T06",
		"mf_id" : 150,
		"mf_code" : "2009",
		"mf_type" : null,
		"ID_model" : 13,
		"Body" : null,
		"Class" : null,
		"Capasity" : null,
		"Fuell" : null,
		"Transmission" : null,
		"DataRange" : "2009"
	},
	{
		"ID" : 1,
		"Name" : "Chevrolet Europe",
		"md_name" : "Aveo (T255) [GEN]",
		"ID_region" : 3,
		"ID_mark" : 1,
		"md_id" : 13,
		"md_type" : null,
		"YearFrom" : "2006",
		"YearTo" : "2011",
		"md_code" : "T06",
		"mf_id" : 154,
		"mf_code" : "2010",
		"mf_type" : null,
		"ID_model" : 13,
		"Body" : null,
		"Class" : null,
		"Capasity" : null,
		"Fuell" : null,
		"Transmission" : null,
		"DataRange" : "2010"
	},
	{
		"ID" : 1,
		"Name" : "Chevrolet Europe",
		"md_name" : "Aveo (T255) [GEN]",
		"ID_region" : 3,
		"ID_mark" : 1,
		"md_id" : 13,
		"md_type" : null,
		"YearFrom" : "2006",
		"YearTo" : "2011",
		"md_code" : "T06",
		"mf_id" : 158,
		"mf_code" : "2011",
		"mf_type" : null,
		"ID_model" : 13,
		"Body" : null,
		"Class" : null,
		"Capasity" : null,
		"Fuell" : null,
		"Transmission" : null,
		"DataRange" : "2011"
	},
	{
		"ID" : 1,
		"Name" : "Chevrolet Europe",
		"md_name" : "Matiz + Spark (M100) [GEN]",
		"ID_region" : 3,
		"ID_mark" : 1,
		"md_id" : 14,
		"md_type" : null,
		"YearFrom" : "1998",
		"YearTo" : "2006",
		"md_code" : "M98",
		"mf_id" : 90,
		"mf_code" : "1998",
		"mf_type" : null,
		"ID_model" : 14,
		"Body" : null,
		"Class" : null,
		"Capasity" : null,
		"Fuell" : null,
		"Transmission" : null,
		"DataRange" : "1998"
	},
	{
		"ID" : 1,
		"Name" : "Chevrolet Europe",
		"md_name" : "Matiz + Spark (M100) [GEN]",
		"ID_region" : 3,
		"ID_mark" : 1,
		"md_id" : 14,
		"md_type" : null,
		"YearFrom" : "1998",
		"YearTo" : "2006",
		"md_code" : "M98",
		"mf_id" : 94,
		"mf_code" : "1999",
		"mf_type" : null,
		"ID_model" : 14,
		"Body" : null,
		"Class" : null,
		"Capasity" : null,
		"Fuell" : null,
		"Transmission" : null,
		"DataRange" : "1999"
	},
	{
		"ID" : 1,
		"Name" : "Chevrolet Europe",
		"md_name" : "Matiz + Spark (M100) [GEN]",
		"ID_region" : 3,
		"ID_mark" : 1,
		"md_id" : 14,
		"md_type" : null,
		"YearFrom" : "1998",
		"YearTo" : "2006",
		"md_code" : "M98",
		"mf_id" : 99,
		"mf_code" : "2000",
		"mf_type" : null,
		"ID_model" : 14,
		"Body" : null,
		"Class" : null,
		"Capasity" : null,
		"Fuell" : null,
		"Transmission" : null,
		"DataRange" : "2000"
	},
	{
		"ID" : 1,
		"Name" : "Chevrolet Europe",
		"md_name" : "Matiz + Spark (M100) [GEN]",
		"ID_region" : 3,
		"ID_mark" : 1,
		"md_id" : 14,
		"md_type" : null,
		"YearFrom" : "1998",
		"YearTo" : "2006",
		"md_code" : "M98",
		"mf_id" : 104,
		"mf_code" : "2001",
		"mf_type" : null,
		"ID_model" : 14,
		"Body" : null,
		"Class" : null,
		"Capasity" : null,
		"Fuell" : null,
		"Transmission" : null,
		"DataRange" : "2001"
	},
	{
		"ID" : 1,
		"Name" : "Chevrolet Europe",
		"md_name" : "Matiz + Spark (M100) [GEN]",
		"ID_region" : 3,
		"ID_mark" : 1,
		"md_id" : 14,
		"md_type" : null,
		"YearFrom" : "1998",
		"YearTo" : "2006",
		"md_code" : "M98",
		"mf_id" : 109,
		"mf_code" : "2002",
		"mf_type" : null,
		"ID_model" : 14,
		"Body" : null,
		"Class" : null,
		"Capasity" : null,
		"Fuell" : null,
		"Transmission" : null,
		"DataRange" : "2002"
	},
	{
		"ID" : 1,
		"Name" : "Chevrolet Europe",
		"md_name" : "Matiz + Spark (M100) [GEN]",
		"ID_region" : 3,
		"ID_mark" : 1,
		"md_id" : 14,
		"md_type" : null,
		"YearFrom" : "1998",
		"YearTo" : "2006",
		"md_code" : "M98",
		"mf_id" : 114,
		"mf_code" : "2003",
		"mf_type" : null,
		"ID_model" : 14,
		"Body" : null,
		"Class" : null,
		"Capasity" : null,
		"Fuell" : null,
		"Transmission" : null,
		"DataRange" : "2003"
	},
	{
		"ID" : 1,
		"Name" : "Chevrolet Europe",
		"md_name" : "Matiz + Spark (M100) [GEN]",
		"ID_region" : 3,
		"ID_mark" : 1,
		"md_id" : 14,
		"md_type" : null,
		"YearFrom" : "1998",
		"YearTo" : "2006",
		"md_code" : "M98",
		"mf_id" : 120,
		"mf_code" : "2004",
		"mf_type" : null,
		"ID_model" : 14,
		"Body" : null,
		"Class" : null,
		"Capasity" : null,
		"Fuell" : null,
		"Transmission" : null,
		"DataRange" : "2004"
	},
	{
		"ID" : 1,
		"Name" : "Chevrolet Europe",
		"md_name" : "Matiz + Spark (M100) [GEN]",
		"ID_region" : 3,
		"ID_mark" : 1,
		"md_id" : 14,
		"md_type" : null,
		"YearFrom" : "1998",
		"YearTo" : "2006",
		"md_code" : "M98",
		"mf_id" : 126,
		"mf_code" : "2005",
		"mf_type" : null,
		"ID_model" : 14,
		"Body" : null,
		"Class" : null,
		"Capasity" : null,
		"Fuell" : null,
		"Transmission" : null,
		"DataRange" : "2005"
	},
	{
		"ID" : 1,
		"Name" : "Chevrolet Europe",
		"md_name" : "Matiz + Spark (M100) [GEN]",
		"ID_region" : 3,
		"ID_mark" : 1,
		"md_id" : 14,
		"md_type" : null,
		"YearFrom" : "1998",
		"YearTo" : "2006",
		"md_code" : "M98",
		"mf_id" : 133,
		"mf_code" : "2006",
		"mf_type" : null,
		"ID_model" : 14,
		"Body" : null,
		"Class" : null,
		"Capasity" : null,
		"Fuell" : null,
		"Transmission" : null,
		"DataRange" : "2006"
	},
	{
		"ID" : 1,
		"Name" : "Chevrolet Europe",
		"md_name" : "NUBIRA (J150) [EUR]",
		"ID_region" : 2,
		"ID_mark" : 1,
		"md_id" : 15,
		"md_type" : null,
		"YearFrom" : "1999",
		"YearTo" : "2003",
		"md_code" : "J99",
		"mf_id" : 23,
		"mf_code" : "1999",
		"mf_type" : null,
		"ID_model" : 15,
		"Body" : null,
		"Class" : null,
		"Capasity" : null,
		"Fuell" : null,
		"Transmission" : null,
		"DataRange" : "1999"
	},
	{
		"ID" : 1,
		"Name" : "Chevrolet Europe",
		"md_name" : "NUBIRA (J150) [EUR]",
		"ID_region" : 2,
		"ID_mark" : 1,
		"md_id" : 15,
		"md_type" : null,
		"YearFrom" : "1999",
		"YearTo" : "2003",
		"md_code" : "J99",
		"mf_id" : 27,
		"mf_code" : "2000",
		"mf_type" : null,
		"ID_model" : 15,
		"Body" : null,
		"Class" : null,
		"Capasity" : null,
		"Fuell" : null,
		"Transmission" : null,
		"DataRange" : "2000"
	},
	{
		"ID" : 1,
		"Name" : "Chevrolet Europe",
		"md_name" : "NUBIRA (J150) [EUR]",
		"ID_region" : 2,
		"ID_mark" : 1,
		"md_id" : 15,
		"md_type" : null,
		"YearFrom" : "1999",
		"YearTo" : "2003",
		"md_code" : "J99",
		"mf_id" : 32,
		"mf_code" : "2001",
		"mf_type" : null,
		"ID_model" : 15,
		"Body" : null,
		"Class" : null,
		"Capasity" : null,
		"Fuell" : null,
		"Transmission" : null,
		"DataRange" : "2001"
	},
	{
		"ID" : 1,
		"Name" : "Chevrolet Europe",
		"md_name" : "NUBIRA (J150) [EUR]",
		"ID_region" : 2,
		"ID_mark" : 1,
		"md_id" : 15,
		"md_type" : null,
		"YearFrom" : "1999",
		"YearTo" : "2003",
		"md_code" : "J99",
		"mf_id" : 37,
		"mf_code" : "2002",
		"mf_type" : null,
		"ID_model" : 15,
		"Body" : null,
		"Class" : null,
		"Capasity" : null,
		"Fuell" : null,
		"Transmission" : null,
		"DataRange" : "2002"
	},
	{
		"ID" : 1,
		"Name" : "Chevrolet Europe",
		"md_name" : "NUBIRA (J150) [EUR]",
		"ID_region" : 2,
		"ID_mark" : 1,
		"md_id" : 15,
		"md_type" : null,
		"YearFrom" : "1999",
		"YearTo" : "2003",
		"md_code" : "J99",
		"mf_id" : 41,
		"mf_code" : "2003",
		"mf_type" : null,
		"ID_model" : 15,
		"Body" : null,
		"Class" : null,
		"Capasity" : null,
		"Fuell" : null,
		"Transmission" : null,
		"DataRange" : "2003"
	},
	{
		"ID" : 1,
		"Name" : "Chevrolet Europe",
		"md_name" : "EVANDA (V200) [EUR]",
		"ID_region" : 2,
		"ID_mark" : 1,
		"md_id" : 16,
		"md_type" : null,
		"YearFrom" : "2003",
		"YearTo" : "2006",
		"md_code" : "V99",
		"mf_id" : 42,
		"mf_code" : "2003",
		"mf_type" : null,
		"ID_model" : 16,
		"Body" : null,
		"Class" : null,
		"Capasity" : null,
		"Fuell" : null,
		"Transmission" : null,
		"DataRange" : "2003"
	},
	{
		"ID" : 1,
		"Name" : "Chevrolet Europe",
		"md_name" : "EVANDA (V200) [EUR]",
		"ID_region" : 2,
		"ID_mark" : 1,
		"md_id" : 16,
		"md_type" : null,
		"YearFrom" : "2003",
		"YearTo" : "2006",
		"md_code" : "V99",
		"mf_id" : 47,
		"mf_code" : "2004",
		"mf_type" : null,
		"ID_model" : 16,
		"Body" : null,
		"Class" : null,
		"Capasity" : null,
		"Fuell" : null,
		"Transmission" : null,
		"DataRange" : "2004"
	},
	{
		"ID" : 1,
		"Name" : "Chevrolet Europe",
		"md_name" : "EVANDA (V200) [EUR]",
		"ID_region" : 2,
		"ID_mark" : 1,
		"md_id" : 16,
		"md_type" : null,
		"YearFrom" : "2003",
		"YearTo" : "2006",
		"md_code" : "V99",
		"mf_id" : 53,
		"mf_code" : "2005",
		"mf_type" : null,
		"ID_model" : 16,
		"Body" : null,
		"Class" : null,
		"Capasity" : null,
		"Fuell" : null,
		"Transmission" : null,
		"DataRange" : "2005"
	},
	{
		"ID" : 1,
		"Name" : "Chevrolet Europe",
		"md_name" : "EVANDA (V200) [EUR]",
		"ID_region" : 2,
		"ID_mark" : 1,
		"md_id" : 16,
		"md_type" : null,
		"YearFrom" : "2003",
		"YearTo" : "2006",
		"md_code" : "V99",
		"mf_id" : 59,
		"mf_code" : "2006",
		"mf_type" : null,
		"ID_model" : 16,
		"Body" : null,
		"Class" : null,
		"Capasity" : null,
		"Fuell" : null,
		"Transmission" : null,
		"DataRange" : "2006"
	},
	{
		"ID" : 1,
		"Name" : "Chevrolet Europe",
		"md_name" : "Nubira (J150) [GEN]",
		"ID_region" : 3,
		"ID_mark" : 1,
		"md_id" : 17,
		"md_type" : null,
		"YearFrom" : "1999",
		"YearTo" : "2003",
		"md_code" : "J99",
		"mf_id" : 95,
		"mf_code" : "1999",
		"mf_type" : null,
		"ID_model" : 17,
		"Body" : null,
		"Class" : null,
		"Capasity" : null,
		"Fuell" : null,
		"Transmission" : null,
		"DataRange" : "1999"
	},
	{
		"ID" : 1,
		"Name" : "Chevrolet Europe",
		"md_name" : "Nubira (J150) [GEN]",
		"ID_region" : 3,
		"ID_mark" : 1,
		"md_id" : 17,
		"md_type" : null,
		"YearFrom" : "1999",
		"YearTo" : "2003",
		"md_code" : "J99",
		"mf_id" : 100,
		"mf_code" : "2000",
		"mf_type" : null,
		"ID_model" : 17,
		"Body" : null,
		"Class" : null,
		"Capasity" : null,
		"Fuell" : null,
		"Transmission" : null,
		"DataRange" : "2000"
	},
	{
		"ID" : 1,
		"Name" : "Chevrolet Europe",
		"md_name" : "Nubira (J150) [GEN]",
		"ID_region" : 3,
		"ID_mark" : 1,
		"md_id" : 17,
		"md_type" : null,
		"YearFrom" : "1999",
		"YearTo" : "2003",
		"md_code" : "J99",
		"mf_id" : 105,
		"mf_code" : "2001",
		"mf_type" : null,
		"ID_model" : 17,
		"Body" : null,
		"Class" : null,
		"Capasity" : null,
		"Fuell" : null,
		"Transmission" : null,
		"DataRange" : "2001"
	},
	{
		"ID" : 1,
		"Name" : "Chevrolet Europe",
		"md_name" : "Nubira (J150) [GEN]",
		"ID_region" : 3,
		"ID_mark" : 1,
		"md_id" : 17,
		"md_type" : null,
		"YearFrom" : "1999",
		"YearTo" : "2003",
		"md_code" : "J99",
		"mf_id" : 110,
		"mf_code" : "2002",
		"mf_type" : null,
		"ID_model" : 17,
		"Body" : null,
		"Class" : null,
		"Capasity" : null,
		"Fuell" : null,
		"Transmission" : null,
		"DataRange" : "2002"
	},
	{
		"ID" : 1,
		"Name" : "Chevrolet Europe",
		"md_name" : "Nubira (J150) [GEN]",
		"ID_region" : 3,
		"ID_mark" : 1,
		"md_id" : 17,
		"md_type" : null,
		"YearFrom" : "1999",
		"YearTo" : "2003",
		"md_code" : "J99",
		"mf_id" : 115,
		"mf_code" : "2003",
		"mf_type" : null,
		"ID_model" : 17,
		"Body" : null,
		"Class" : null,
		"Capasity" : null,
		"Fuell" : null,
		"Transmission" : null,
		"DataRange" : "2003"
	},
	{
		"ID" : 1,
		"Name" : "Chevrolet Europe",
		"md_name" : "LACETTI + NUBIRA + OPTRA (J200) [EUR]",
		"ID_region" : 2,
		"ID_mark" : 1,
		"md_id" : 18,
		"md_type" : null,
		"YearFrom" : "2003",
		"YearTo" : "2011",
		"md_code" : "J03",
		"mf_id" : 43,
		"mf_code" : "2003",
		"mf_type" : null,
		"ID_model" : 18,
		"Body" : null,
		"Class" : null,
		"Capasity" : null,
		"Fuell" : null,
		"Transmission" : null,
		"DataRange" : "2003"
	},
	{
		"ID" : 1,
		"Name" : "Chevrolet Europe",
		"md_name" : "LACETTI + NUBIRA + OPTRA (J200) [EUR]",
		"ID_region" : 2,
		"ID_mark" : 1,
		"md_id" : 18,
		"md_type" : null,
		"YearFrom" : "2003",
		"YearTo" : "2011",
		"md_code" : "J03",
		"mf_id" : 48,
		"mf_code" : "2004",
		"mf_type" : null,
		"ID_model" : 18,
		"Body" : null,
		"Class" : null,
		"Capasity" : null,
		"Fuell" : null,
		"Transmission" : null,
		"DataRange" : "2004"
	},
	{
		"ID" : 1,
		"Name" : "Chevrolet Europe",
		"md_name" : "LACETTI + NUBIRA + OPTRA (J200) [EUR]",
		"ID_region" : 2,
		"ID_mark" : 1,
		"md_id" : 18,
		"md_type" : null,
		"YearFrom" : "2003",
		"YearTo" : "2011",
		"md_code" : "J03",
		"mf_id" : 54,
		"mf_code" : "2005",
		"mf_type" : null,
		"ID_model" : 18,
		"Body" : null,
		"Class" : null,
		"Capasity" : null,
		"Fuell" : null,
		"Transmission" : null,
		"DataRange" : "2005"
	},
	{
		"ID" : 1,
		"Name" : "Chevrolet Europe",
		"md_name" : "LACETTI + NUBIRA + OPTRA (J200) [EUR]",
		"ID_region" : 2,
		"ID_mark" : 1,
		"md_id" : 18,
		"md_type" : null,
		"YearFrom" : "2003",
		"YearTo" : "2011",
		"md_code" : "J03",
		"mf_id" : 60,
		"mf_code" : "2006",
		"mf_type" : null,
		"ID_model" : 18,
		"Body" : null,
		"Class" : null,
		"Capasity" : null,
		"Fuell" : null,
		"Transmission" : null,
		"DataRange" : "2006"
	},
	{
		"ID" : 1,
		"Name" : "Chevrolet Europe",
		"md_name" : "LACETTI + NUBIRA + OPTRA (J200) [EUR]",
		"ID_region" : 2,
		"ID_mark" : 1,
		"md_id" : 18,
		"md_type" : null,
		"YearFrom" : "2003",
		"YearTo" : "2011",
		"md_code" : "J03",
		"mf_id" : 66,
		"mf_code" : "2007",
		"mf_type" : null,
		"ID_model" : 18,
		"Body" : null,
		"Class" : null,
		"Capasity" : null,
		"Fuell" : null,
		"Transmission" : null,
		"DataRange" : "2007"
	},
	{
		"ID" : 1,
		"Name" : "Chevrolet Europe",
		"md_name" : "LACETTI + NUBIRA + OPTRA (J200) [EUR]",
		"ID_region" : 2,
		"ID_mark" : 1,
		"md_id" : 18,
		"md_type" : null,
		"YearFrom" : "2003",
		"YearTo" : "2011",
		"md_code" : "J03",
		"mf_id" : 72,
		"mf_code" : "2008",
		"mf_type" : null,
		"ID_model" : 18,
		"Body" : null,
		"Class" : null,
		"Capasity" : null,
		"Fuell" : null,
		"Transmission" : null,
		"DataRange" : "2008"
	},
	{
		"ID" : 1,
		"Name" : "Chevrolet Europe",
		"md_name" : "LACETTI + NUBIRA + OPTRA (J200) [EUR]",
		"ID_region" : 2,
		"ID_mark" : 1,
		"md_id" : 18,
		"md_type" : null,
		"YearFrom" : "2003",
		"YearTo" : "2011",
		"md_code" : "J03",
		"mf_id" : 78,
		"mf_code" : "2009",
		"mf_type" : null,
		"ID_model" : 18,
		"Body" : null,
		"Class" : null,
		"Capasity" : null,
		"Fuell" : null,
		"Transmission" : null,
		"DataRange" : "2009"
	},
	{
		"ID" : 1,
		"Name" : "Chevrolet Europe",
		"md_name" : "LACETTI + NUBIRA + OPTRA (J200) [EUR]",
		"ID_region" : 2,
		"ID_mark" : 1,
		"md_id" : 18,
		"md_type" : null,
		"YearFrom" : "2003",
		"YearTo" : "2011",
		"md_code" : "J03",
		"mf_id" : 82,
		"mf_code" : "2010",
		"mf_type" : null,
		"ID_model" : 18,
		"Body" : null,
		"Class" : null,
		"Capasity" : null,
		"Fuell" : null,
		"Transmission" : null,
		"DataRange" : "2010"
	},
	{
		"ID" : 1,
		"Name" : "Chevrolet Europe",
		"md_name" : "LACETTI + NUBIRA + OPTRA (J200) [EUR]",
		"ID_region" : 2,
		"ID_mark" : 1,
		"md_id" : 18,
		"md_type" : null,
		"YearFrom" : "2003",
		"YearTo" : "2011",
		"md_code" : "J03",
		"mf_id" : 85,
		"mf_code" : "2011",
		"mf_type" : null,
		"ID_model" : 18,
		"Body" : null,
		"Class" : null,
		"Capasity" : null,
		"Fuell" : null,
		"Transmission" : null,
		"DataRange" : "2011"
	},
	{
		"ID" : 1,
		"Name" : "Chevrolet Europe",
		"md_name" : "Lacetti + Optra (J200) [GEN]",
		"ID_region" : 3,
		"ID_mark" : 1,
		"md_id" : 19,
		"md_type" : null,
		"YearFrom" : "2003",
		"YearTo" : "2011",
		"md_code" : "J03",
		"mf_id" : 116,
		"mf_code" : "2003",
		"mf_type" : null,
		"ID_model" : 19,
		"Body" : null,
		"Class" : null,
		"Capasity" : null,
		"Fuell" : null,
		"Transmission" : null,
		"DataRange" : "2003"
	},
	{
		"ID" : 1,
		"Name" : "Chevrolet Europe",
		"md_name" : "Lacetti + Optra (J200) [GEN]",
		"ID_region" : 3,
		"ID_mark" : 1,
		"md_id" : 19,
		"md_type" : null,
		"YearFrom" : "2003",
		"YearTo" : "2011",
		"md_code" : "J03",
		"mf_id" : 121,
		"mf_code" : "2004",
		"mf_type" : null,
		"ID_model" : 19,
		"Body" : null,
		"Class" : null,
		"Capasity" : null,
		"Fuell" : null,
		"Transmission" : null,
		"DataRange" : "2004"
	},
	{
		"ID" : 1,
		"Name" : "Chevrolet Europe",
		"md_name" : "Lacetti + Optra (J200) [GEN]",
		"ID_region" : 3,
		"ID_mark" : 1,
		"md_id" : 19,
		"md_type" : null,
		"YearFrom" : "2003",
		"YearTo" : "2011",
		"md_code" : "J03",
		"mf_id" : 127,
		"mf_code" : "2005",
		"mf_type" : null,
		"ID_model" : 19,
		"Body" : null,
		"Class" : null,
		"Capasity" : null,
		"Fuell" : null,
		"Transmission" : null,
		"DataRange" : "2005"
	},
	{
		"ID" : 1,
		"Name" : "Chevrolet Europe",
		"md_name" : "Lacetti + Optra (J200) [GEN]",
		"ID_region" : 3,
		"ID_mark" : 1,
		"md_id" : 19,
		"md_type" : null,
		"YearFrom" : "2003",
		"YearTo" : "2011",
		"md_code" : "J03",
		"mf_id" : 134,
		"mf_code" : "2006",
		"mf_type" : null,
		"ID_model" : 19,
		"Body" : null,
		"Class" : null,
		"Capasity" : null,
		"Fuell" : null,
		"Transmission" : null,
		"DataRange" : "2006"
	},
	{
		"ID" : 1,
		"Name" : "Chevrolet Europe",
		"md_name" : "Lacetti + Optra (J200) [GEN]",
		"ID_region" : 3,
		"ID_mark" : 1,
		"md_id" : 19,
		"md_type" : null,
		"YearFrom" : "2003",
		"YearTo" : "2011",
		"md_code" : "J03",
		"mf_id" : 141,
		"mf_code" : "2007",
		"mf_type" : null,
		"ID_model" : 19,
		"Body" : null,
		"Class" : null,
		"Capasity" : null,
		"Fuell" : null,
		"Transmission" : null,
		"DataRange" : "2007"
	},
	{
		"ID" : 1,
		"Name" : "Chevrolet Europe",
		"md_name" : "Lacetti + Optra (J200) [GEN]",
		"ID_region" : 3,
		"ID_mark" : 1,
		"md_id" : 19,
		"md_type" : null,
		"YearFrom" : "2003",
		"YearTo" : "2011",
		"md_code" : "J03",
		"mf_id" : 147,
		"mf_code" : "2008",
		"mf_type" : null,
		"ID_model" : 19,
		"Body" : null,
		"Class" : null,
		"Capasity" : null,
		"Fuell" : null,
		"Transmission" : null,
		"DataRange" : "2008"
	},
	{
		"ID" : 1,
		"Name" : "Chevrolet Europe",
		"md_name" : "Lacetti + Optra (J200) [GEN]",
		"ID_region" : 3,
		"ID_mark" : 1,
		"md_id" : 19,
		"md_type" : null,
		"YearFrom" : "2003",
		"YearTo" : "2011",
		"md_code" : "J03",
		"mf_id" : 151,
		"mf_code" : "2009",
		"mf_type" : null,
		"ID_model" : 19,
		"Body" : null,
		"Class" : null,
		"Capasity" : null,
		"Fuell" : null,
		"Transmission" : null,
		"DataRange" : "2009"
	},
	{
		"ID" : 1,
		"Name" : "Chevrolet Europe",
		"md_name" : "Lacetti + Optra (J200) [GEN]",
		"ID_region" : 3,
		"ID_mark" : 1,
		"md_id" : 19,
		"md_type" : null,
		"YearFrom" : "2003",
		"YearTo" : "2011",
		"md_code" : "J03",
		"mf_id" : 155,
		"mf_code" : "2010",
		"mf_type" : null,
		"ID_model" : 19,
		"Body" : null,
		"Class" : null,
		"Capasity" : null,
		"Fuell" : null,
		"Transmission" : null,
		"DataRange" : "2010"
	},
	{
		"ID" : 1,
		"Name" : "Chevrolet Europe",
		"md_name" : "Lacetti + Optra (J200) [GEN]",
		"ID_region" : 3,
		"ID_mark" : 1,
		"md_id" : 19,
		"md_type" : null,
		"YearFrom" : "2003",
		"YearTo" : "2011",
		"md_code" : "J03",
		"mf_id" : 159,
		"mf_code" : "2011",
		"mf_type" : null,
		"ID_model" : 19,
		"Body" : null,
		"Class" : null,
		"Capasity" : null,
		"Fuell" : null,
		"Transmission" : null,
		"DataRange" : "2011"
	},
	{
		"ID" : 1,
		"Name" : "Chevrolet Europe",
		"md_name" : "LEGANZA (V100) [EUR]",
		"ID_region" : 2,
		"ID_mark" : 1,
		"md_id" : 20,
		"md_type" : null,
		"YearFrom" : "1998",
		"YearTo" : "2002",
		"md_code" : "V97",
		"mf_id" : 19,
		"mf_code" : "1998",
		"mf_type" : null,
		"ID_model" : 20,
		"Body" : null,
		"Class" : null,
		"Capasity" : null,
		"Fuell" : null,
		"Transmission" : null,
		"DataRange" : "1998"
	},
	{
		"ID" : 1,
		"Name" : "Chevrolet Europe",
		"md_name" : "LEGANZA (V100) [EUR]",
		"ID_region" : 2,
		"ID_mark" : 1,
		"md_id" : 20,
		"md_type" : null,
		"YearFrom" : "1998",
		"YearTo" : "2002",
		"md_code" : "V97",
		"mf_id" : 24,
		"mf_code" : "1999",
		"mf_type" : null,
		"ID_model" : 20,
		"Body" : null,
		"Class" : null,
		"Capasity" : null,
		"Fuell" : null,
		"Transmission" : null,
		"DataRange" : "1999"
	},
	{
		"ID" : 1,
		"Name" : "Chevrolet Europe",
		"md_name" : "LEGANZA (V100) [EUR]",
		"ID_region" : 2,
		"ID_mark" : 1,
		"md_id" : 20,
		"md_type" : null,
		"YearFrom" : "1998",
		"YearTo" : "2002",
		"md_code" : "V97",
		"mf_id" : 28,
		"mf_code" : "2000",
		"mf_type" : null,
		"ID_model" : 20,
		"Body" : null,
		"Class" : null,
		"Capasity" : null,
		"Fuell" : null,
		"Transmission" : null,
		"DataRange" : "2000"
	},
	{
		"ID" : 1,
		"Name" : "Chevrolet Europe",
		"md_name" : "LEGANZA (V100) [EUR]",
		"ID_region" : 2,
		"ID_mark" : 1,
		"md_id" : 20,
		"md_type" : null,
		"YearFrom" : "1998",
		"YearTo" : "2002",
		"md_code" : "V97",
		"mf_id" : 33,
		"mf_code" : "2001",
		"mf_type" : null,
		"ID_model" : 20,
		"Body" : null,
		"Class" : null,
		"Capasity" : null,
		"Fuell" : null,
		"Transmission" : null,
		"DataRange" : "2001"
	},
	{
		"ID" : 1,
		"Name" : "Chevrolet Europe",
		"md_name" : "LEGANZA (V100) [EUR]",
		"ID_region" : 2,
		"ID_mark" : 1,
		"md_id" : 20,
		"md_type" : null,
		"YearFrom" : "1998",
		"YearTo" : "2002",
		"md_code" : "V97",
		"mf_id" : 38,
		"mf_code" : "2002",
		"mf_type" : null,
		"ID_model" : 20,
		"Body" : null,
		"Class" : null,
		"Capasity" : null,
		"Fuell" : null,
		"Transmission" : null,
		"DataRange" : "2002"
	},
	{
		"ID" : 1,
		"Name" : "Chevrolet Europe",
		"md_name" : "Epica (V200) [GEN]",
		"ID_region" : 3,
		"ID_mark" : 1,
		"md_id" : 21,
		"md_type" : null,
		"YearFrom" : "2003",
		"YearTo" : "2006",
		"md_code" : "V99",
		"mf_id" : 117,
		"mf_code" : "2003",
		"mf_type" : null,
		"ID_model" : 21,
		"Body" : null,
		"Class" : null,
		"Capasity" : null,
		"Fuell" : null,
		"Transmission" : null,
		"DataRange" : "2003"
	},
	{
		"ID" : 1,
		"Name" : "Chevrolet Europe",
		"md_name" : "Epica (V200) [GEN]",
		"ID_region" : 3,
		"ID_mark" : 1,
		"md_id" : 21,
		"md_type" : null,
		"YearFrom" : "2003",
		"YearTo" : "2006",
		"md_code" : "V99",
		"mf_id" : 122,
		"mf_code" : "2004",
		"mf_type" : null,
		"ID_model" : 21,
		"Body" : null,
		"Class" : null,
		"Capasity" : null,
		"Fuell" : null,
		"Transmission" : null,
		"DataRange" : "2004"
	},
	{
		"ID" : 1,
		"Name" : "Chevrolet Europe",
		"md_name" : "Epica (V200) [GEN]",
		"ID_region" : 3,
		"ID_mark" : 1,
		"md_id" : 21,
		"md_type" : null,
		"YearFrom" : "2003",
		"YearTo" : "2006",
		"md_code" : "V99",
		"mf_id" : 128,
		"mf_code" : "2005",
		"mf_type" : null,
		"ID_model" : 21,
		"Body" : null,
		"Class" : null,
		"Capasity" : null,
		"Fuell" : null,
		"Transmission" : null,
		"DataRange" : "2005"
	},
	{
		"ID" : 1,
		"Name" : "Chevrolet Europe",
		"md_name" : "Epica (V200) [GEN]",
		"ID_region" : 3,
		"ID_mark" : 1,
		"md_id" : 21,
		"md_type" : null,
		"YearFrom" : "2003",
		"YearTo" : "2006",
		"md_code" : "V99",
		"mf_id" : 135,
		"mf_code" : "2006",
		"mf_type" : null,
		"ID_model" : 21,
		"Body" : null,
		"Class" : null,
		"Capasity" : null,
		"Fuell" : null,
		"Transmission" : null,
		"DataRange" : "2006"
	},
	{
		"ID" : 1,
		"Name" : "Chevrolet Europe",
		"md_name" : "KALOS + AVEO (T200) [EUR]",
		"ID_region" : 2,
		"ID_mark" : 1,
		"md_id" : 22,
		"md_type" : null,
		"YearFrom" : "2003",
		"YearTo" : "2008",
		"md_code" : "T02",
		"mf_id" : 44,
		"mf_code" : "2003",
		"mf_type" : null,
		"ID_model" : 22,
		"Body" : null,
		"Class" : null,
		"Capasity" : null,
		"Fuell" : null,
		"Transmission" : null,
		"DataRange" : "2003"
	},
	{
		"ID" : 1,
		"Name" : "Chevrolet Europe",
		"md_name" : "KALOS + AVEO (T200) [EUR]",
		"ID_region" : 2,
		"ID_mark" : 1,
		"md_id" : 22,
		"md_type" : null,
		"YearFrom" : "2003",
		"YearTo" : "2008",
		"md_code" : "T02",
		"mf_id" : 49,
		"mf_code" : "2004",
		"mf_type" : null,
		"ID_model" : 22,
		"Body" : null,
		"Class" : null,
		"Capasity" : null,
		"Fuell" : null,
		"Transmission" : null,
		"DataRange" : "2004"
	},
	{
		"ID" : 1,
		"Name" : "Chevrolet Europe",
		"md_name" : "KALOS + AVEO (T200) [EUR]",
		"ID_region" : 2,
		"ID_mark" : 1,
		"md_id" : 22,
		"md_type" : null,
		"YearFrom" : "2003",
		"YearTo" : "2008",
		"md_code" : "T02",
		"mf_id" : 55,
		"mf_code" : "2005",
		"mf_type" : null,
		"ID_model" : 22,
		"Body" : null,
		"Class" : null,
		"Capasity" : null,
		"Fuell" : null,
		"Transmission" : null,
		"DataRange" : "2005"
	},
	{
		"ID" : 1,
		"Name" : "Chevrolet Europe",
		"md_name" : "KALOS + AVEO (T200) [EUR]",
		"ID_region" : 2,
		"ID_mark" : 1,
		"md_id" : 22,
		"md_type" : null,
		"YearFrom" : "2003",
		"YearTo" : "2008",
		"md_code" : "T02",
		"mf_id" : 61,
		"mf_code" : "2006",
		"mf_type" : null,
		"ID_model" : 22,
		"Body" : null,
		"Class" : null,
		"Capasity" : null,
		"Fuell" : null,
		"Transmission" : null,
		"DataRange" : "2006"
	},
	{
		"ID" : 1,
		"Name" : "Chevrolet Europe",
		"md_name" : "KALOS + AVEO (T200) [EUR]",
		"ID_region" : 2,
		"ID_mark" : 1,
		"md_id" : 22,
		"md_type" : null,
		"YearFrom" : "2003",
		"YearTo" : "2008",
		"md_code" : "T02",
		"mf_id" : 67,
		"mf_code" : "2007",
		"mf_type" : null,
		"ID_model" : 22,
		"Body" : null,
		"Class" : null,
		"Capasity" : null,
		"Fuell" : null,
		"Transmission" : null,
		"DataRange" : "2007"
	},
	{
		"ID" : 1,
		"Name" : "Chevrolet Europe",
		"md_name" : "KALOS + AVEO (T200) [EUR]",
		"ID_region" : 2,
		"ID_mark" : 1,
		"md_id" : 22,
		"md_type" : null,
		"YearFrom" : "2003",
		"YearTo" : "2008",
		"md_code" : "T02",
		"mf_id" : 73,
		"mf_code" : "2008",
		"mf_type" : null,
		"ID_model" : 22,
		"Body" : null,
		"Class" : null,
		"Capasity" : null,
		"Fuell" : null,
		"Transmission" : null,
		"DataRange" : "2008"
	},
	{
		"ID" : 1,
		"Name" : "Chevrolet Europe",
		"md_name" : "Lanos (T100) [GEN]",
		"ID_region" : 3,
		"ID_mark" : 1,
		"md_id" : 23,
		"md_type" : null,
		"YearFrom" : "1997",
		"YearTo" : "2002",
		"md_code" : "T97",
		"mf_id" : 87,
		"mf_code" : "1997",
		"mf_type" : null,
		"ID_model" : 23,
		"Body" : null,
		"Class" : null,
		"Capasity" : null,
		"Fuell" : null,
		"Transmission" : null,
		"DataRange" : "1997"
	},
	{
		"ID" : 1,
		"Name" : "Chevrolet Europe",
		"md_name" : "Lanos (T100) [GEN]",
		"ID_region" : 3,
		"ID_mark" : 1,
		"md_id" : 23,
		"md_type" : null,
		"YearFrom" : "1997",
		"YearTo" : "2002",
		"md_code" : "T97",
		"mf_id" : 91,
		"mf_code" : "1998",
		"mf_type" : null,
		"ID_model" : 23,
		"Body" : null,
		"Class" : null,
		"Capasity" : null,
		"Fuell" : null,
		"Transmission" : null,
		"DataRange" : "1998"
	},
	{
		"ID" : 1,
		"Name" : "Chevrolet Europe",
		"md_name" : "Lanos (T100) [GEN]",
		"ID_region" : 3,
		"ID_mark" : 1,
		"md_id" : 23,
		"md_type" : null,
		"YearFrom" : "1997",
		"YearTo" : "2002",
		"md_code" : "T97",
		"mf_id" : 96,
		"mf_code" : "1999",
		"mf_type" : null,
		"ID_model" : 23,
		"Body" : null,
		"Class" : null,
		"Capasity" : null,
		"Fuell" : null,
		"Transmission" : null,
		"DataRange" : "1999"
	},
	{
		"ID" : 1,
		"Name" : "Chevrolet Europe",
		"md_name" : "Lanos (T100) [GEN]",
		"ID_region" : 3,
		"ID_mark" : 1,
		"md_id" : 23,
		"md_type" : null,
		"YearFrom" : "1997",
		"YearTo" : "2002",
		"md_code" : "T97",
		"mf_id" : 101,
		"mf_code" : "2000",
		"mf_type" : null,
		"ID_model" : 23,
		"Body" : null,
		"Class" : null,
		"Capasity" : null,
		"Fuell" : null,
		"Transmission" : null,
		"DataRange" : "2000"
	},
	{
		"ID" : 1,
		"Name" : "Chevrolet Europe",
		"md_name" : "Lanos (T100) [GEN]",
		"ID_region" : 3,
		"ID_mark" : 1,
		"md_id" : 23,
		"md_type" : null,
		"YearFrom" : "1997",
		"YearTo" : "2002",
		"md_code" : "T97",
		"mf_id" : 106,
		"mf_code" : "2001",
		"mf_type" : null,
		"ID_model" : 23,
		"Body" : null,
		"Class" : null,
		"Capasity" : null,
		"Fuell" : null,
		"Transmission" : null,
		"DataRange" : "2001"
	},
	{
		"ID" : 1,
		"Name" : "Chevrolet Europe",
		"md_name" : "Lanos (T100) [GEN]",
		"ID_region" : 3,
		"ID_mark" : 1,
		"md_id" : 23,
		"md_type" : null,
		"YearFrom" : "1997",
		"YearTo" : "2002",
		"md_code" : "T97",
		"mf_id" : 111,
		"mf_code" : "2002",
		"mf_type" : null,
		"ID_model" : 23,
		"Body" : null,
		"Class" : null,
		"Capasity" : null,
		"Fuell" : null,
		"Transmission" : null,
		"DataRange" : "2002"
	},
	{
		"ID" : 1,
		"Name" : "Chevrolet Europe",
		"md_name" : "TACUMA + REZZO (U100) [EUR]",
		"ID_region" : 2,
		"ID_mark" : 1,
		"md_id" : 24,
		"md_type" : null,
		"YearFrom" : "2000",
		"YearTo" : "2008",
		"md_code" : "U00",
		"mf_id" : 29,
		"mf_code" : "2000",
		"mf_type" : null,
		"ID_model" : 24,
		"Body" : null,
		"Class" : null,
		"Capasity" : null,
		"Fuell" : null,
		"Transmission" : null,
		"DataRange" : "2000"
	},
	{
		"ID" : 1,
		"Name" : "Chevrolet Europe",
		"md_name" : "TACUMA + REZZO (U100) [EUR]",
		"ID_region" : 2,
		"ID_mark" : 1,
		"md_id" : 24,
		"md_type" : null,
		"YearFrom" : "2000",
		"YearTo" : "2008",
		"md_code" : "U00",
		"mf_id" : 34,
		"mf_code" : "2001",
		"mf_type" : null,
		"ID_model" : 24,
		"Body" : null,
		"Class" : null,
		"Capasity" : null,
		"Fuell" : null,
		"Transmission" : null,
		"DataRange" : "2001"
	},
	{
		"ID" : 1,
		"Name" : "Chevrolet Europe",
		"md_name" : "TACUMA + REZZO (U100) [EUR]",
		"ID_region" : 2,
		"ID_mark" : 1,
		"md_id" : 24,
		"md_type" : null,
		"YearFrom" : "2000",
		"YearTo" : "2008",
		"md_code" : "U00",
		"mf_id" : 39,
		"mf_code" : "2002",
		"mf_type" : null,
		"ID_model" : 24,
		"Body" : null,
		"Class" : null,
		"Capasity" : null,
		"Fuell" : null,
		"Transmission" : null,
		"DataRange" : "2002"
	},
	{
		"ID" : 1,
		"Name" : "Chevrolet Europe",
		"md_name" : "TACUMA + REZZO (U100) [EUR]",
		"ID_region" : 2,
		"ID_mark" : 1,
		"md_id" : 24,
		"md_type" : null,
		"YearFrom" : "2000",
		"YearTo" : "2008",
		"md_code" : "U00",
		"mf_id" : 45,
		"mf_code" : "2003",
		"mf_type" : null,
		"ID_model" : 24,
		"Body" : null,
		"Class" : null,
		"Capasity" : null,
		"Fuell" : null,
		"Transmission" : null,
		"DataRange" : "2003"
	},
	{
		"ID" : 1,
		"Name" : "Chevrolet Europe",
		"md_name" : "TACUMA + REZZO (U100) [EUR]",
		"ID_region" : 2,
		"ID_mark" : 1,
		"md_id" : 24,
		"md_type" : null,
		"YearFrom" : "2000",
		"YearTo" : "2008",
		"md_code" : "U00",
		"mf_id" : 50,
		"mf_code" : "2004",
		"mf_type" : null,
		"ID_model" : 24,
		"Body" : null,
		"Class" : null,
		"Capasity" : null,
		"Fuell" : null,
		"Transmission" : null,
		"DataRange" : "2004"
	},
	{
		"ID" : 1,
		"Name" : "Chevrolet Europe",
		"md_name" : "TACUMA + REZZO (U100) [EUR]",
		"ID_region" : 2,
		"ID_mark" : 1,
		"md_id" : 24,
		"md_type" : null,
		"YearFrom" : "2000",
		"YearTo" : "2008",
		"md_code" : "U00",
		"mf_id" : 56,
		"mf_code" : "2005",
		"mf_type" : null,
		"ID_model" : 24,
		"Body" : null,
		"Class" : null,
		"Capasity" : null,
		"Fuell" : null,
		"Transmission" : null,
		"DataRange" : "2005"
	},
	{
		"ID" : 1,
		"Name" : "Chevrolet Europe",
		"md_name" : "TACUMA + REZZO (U100) [EUR]",
		"ID_region" : 2,
		"ID_mark" : 1,
		"md_id" : 24,
		"md_type" : null,
		"YearFrom" : "2000",
		"YearTo" : "2008",
		"md_code" : "U00",
		"mf_id" : 62,
		"mf_code" : "2006",
		"mf_type" : null,
		"ID_model" : 24,
		"Body" : null,
		"Class" : null,
		"Capasity" : null,
		"Fuell" : null,
		"Transmission" : null,
		"DataRange" : "2006"
	},
	{
		"ID" : 1,
		"Name" : "Chevrolet Europe",
		"md_name" : "TACUMA + REZZO (U100) [EUR]",
		"ID_region" : 2,
		"ID_mark" : 1,
		"md_id" : 24,
		"md_type" : null,
		"YearFrom" : "2000",
		"YearTo" : "2008",
		"md_code" : "U00",
		"mf_id" : 68,
		"mf_code" : "2007",
		"mf_type" : null,
		"ID_model" : 24,
		"Body" : null,
		"Class" : null,
		"Capasity" : null,
		"Fuell" : null,
		"Transmission" : null,
		"DataRange" : "2007"
	},
	{
		"ID" : 1,
		"Name" : "Chevrolet Europe",
		"md_name" : "TACUMA + REZZO (U100) [EUR]",
		"ID_region" : 2,
		"ID_mark" : 1,
		"md_id" : 24,
		"md_type" : null,
		"YearFrom" : "2000",
		"YearTo" : "2008",
		"md_code" : "U00",
		"mf_id" : 74,
		"mf_code" : "2008",
		"mf_type" : null,
		"ID_model" : 24,
		"Body" : null,
		"Class" : null,
		"Capasity" : null,
		"Fuell" : null,
		"Transmission" : null,
		"DataRange" : "2008"
	}
]}
