{
"select *\nfrom chev.marks mk\njoin chev.models md on mk.ID  = md.ID_mark\njoin chev.modifications  mf on md.ID  = mf.ID_model ": [
	{
		"ID" : 1,
		"Name" : "Chevrolet Europe",
		"ID" : 1,
		"ID_mark" : 1,
		"ID_region" : 3,
		"Name" : "Spark + Matiz (M200) [GEN]",
		"Code" : "M04",
		"Type" : null,
		"YearFrom" : "2005",
		"YearTo" : "2011",
		"ID" : 123,
		"ID_model" : 1,
		"Code" : "2005",
		"Type" : null,
		"Body" : null,
		"Class" : null,
		"Capasity" : null,
		"Fuell" : null,
		"Transmission" : null,
		"DataRange" : "2005"
	},
	{
		"ID" : 1,
		"Name" : "Chevrolet Europe",
		"ID" : 1,
		"ID_mark" : 1,
		"ID_region" : 3,
		"Name" : "Spark + Matiz (M200) [GEN]",
		"Code" : "M04",
		"Type" : null,
		"YearFrom" : "2005",
		"YearTo" : "2011",
		"ID" : 129,
		"ID_model" : 1,
		"Code" : "2006",
		"Type" : null,
		"Body" : null,
		"Class" : null,
		"Capasity" : null,
		"Fuell" : null,
		"Transmission" : null,
		"DataRange" : "2006"
	},
	{
		"ID" : 1,
		"Name" : "Chevrolet Europe",
		"ID" : 1,
		"ID_mark" : 1,
		"ID_region" : 3,
		"Name" : "Spark + Matiz (M200) [GEN]",
		"Code" : "M04",
		"Type" : null,
		"YearFrom" : "2005",
		"YearTo" : "2011",
		"ID" : 136,
		"ID_model" : 1,
		"Code" : "2007",
		"Type" : null,
		"Body" : null,
		"Class" : null,
		"Capasity" : null,
		"Fuell" : null,
		"Transmission" : null,
		"DataRange" : "2007"
	},
	{
		"ID" : 1,
		"Name" : "Chevrolet Europe",
		"ID" : 1,
		"ID_mark" : 1,
		"ID_region" : 3,
		"Name" : "Spark + Matiz (M200) [GEN]",
		"Code" : "M04",
		"Type" : null,
		"YearFrom" : "2005",
		"YearTo" : "2011",
		"ID" : 142,
		"ID_model" : 1,
		"Code" : "2008",
		"Type" : null,
		"Body" : null,
		"Class" : null,
		"Capasity" : null,
		"Fuell" : null,
		"Transmission" : null,
		"DataRange" : "2008"
	},
	{
		"ID" : 1,
		"Name" : "Chevrolet Europe",
		"ID" : 1,
		"ID_mark" : 1,
		"ID_region" : 3,
		"Name" : "Spark + Matiz (M200) [GEN]",
		"Code" : "M04",
		"Type" : null,
		"YearFrom" : "2005",
		"YearTo" : "2011",
		"ID" : 148,
		"ID_model" : 1,
		"Code" : "2009",
		"Type" : null,
		"Body" : null,
		"Class" : null,
		"Capasity" : null,
		"Fuell" : null,
		"Transmission" : null,
		"DataRange" : "2009"
	},
	{
		"ID" : 1,
		"Name" : "Chevrolet Europe",
		"ID" : 1,
		"ID_mark" : 1,
		"ID_region" : 3,
		"Name" : "Spark + Matiz (M200) [GEN]",
		"Code" : "M04",
		"Type" : null,
		"YearFrom" : "2005",
		"YearTo" : "2011",
		"ID" : 152,
		"ID_model" : 1,
		"Code" : "2010",
		"Type" : null,
		"Body" : null,
		"Class" : null,
		"Capasity" : null,
		"Fuell" : null,
		"Transmission" : null,
		"DataRange" : "2010"
	},
	{
		"ID" : 1,
		"Name" : "Chevrolet Europe",
		"ID" : 1,
		"ID_mark" : 1,
		"ID_region" : 3,
		"Name" : "Spark + Matiz (M200) [GEN]",
		"Code" : "M04",
		"Type" : null,
		"YearFrom" : "2005",
		"YearTo" : "2011",
		"ID" : 156,
		"ID_model" : 1,
		"Code" : "2011",
		"Type" : null,
		"Body" : null,
		"Class" : null,
		"Capasity" : null,
		"Fuell" : null,
		"Transmission" : null,
		"DataRange" : "2011"
	},
	{
		"ID" : 1,
		"Name" : "Chevrolet Europe",
		"ID" : 2,
		"ID_mark" : 1,
		"ID_region" : 3,
		"Name" : "Epica (V250) [GEN]",
		"Code" : "V06",
		"Type" : null,
		"YearFrom" : "2007",
		"YearTo" : "2011",
		"ID" : 137,
		"ID_model" : 2,
		"Code" : "2007",
		"Type" : null,
		"Body" : null,
		"Class" : null,
		"Capasity" : null,
		"Fuell" : null,
		"Transmission" : null,
		"DataRange" : "2007"
	},
	{
		"ID" : 1,
		"Name" : "Chevrolet Europe",
		"ID" : 2,
		"ID_mark" : 1,
		"ID_region" : 3,
		"Name" : "Epica (V250) [GEN]",
		"Code" : "V06",
		"Type" : null,
		"YearFrom" : "2007",
		"YearTo" : "2011",
		"ID" : 143,
		"ID_model" : 2,
		"Code" : "2008",
		"Type" : null,
		"Body" : null,
		"Class" : null,
		"Capasity" : null,
		"Fuell" : null,
		"Transmission" : null,
		"DataRange" : "2008"
	},
	{
		"ID" : 1,
		"Name" : "Chevrolet Europe",
		"ID" : 2,
		"ID_mark" : 1,
		"ID_region" : 3,
		"Name" : "Epica (V250) [GEN]",
		"Code" : "V06",
		"Type" : null,
		"YearFrom" : "2007",
		"YearTo" : "2011",
		"ID" : 149,
		"ID_model" : 2,
		"Code" : "2009",
		"Type" : null,
		"Body" : null,
		"Class" : null,
		"Capasity" : null,
		"Fuell" : null,
		"Transmission" : null,
		"DataRange" : "2009"
	},
	{
		"ID" : 1,
		"Name" : "Chevrolet Europe",
		"ID" : 2,
		"ID_mark" : 1,
		"ID_region" : 3,
		"Name" : "Epica (V250) [GEN]",
		"Code" : "V06",
		"Type" : null,
		"YearFrom" : "2007",
		"YearTo" : "2011",
		"ID" : 153,
		"ID_model" : 2,
		"Code" : "2010",
		"Type" : null,
		"Body" : null,
		"Class" : null,
		"Capasity" : null,
		"Fuell" : null,
		"Transmission" : null,
		"DataRange" : "2010"
	},
	{
		"ID" : 1,
		"Name" : "Chevrolet Europe",
		"ID" : 2,
		"ID_mark" : 1,
		"ID_region" : 3,
		"Name" : "Epica (V250) [GEN]",
		"Code" : "V06",
		"Type" : null,
		"YearFrom" : "2007",
		"YearTo" : "2011",
		"ID" : 157,
		"ID_model" : 2,
		"Code" : "2011",
		"Type" : null,
		"Body" : null,
		"Class" : null,
		"Capasity" : null,
		"Fuell" : null,
		"Transmission" : null,
		"DataRange" : "2011"
	},
	{
		"ID" : 1,
		"Name" : "Chevrolet Europe",
		"ID" : 3,
		"ID_mark" : 1,
		"ID_region" : 3,
		"Name" : "Aveo (T200) [GEN]",
		"Code" : "T02",
		"Type" : null,
		"YearFrom" : "2003",
		"YearTo" : "2008",
		"ID" : 112,
		"ID_model" : 3,
		"Code" : "2003",
		"Type" : null,
		"Body" : null,
		"Class" : null,
		"Capasity" : null,
		"Fuell" : null,
		"Transmission" : null,
		"DataRange" : "2003"
	},
	{
		"ID" : 1,
		"Name" : "Chevrolet Europe",
		"ID" : 3,
		"ID_mark" : 1,
		"ID_region" : 3,
		"Name" : "Aveo (T200) [GEN]",
		"Code" : "T02",
		"Type" : null,
		"YearFrom" : "2003",
		"YearTo" : "2008",
		"ID" : 118,
		"ID_model" : 3,
		"Code" : "2004",
		"Type" : null,
		"Body" : null,
		"Class" : null,
		"Capasity" : null,
		"Fuell" : null,
		"Transmission" : null,
		"DataRange" : "2004"
	},
	{
		"ID" : 1,
		"Name" : "Chevrolet Europe",
		"ID" : 3,
		"ID_mark" : 1,
		"ID_region" : 3,
		"Name" : "Aveo (T200) [GEN]",
		"Code" : "T02",
		"Type" : null,
		"YearFrom" : "2003",
		"YearTo" : "2008",
		"ID" : 124,
		"ID_model" : 3,
		"Code" : "2005",
		"Type" : null,
		"Body" : null,
		"Class" : null,
		"Capasity" : null,
		"Fuell" : null,
		"Transmission" : null,
		"DataRange" : "2005"
	},
	{
		"ID" : 1,
		"Name" : "Chevrolet Europe",
		"ID" : 3,
		"ID_mark" : 1,
		"ID_region" : 3,
		"Name" : "Aveo (T200) [GEN]",
		"Code" : "T02",
		"Type" : null,
		"YearFrom" : "2003",
		"YearTo" : "2008",
		"ID" : 130,
		"ID_model" : 3,
		"Code" : "2006",
		"Type" : null,
		"Body" : null,
		"Class" : null,
		"Capasity" : null,
		"Fuell" : null,
		"Transmission" : null,
		"DataRange" : "2006"
	},
	{
		"ID" : 1,
		"Name" : "Chevrolet Europe",
		"ID" : 3,
		"ID_mark" : 1,
		"ID_region" : 3,
		"Name" : "Aveo (T200) [GEN]",
		"Code" : "T02",
		"Type" : null,
		"YearFrom" : "2003",
		"YearTo" : "2008",
		"ID" : 138,
		"ID_model" : 3,
		"Code" : "2007",
		"Type" : null,
		"Body" : null,
		"Class" : null,
		"Capasity" : null,
		"Fuell" : null,
		"Transmission" : null,
		"DataRange" : "2007"
	},
	{
		"ID" : 1,
		"Name" : "Chevrolet Europe",
		"ID" : 3,
		"ID_mark" : 1,
		"ID_region" : 3,
		"Name" : "Aveo (T200) [GEN]",
		"Code" : "T02",
		"Type" : null,
		"YearFrom" : "2003",
		"YearTo" : "2008",
		"ID" : 144,
		"ID_model" : 3,
		"Code" : "2008",
		"Type" : null,
		"Body" : null,
		"Class" : null,
		"Capasity" : null,
		"Fuell" : null,
		"Transmission" : null,
		"DataRange" : "2008"
	},
	{
		"ID" : 1,
		"Name" : "Chevrolet Europe",
		"ID" : 4,
		"ID_mark" : 1,
		"ID_region" : 2,
		"Name" : "NUBIRA (J100) [EUR]",
		"Code" : "J97",
		"Type" : null,
		"YearFrom" : "1997",
		"YearTo" : "1999",
		"ID" : 14,
		"ID_model" : 4,
		"Code" : "1997",
		"Type" : null,
		"Body" : null,
		"Class" : null,
		"Capasity" : null,
		"Fuell" : null,
		"Transmission" : null,
		"DataRange" : "1997"
	},
	{
		"ID" : 1,
		"Name" : "Chevrolet Europe",
		"ID" : 4,
		"ID_mark" : 1,
		"ID_region" : 2,
		"Name" : "NUBIRA (J100) [EUR]",
		"Code" : "J97",
		"Type" : null,
		"YearFrom" : "1997",
		"YearTo" : "1999",
		"ID" : 16,
		"ID_model" : 4,
		"Code" : "1998",
		"Type" : null,
		"Body" : null,
		"Class" : null,
		"Capasity" : null,
		"Fuell" : null,
		"Transmission" : null,
		"DataRange" : "1998"
	},
	{
		"ID" : 1,
		"Name" : "Chevrolet Europe",
		"ID" : 4,
		"ID_mark" : 1,
		"ID_region" : 2,
		"Name" : "NUBIRA (J100) [EUR]",
		"Code" : "J97",
		"Type" : null,
		"YearFrom" : "1997",
		"YearTo" : "1999",
		"ID" : 20,
		"ID_model" : 4,
		"Code" : "1999",
		"Type" : null,
		"Body" : null,
		"Class" : null,
		"Capasity" : null,
		"Fuell" : null,
		"Transmission" : null,
		"DataRange" : "1999"
	},
	{
		"ID" : 1,
		"Name" : "Chevrolet Europe",
		"ID" : 5,
		"ID_mark" : 1,
		"ID_region" : 3,
		"Name" : "Leganza (V100) [GEN]",
		"Code" : "V97",
		"Type" : null,
		"YearFrom" : "1998",
		"YearTo" : "2002",
		"ID" : 88,
		"ID_model" : 5,
		"Code" : "1998",
		"Type" : null,
		"Body" : null,
		"Class" : null,
		"Capasity" : null,
		"Fuell" : null,
		"Transmission" : null,
		"DataRange" : "1998"
	},
	{
		"ID" : 1,
		"Name" : "Chevrolet Europe",
		"ID" : 5,
		"ID_mark" : 1,
		"ID_region" : 3,
		"Name" : "Leganza (V100) [GEN]",
		"Code" : "V97",
		"Type" : null,
		"YearFrom" : "1998",
		"YearTo" : "2002",
		"ID" : 92,
		"ID_model" : 5,
		"Code" : "1999",
		"Type" : null,
		"Body" : null,
		"Class" : null,
		"Capasity" : null,
		"Fuell" : null,
		"Transmission" : null,
		"DataRange" : "1999"
	},
	{
		"ID" : 1,
		"Name" : "Chevrolet Europe",
		"ID" : 5,
		"ID_mark" : 1,
		"ID_region" : 3,
		"Name" : "Leganza (V100) [GEN]",
		"Code" : "V97",
		"Type" : null,
		"YearFrom" : "1998",
		"YearTo" : "2002",
		"ID" : 97,
		"ID_model" : 5,
		"Code" : "2000",
		"Type" : null,
		"Body" : null,
		"Class" : null,
		"Capasity" : null,
		"Fuell" : null,
		"Transmission" : null,
		"DataRange" : "2000"
	},
	{
		"ID" : 1,
		"Name" : "Chevrolet Europe",
		"ID" : 5,
		"ID_mark" : 1,
		"ID_region" : 3,
		"Name" : "Leganza (V100) [GEN]",
		"Code" : "V97",
		"Type" : null,
		"YearFrom" : "1998",
		"YearTo" : "2002",
		"ID" : 102,
		"ID_model" : 5,
		"Code" : "2001",
		"Type" : null,
		"Body" : null,
		"Class" : null,
		"Capasity" : null,
		"Fuell" : null,
		"Transmission" : null,
		"DataRange" : "2001"
	},
	{
		"ID" : 1,
		"Name" : "Chevrolet Europe",
		"ID" : 5,
		"ID_mark" : 1,
		"ID_region" : 3,
		"Name" : "Leganza (V100) [GEN]",
		"Code" : "V97",
		"Type" : null,
		"YearFrom" : "1998",
		"YearTo" : "2002",
		"ID" : 107,
		"ID_model" : 5,
		"Code" : "2002",
		"Type" : null,
		"Body" : null,
		"Class" : null,
		"Capasity" : null,
		"Fuell" : null,
		"Transmission" : null,
		"DataRange" : "2002"
	},
	{
		"ID" : 1,
		"Name" : "Chevrolet Europe",
		"ID" : 6,
		"ID_mark" : 1,
		"ID_region" : 2,
		"Name" : "MATIZ + SPARK (M100) [EUR]",
		"Code" : "M98",
		"Type" : null,
		"YearFrom" : "1998",
		"YearTo" : "2005",
		"ID" : 17,
		"ID_model" : 6,
		"Code" : "1998",
		"Type" : null,
		"Body" : null,
		"Class" : null,
		"Capasity" : null,
		"Fuell" : null,
		"Transmission" : null,
		"DataRange" : "1998"
	},
	{
		"ID" : 1,
		"Name" : "Chevrolet Europe",
		"ID" : 6,
		"ID_mark" : 1,
		"ID_region" : 2,
		"Name" : "MATIZ + SPARK (M100) [EUR]",
		"Code" : "M98",
		"Type" : null,
		"YearFrom" : "1998",
		"YearTo" : "2005",
		"ID" : 21,
		"ID_model" : 6,
		"Code" : "1999",
		"Type" : null,
		"Body" : null,
		"Class" : null,
		"Capasity" : null,
		"Fuell" : null,
		"Transmission" : null,
		"DataRange" : "1999"
	},
	{
		"ID" : 1,
		"Name" : "Chevrolet Europe",
		"ID" : 6,
		"ID_mark" : 1,
		"ID_region" : 2,
		"Name" : "MATIZ + SPARK (M100) [EUR]",
		"Code" : "M98",
		"Type" : null,
		"YearFrom" : "1998",
		"YearTo" : "2005",
		"ID" : 25,
		"ID_model" : 6,
		"Code" : "2000",
		"Type" : null,
		"Body" : null,
		"Class" : null,
		"Capasity" : null,
		"Fuell" : null,
		"Transmission" : null,
		"DataRange" : "2000"
	},
	{
		"ID" : 1,
		"Name" : "Chevrolet Europe",
		"ID" : 6,
		"ID_mark" : 1,
		"ID_region" : 2,
		"Name" : "MATIZ + SPARK (M100) [EUR]",
		"Code" : "M98",
		"Type" : null,
		"YearFrom" : "1998",
		"YearTo" : "2005",
		"ID" : 30,
		"ID_model" : 6,
		"Code" : "2001",
		"Type" : null,
		"Body" : null,
		"Class" : null,
		"Capasity" : null,
		"Fuell" : null,
		"Transmission" : null,
		"DataRange" : "2001"
	},
	{
		"ID" : 1,
		"Name" : "Chevrolet Europe",
		"ID" : 6,
		"ID_mark" : 1,
		"ID_region" : 2,
		"Name" : "MATIZ + SPARK (M100) [EUR]",
		"Code" : "M98",
		"Type" : null,
		"YearFrom" : "1998",
		"YearTo" : "2005",
		"ID" : 35,
		"ID_model" : 6,
		"Code" : "2002",
		"Type" : null,
		"Body" : null,
		"Class" : null,
		"Capasity" : null,
		"Fuell" : null,
		"Transmission" : null,
		"DataRange" : "2002"
	},
	{
		"ID" : 1,
		"Name" : "Chevrolet Europe",
		"ID" : 6,
		"ID_mark" : 1,
		"ID_region" : 2,
		"Name" : "MATIZ + SPARK (M100) [EUR]",
		"Code" : "M98",
		"Type" : null,
		"YearFrom" : "1998",
		"YearTo" : "2005",
		"ID" : 40,
		"ID_model" : 6,
		"Code" : "2003",
		"Type" : null,
		"Body" : null,
		"Class" : null,
		"Capasity" : null,
		"Fuell" : null,
		"Transmission" : null,
		"DataRange" : "2003"
	},
	{
		"ID" : 1,
		"Name" : "Chevrolet Europe",
		"ID" : 6,
		"ID_mark" : 1,
		"ID_region" : 2,
		"Name" : "MATIZ + SPARK (M100) [EUR]",
		"Code" : "M98",
		"Type" : null,
		"YearFrom" : "1998",
		"YearTo" : "2005",
		"ID" : 46,
		"ID_model" : 6,
		"Code" : "2004",
		"Type" : null,
		"Body" : null,
		"Class" : null,
		"Capasity" : null,
		"Fuell" : null,
		"Transmission" : null,
		"DataRange" : "2004"
	},
	{
		"ID" : 1,
		"Name" : "Chevrolet Europe",
		"ID" : 6,
		"ID_mark" : 1,
		"ID_region" : 2,
		"Name" : "MATIZ + SPARK (M100) [EUR]",
		"Code" : "M98",
		"Type" : null,
		"YearFrom" : "1998",
		"YearTo" : "2005",
		"ID" : 51,
		"ID_model" : 6,
		"Code" : "2005",
		"Type" : null,
		"Body" : null,
		"Class" : null,
		"Capasity" : null,
		"Fuell" : null,
		"Transmission" : null,
		"DataRange" : "2005"
	},
	{
		"ID" : 1,
		"Name" : "Chevrolet Europe",
		"ID" : 7,
		"ID_mark" : 1,
		"ID_region" : 2,
		"Name" : "MATIZ + SPARK (M200) [EUR]",
		"Code" : "M04",
		"Type" : null,
		"YearFrom" : "2005",
		"YearTo" : "2010",
		"ID" : 52,
		"ID_model" : 7,
		"Code" : "2005",
		"Type" : null,
		"Body" : null,
		"Class" : null,
		"Capasity" : null,
		"Fuell" : null,
		"Transmission" : null,
		"DataRange" : "2005"
	},
	{
		"ID" : 1,
		"Name" : "Chevrolet Europe",
		"ID" : 7,
		"ID_mark" : 1,
		"ID_region" : 2,
		"Name" : "MATIZ + SPARK (M200) [EUR]",
		"Code" : "M04",
		"Type" : null,
		"YearFrom" : "2005",
		"YearTo" : "2010",
		"ID" : 57,
		"ID_model" : 7,
		"Code" : "2006",
		"Type" : null,
		"Body" : null,
		"Class" : null,
		"Capasity" : null,
		"Fuell" : null,
		"Transmission" : null,
		"DataRange" : "2006"
	},
	{
		"ID" : 1,
		"Name" : "Chevrolet Europe",
		"ID" : 7,
		"ID_mark" : 1,
		"ID_region" : 2,
		"Name" : "MATIZ + SPARK (M200) [EUR]",
		"Code" : "M04",
		"Type" : null,
		"YearFrom" : "2005",
		"YearTo" : "2010",
		"ID" : 63,
		"ID_model" : 7,
		"Code" : "2007",
		"Type" : null,
		"Body" : null,
		"Class" : null,
		"Capasity" : null,
		"Fuell" : null,
		"Transmission" : null,
		"DataRange" : "2007"
	},
	{
		"ID" : 1,
		"Name" : "Chevrolet Europe",
		"ID" : 7,
		"ID_mark" : 1,
		"ID_region" : 2,
		"Name" : "MATIZ + SPARK (M200) [EUR]",
		"Code" : "M04",
		"Type" : null,
		"YearFrom" : "2005",
		"YearTo" : "2010",
		"ID" : 69,
		"ID_model" : 7,
		"Code" : "2008",
		"Type" : null,
		"Body" : null,
		"Class" : null,
		"Capasity" : null,
		"Fuell" : null,
		"Transmission" : null,
		"DataRange" : "2008"
	},
	{
		"ID" : 1,
		"Name" : "Chevrolet Europe",
		"ID" : 7,
		"ID_mark" : 1,
		"ID_region" : 2,
		"Name" : "MATIZ + SPARK (M200) [EUR]",
		"Code" : "M04",
		"Type" : null,
		"YearFrom" : "2005",
		"YearTo" : "2010",
		"ID" : 75,
		"ID_model" : 7,
		"Code" : "2009",
		"Type" : null,
		"Body" : null,
		"Class" : null,
		"Capasity" : null,
		"Fuell" : null,
		"Transmission" : null,
		"DataRange" : "2009"
	},
	{
		"ID" : 1,
		"Name" : "Chevrolet Europe",
		"ID" : 7,
		"ID_mark" : 1,
		"ID_region" : 2,
		"Name" : "MATIZ + SPARK (M200) [EUR]",
		"Code" : "M04",
		"Type" : null,
		"YearFrom" : "2005",
		"YearTo" : "2010",
		"ID" : 79,
		"ID_model" : 7,
		"Code" : "2010",
		"Type" : null,
		"Body" : null,
		"Class" : null,
		"Capasity" : null,
		"Fuell" : null,
		"Transmission" : null,
		"DataRange" : "2010"
	},
	{
		"ID" : 1,
		"Name" : "Chevrolet Europe",
		"ID" : 8,
		"ID_mark" : 1,
		"ID_region" : 2,
		"Name" : "LANOS (T100) [EUR]",
		"Code" : "T97",
		"Type" : null,
		"YearFrom" : "1997",
		"YearTo" : "2002",
		"ID" : 15,
		"ID_model" : 8,
		"Code" : "1997",
		"Type" : null,
		"Body" : null,
		"Class" : null,
		"Capasity" : null,
		"Fuell" : null,
		"Transmission" : null,
		"DataRange" : "1997"
	},
	{
		"ID" : 1,
		"Name" : "Chevrolet Europe",
		"ID" : 8,
		"ID_mark" : 1,
		"ID_region" : 2,
		"Name" : "LANOS (T100) [EUR]",
		"Code" : "T97",
		"Type" : null,
		"YearFrom" : "1997",
		"YearTo" : "2002",
		"ID" : 18,
		"ID_model" : 8,
		"Code" : "1998",
		"Type" : null,
		"Body" : null,
		"Class" : null,
		"Capasity" : null,
		"Fuell" : null,
		"Transmission" : null,
		"DataRange" : "1998"
	},
	{
		"ID" : 1,
		"Name" : "Chevrolet Europe",
		"ID" : 8,
		"ID_mark" : 1,
		"ID_region" : 2,
		"Name" : "LANOS (T100) [EUR]",
		"Code" : "T97",
		"Type" : null,
		"YearFrom" : "1997",
		"YearTo" : "2002",
		"ID" : 22,
		"ID_model" : 8,
		"Code" : "1999",
		"Type" : null,
		"Body" : null,
		"Class" : null,
		"Capasity" : null,
		"Fuell" : null,
		"Transmission" : null,
		"DataRange" : "1999"
	},
	{
		"ID" : 1,
		"Name" : "Chevrolet Europe",
		"ID" : 8,
		"ID_mark" : 1,
		"ID_region" : 2,
		"Name" : "LANOS (T100) [EUR]",
		"Code" : "T97",
		"Type" : null,
		"YearFrom" : "1997",
		"YearTo" : "2002",
		"ID" : 26,
		"ID_model" : 8,
		"Code" : "2000",
		"Type" : null,
		"Body" : null,
		"Class" : null,
		"Capasity" : null,
		"Fuell" : null,
		"Transmission" : null,
		"DataRange" : "2000"
	},
	{
		"ID" : 1,
		"Name" : "Chevrolet Europe",
		"ID" : 8,
		"ID_mark" : 1,
		"ID_region" : 2,
		"Name" : "LANOS (T100) [EUR]",
		"Code" : "T97",
		"Type" : null,
		"YearFrom" : "1997",
		"YearTo" : "2002",
		"ID" : 31,
		"ID_model" : 8,
		"Code" : "2001",
		"Type" : null,
		"Body" : null,
		"Class" : null,
		"Capasity" : null,
		"Fuell" : null,
		"Transmission" : null,
		"DataRange" : "2001"
	},
	{
		"ID" : 1,
		"Name" : "Chevrolet Europe",
		"ID" : 8,
		"ID_mark" : 1,
		"ID_region" : 2,
		"Name" : "LANOS (T100) [EUR]",
		"Code" : "T97",
		"Type" : null,
		"YearFrom" : "1997",
		"YearTo" : "2002",
		"ID" : 36,
		"ID_model" : 8,
		"Code" : "2002",
		"Type" : null,
		"Body" : null,
		"Class" : null,
		"Capasity" : null,
		"Fuell" : null,
		"Transmission" : null,
		"DataRange" : "2002"
	},
	{
		"ID" : 1,
		"Name" : "Chevrolet Europe",
		"ID" : 9,
		"ID_mark" : 1,
		"ID_region" : 2,
		"Name" : "AVEO (T255) [EUR]",
		"Code" : "T06",
		"Type" : null,
		"YearFrom" : "2006",
		"YearTo" : "2011",
		"ID" : 58,
		"ID_model" : 9,
		"Code" : "2006",
		"Type" : null,
		"Body" : null,
		"Class" : null,
		"Capasity" : null,
		"Fuell" : null,
		"Transmission" : null,
		"DataRange" : "2006"
	},
	{
		"ID" : 1,
		"Name" : "Chevrolet Europe",
		"ID" : 9,
		"ID_mark" : 1,
		"ID_region" : 2,
		"Name" : "AVEO (T255) [EUR]",
		"Code" : "T06",
		"Type" : null,
		"YearFrom" : "2006",
		"YearTo" : "2011",
		"ID" : 64,
		"ID_model" : 9,
		"Code" : "2007",
		"Type" : null,
		"Body" : null,
		"Class" : null,
		"Capasity" : null,
		"Fuell" : null,
		"Transmission" : null,
		"DataRange" : "2007"
	},
	{
		"ID" : 1,
		"Name" : "Chevrolet Europe",
		"ID" : 9,
		"ID_mark" : 1,
		"ID_region" : 2,
		"Name" : "AVEO (T255) [EUR]",
		"Code" : "T06",
		"Type" : null,
		"YearFrom" : "2006",
		"YearTo" : "2011",
		"ID" : 70,
		"ID_model" : 9,
		"Code" : "2008",
		"Type" : null,
		"Body" : null,
		"Class" : null,
		"Capasity" : null,
		"Fuell" : null,
		"Transmission" : null,
		"DataRange" : "2008"
	},
	{
		"ID" : 1,
		"Name" : "Chevrolet Europe",
		"ID" : 9,
		"ID_mark" : 1,
		"ID_region" : 2,
		"Name" : "AVEO (T255) [EUR]",
		"Code" : "T06",
		"Type" : null,
		"YearFrom" : "2006",
		"YearTo" : "2011",
		"ID" : 76,
		"ID_model" : 9,
		"Code" : "2009",
		"Type" : null,
		"Body" : null,
		"Class" : null,
		"Capasity" : null,
		"Fuell" : null,
		"Transmission" : null,
		"DataRange" : "2009"
	},
	{
		"ID" : 1,
		"Name" : "Chevrolet Europe",
		"ID" : 9,
		"ID_mark" : 1,
		"ID_region" : 2,
		"Name" : "AVEO (T255) [EUR]",
		"Code" : "T06",
		"Type" : null,
		"YearFrom" : "2006",
		"YearTo" : "2011",
		"ID" : 80,
		"ID_model" : 9,
		"Code" : "2010",
		"Type" : null,
		"Body" : null,
		"Class" : null,
		"Capasity" : null,
		"Fuell" : null,
		"Transmission" : null,
		"DataRange" : "2010"
	},
	{
		"ID" : 1,
		"Name" : "Chevrolet Europe",
		"ID" : 9,
		"ID_mark" : 1,
		"ID_region" : 2,
		"Name" : "AVEO (T255) [EUR]",
		"Code" : "T06",
		"Type" : null,
		"YearFrom" : "2006",
		"YearTo" : "2011",
		"ID" : 83,
		"ID_model" : 9,
		"Code" : "2011",
		"Type" : null,
		"Body" : null,
		"Class" : null,
		"Capasity" : null,
		"Fuell" : null,
		"Transmission" : null,
		"DataRange" : "2011"
	},
	{
		"ID" : 1,
		"Name" : "Chevrolet Europe",
		"ID" : 10,
		"ID_mark" : 1,
		"ID_region" : 3,
		"Name" : "Nubira (J100) [GEN]",
		"Code" : "J97",
		"Type" : null,
		"YearFrom" : "1997",
		"YearTo" : "1999",
		"ID" : 86,
		"ID_model" : 10,
		"Code" : "1997",
		"Type" : null,
		"Body" : null,
		"Class" : null,
		"Capasity" : null,
		"Fuell" : null,
		"Transmission" : null,
		"DataRange" : "1997"
	},
	{
		"ID" : 1,
		"Name" : "Chevrolet Europe",
		"ID" : 10,
		"ID_mark" : 1,
		"ID_region" : 3,
		"Name" : "Nubira (J100) [GEN]",
		"Code" : "J97",
		"Type" : null,
		"YearFrom" : "1997",
		"YearTo" : "1999",
		"ID" : 89,
		"ID_model" : 10,
		"Code" : "1998",
		"Type" : null,
		"Body" : null,
		"Class" : null,
		"Capasity" : null,
		"Fuell" : null,
		"Transmission" : null,
		"DataRange" : "1998"
	},
	{
		"ID" : 1,
		"Name" : "Chevrolet Europe",
		"ID" : 10,
		"ID_mark" : 1,
		"ID_region" : 3,
		"Name" : "Nubira (J100) [GEN]",
		"Code" : "J97",
		"Type" : null,
		"YearFrom" : "1997",
		"YearTo" : "1999",
		"ID" : 93,
		"ID_model" : 10,
		"Code" : "1999",
		"Type" : null,
		"Body" : null,
		"Class" : null,
		"Capasity" : null,
		"Fuell" : null,
		"Transmission" : null,
		"DataRange" : "1999"
	},
	{
		"ID" : 1,
		"Name" : "Chevrolet Europe",
		"ID" : 11,
		"ID_mark" : 1,
		"ID_region" : 3,
		"Name" : "Vivant (U100) [GEN]",
		"Code" : "U00",
		"Type" : null,
		"YearFrom" : "2000",
		"YearTo" : "2008",
		"ID" : 98,
		"ID_model" : 11,
		"Code" : "2000",
		"Type" : null,
		"Body" : null,
		"Class" : null,
		"Capasity" : null,
		"Fuell" : null,
		"Transmission" : null,
		"DataRange" : "2000"
	},
	{
		"ID" : 1,
		"Name" : "Chevrolet Europe",
		"ID" : 11,
		"ID_mark" : 1,
		"ID_region" : 3,
		"Name" : "Vivant (U100) [GEN]",
		"Code" : "U00",
		"Type" : null,
		"YearFrom" : "2000",
		"YearTo" : "2008",
		"ID" : 103,
		"ID_model" : 11,
		"Code" : "2001",
		"Type" : null,
		"Body" : null,
		"Class" : null,
		"Capasity" : null,
		"Fuell" : null,
		"Transmission" : null,
		"DataRange" : "2001"
	},
	{
		"ID" : 1,
		"Name" : "Chevrolet Europe",
		"ID" : 11,
		"ID_mark" : 1,
		"ID_region" : 3,
		"Name" : "Vivant (U100) [GEN]",
		"Code" : "U00",
		"Type" : null,
		"YearFrom" : "2000",
		"YearTo" : "2008",
		"ID" : 108,
		"ID_model" : 11,
		"Code" : "2002",
		"Type" : null,
		"Body" : null,
		"Class" : null,
		"Capasity" : null,
		"Fuell" : null,
		"Transmission" : null,
		"DataRange" : "2002"
	},
	{
		"ID" : 1,
		"Name" : "Chevrolet Europe",
		"ID" : 11,
		"ID_mark" : 1,
		"ID_region" : 3,
		"Name" : "Vivant (U100) [GEN]",
		"Code" : "U00",
		"Type" : null,
		"YearFrom" : "2000",
		"YearTo" : "2008",
		"ID" : 113,
		"ID_model" : 11,
		"Code" : "2003",
		"Type" : null,
		"Body" : null,
		"Class" : null,
		"Capasity" : null,
		"Fuell" : null,
		"Transmission" : null,
		"DataRange" : "2003"
	},
	{
		"ID" : 1,
		"Name" : "Chevrolet Europe",
		"ID" : 11,
		"ID_mark" : 1,
		"ID_region" : 3,
		"Name" : "Vivant (U100) [GEN]",
		"Code" : "U00",
		"Type" : null,
		"YearFrom" : "2000",
		"YearTo" : "2008",
		"ID" : 119,
		"ID_model" : 11,
		"Code" : "2004",
		"Type" : null,
		"Body" : null,
		"Class" : null,
		"Capasity" : null,
		"Fuell" : null,
		"Transmission" : null,
		"DataRange" : "2004"
	},
	{
		"ID" : 1,
		"Name" : "Chevrolet Europe",
		"ID" : 11,
		"ID_mark" : 1,
		"ID_region" : 3,
		"Name" : "Vivant (U100) [GEN]",
		"Code" : "U00",
		"Type" : null,
		"YearFrom" : "2000",
		"YearTo" : "2008",
		"ID" : 125,
		"ID_model" : 11,
		"Code" : "2005",
		"Type" : null,
		"Body" : null,
		"Class" : null,
		"Capasity" : null,
		"Fuell" : null,
		"Transmission" : null,
		"DataRange" : "2005"
	},
	{
		"ID" : 1,
		"Name" : "Chevrolet Europe",
		"ID" : 11,
		"ID_mark" : 1,
		"ID_region" : 3,
		"Name" : "Vivant (U100) [GEN]",
		"Code" : "U00",
		"Type" : null,
		"YearFrom" : "2000",
		"YearTo" : "2008",
		"ID" : 131,
		"ID_model" : 11,
		"Code" : "2006",
		"Type" : null,
		"Body" : null,
		"Class" : null,
		"Capasity" : null,
		"Fuell" : null,
		"Transmission" : null,
		"DataRange" : "2006"
	},
	{
		"ID" : 1,
		"Name" : "Chevrolet Europe",
		"ID" : 11,
		"ID_mark" : 1,
		"ID_region" : 3,
		"Name" : "Vivant (U100) [GEN]",
		"Code" : "U00",
		"Type" : null,
		"YearFrom" : "2000",
		"YearTo" : "2008",
		"ID" : 139,
		"ID_model" : 11,
		"Code" : "2007",
		"Type" : null,
		"Body" : null,
		"Class" : null,
		"Capasity" : null,
		"Fuell" : null,
		"Transmission" : null,
		"DataRange" : "2007"
	},
	{
		"ID" : 1,
		"Name" : "Chevrolet Europe",
		"ID" : 11,
		"ID_mark" : 1,
		"ID_region" : 3,
		"Name" : "Vivant (U100) [GEN]",
		"Code" : "U00",
		"Type" : null,
		"YearFrom" : "2000",
		"YearTo" : "2008",
		"ID" : 145,
		"ID_model" : 11,
		"Code" : "2008",
		"Type" : null,
		"Body" : null,
		"Class" : null,
		"Capasity" : null,
		"Fuell" : null,
		"Transmission" : null,
		"DataRange" : "2008"
	},
	{
		"ID" : 1,
		"Name" : "Chevrolet Europe",
		"ID" : 12,
		"ID_mark" : 1,
		"ID_region" : 2,
		"Name" : "EPICA (V250) [EUR]",
		"Code" : "V06",
		"Type" : null,
		"YearFrom" : "2007",
		"YearTo" : "2011",
		"ID" : 65,
		"ID_model" : 12,
		"Code" : "2007",
		"Type" : null,
		"Body" : null,
		"Class" : null,
		"Capasity" : null,
		"Fuell" : null,
		"Transmission" : null,
		"DataRange" : "2007"
	},
	{
		"ID" : 1,
		"Name" : "Chevrolet Europe",
		"ID" : 12,
		"ID_mark" : 1,
		"ID_region" : 2,
		"Name" : "EPICA (V250) [EUR]",
		"Code" : "V06",
		"Type" : null,
		"YearFrom" : "2007",
		"YearTo" : "2011",
		"ID" : 71,
		"ID_model" : 12,
		"Code" : "2008",
		"Type" : null,
		"Body" : null,
		"Class" : null,
		"Capasity" : null,
		"Fuell" : null,
		"Transmission" : null,
		"DataRange" : "2008"
	},
	{
		"ID" : 1,
		"Name" : "Chevrolet Europe",
		"ID" : 12,
		"ID_mark" : 1,
		"ID_region" : 2,
		"Name" : "EPICA (V250) [EUR]",
		"Code" : "V06",
		"Type" : null,
		"YearFrom" : "2007",
		"YearTo" : "2011",
		"ID" : 77,
		"ID_model" : 12,
		"Code" : "2009",
		"Type" : null,
		"Body" : null,
		"Class" : null,
		"Capasity" : null,
		"Fuell" : null,
		"Transmission" : null,
		"DataRange" : "2009"
	},
	{
		"ID" : 1,
		"Name" : "Chevrolet Europe",
		"ID" : 12,
		"ID_mark" : 1,
		"ID_region" : 2,
		"Name" : "EPICA (V250) [EUR]",
		"Code" : "V06",
		"Type" : null,
		"YearFrom" : "2007",
		"YearTo" : "2011",
		"ID" : 81,
		"ID_model" : 12,
		"Code" : "2010",
		"Type" : null,
		"Body" : null,
		"Class" : null,
		"Capasity" : null,
		"Fuell" : null,
		"Transmission" : null,
		"DataRange" : "2010"
	},
	{
		"ID" : 1,
		"Name" : "Chevrolet Europe",
		"ID" : 12,
		"ID_mark" : 1,
		"ID_region" : 2,
		"Name" : "EPICA (V250) [EUR]",
		"Code" : "V06",
		"Type" : null,
		"YearFrom" : "2007",
		"YearTo" : "2011",
		"ID" : 84,
		"ID_model" : 12,
		"Code" : "2011",
		"Type" : null,
		"Body" : null,
		"Class" : null,
		"Capasity" : null,
		"Fuell" : null,
		"Transmission" : null,
		"DataRange" : "2011"
	},
	{
		"ID" : 1,
		"Name" : "Chevrolet Europe",
		"ID" : 13,
		"ID_mark" : 1,
		"ID_region" : 3,
		"Name" : "Aveo (T255) [GEN]",
		"Code" : "T06",
		"Type" : null,
		"YearFrom" : "2006",
		"YearTo" : "2011",
		"ID" : 132,
		"ID_model" : 13,
		"Code" : "2006",
		"Type" : null,
		"Body" : null,
		"Class" : null,
		"Capasity" : null,
		"Fuell" : null,
		"Transmission" : null,
		"DataRange" : "2006"
	},
	{
		"ID" : 1,
		"Name" : "Chevrolet Europe",
		"ID" : 13,
		"ID_mark" : 1,
		"ID_region" : 3,
		"Name" : "Aveo (T255) [GEN]",
		"Code" : "T06",
		"Type" : null,
		"YearFrom" : "2006",
		"YearTo" : "2011",
		"ID" : 140,
		"ID_model" : 13,
		"Code" : "2007",
		"Type" : null,
		"Body" : null,
		"Class" : null,
		"Capasity" : null,
		"Fuell" : null,
		"Transmission" : null,
		"DataRange" : "2007"
	},
	{
		"ID" : 1,
		"Name" : "Chevrolet Europe",
		"ID" : 13,
		"ID_mark" : 1,
		"ID_region" : 3,
		"Name" : "Aveo (T255) [GEN]",
		"Code" : "T06",
		"Type" : null,
		"YearFrom" : "2006",
		"YearTo" : "2011",
		"ID" : 146,
		"ID_model" : 13,
		"Code" : "2008",
		"Type" : null,
		"Body" : null,
		"Class" : null,
		"Capasity" : null,
		"Fuell" : null,
		"Transmission" : null,
		"DataRange" : "2008"
	},
	{
		"ID" : 1,
		"Name" : "Chevrolet Europe",
		"ID" : 13,
		"ID_mark" : 1,
		"ID_region" : 3,
		"Name" : "Aveo (T255) [GEN]",
		"Code" : "T06",
		"Type" : null,
		"YearFrom" : "2006",
		"YearTo" : "2011",
		"ID" : 150,
		"ID_model" : 13,
		"Code" : "2009",
		"Type" : null,
		"Body" : null,
		"Class" : null,
		"Capasity" : null,
		"Fuell" : null,
		"Transmission" : null,
		"DataRange" : "2009"
	},
	{
		"ID" : 1,
		"Name" : "Chevrolet Europe",
		"ID" : 13,
		"ID_mark" : 1,
		"ID_region" : 3,
		"Name" : "Aveo (T255) [GEN]",
		"Code" : "T06",
		"Type" : null,
		"YearFrom" : "2006",
		"YearTo" : "2011",
		"ID" : 154,
		"ID_model" : 13,
		"Code" : "2010",
		"Type" : null,
		"Body" : null,
		"Class" : null,
		"Capasity" : null,
		"Fuell" : null,
		"Transmission" : null,
		"DataRange" : "2010"
	},
	{
		"ID" : 1,
		"Name" : "Chevrolet Europe",
		"ID" : 13,
		"ID_mark" : 1,
		"ID_region" : 3,
		"Name" : "Aveo (T255) [GEN]",
		"Code" : "T06",
		"Type" : null,
		"YearFrom" : "2006",
		"YearTo" : "2011",
		"ID" : 158,
		"ID_model" : 13,
		"Code" : "2011",
		"Type" : null,
		"Body" : null,
		"Class" : null,
		"Capasity" : null,
		"Fuell" : null,
		"Transmission" : null,
		"DataRange" : "2011"
	},
	{
		"ID" : 1,
		"Name" : "Chevrolet Europe",
		"ID" : 14,
		"ID_mark" : 1,
		"ID_region" : 3,
		"Name" : "Matiz + Spark (M100) [GEN]",
		"Code" : "M98",
		"Type" : null,
		"YearFrom" : "1998",
		"YearTo" : "2006",
		"ID" : 90,
		"ID_model" : 14,
		"Code" : "1998",
		"Type" : null,
		"Body" : null,
		"Class" : null,
		"Capasity" : null,
		"Fuell" : null,
		"Transmission" : null,
		"DataRange" : "1998"
	},
	{
		"ID" : 1,
		"Name" : "Chevrolet Europe",
		"ID" : 14,
		"ID_mark" : 1,
		"ID_region" : 3,
		"Name" : "Matiz + Spark (M100) [GEN]",
		"Code" : "M98",
		"Type" : null,
		"YearFrom" : "1998",
		"YearTo" : "2006",
		"ID" : 94,
		"ID_model" : 14,
		"Code" : "1999",
		"Type" : null,
		"Body" : null,
		"Class" : null,
		"Capasity" : null,
		"Fuell" : null,
		"Transmission" : null,
		"DataRange" : "1999"
	},
	{
		"ID" : 1,
		"Name" : "Chevrolet Europe",
		"ID" : 14,
		"ID_mark" : 1,
		"ID_region" : 3,
		"Name" : "Matiz + Spark (M100) [GEN]",
		"Code" : "M98",
		"Type" : null,
		"YearFrom" : "1998",
		"YearTo" : "2006",
		"ID" : 99,
		"ID_model" : 14,
		"Code" : "2000",
		"Type" : null,
		"Body" : null,
		"Class" : null,
		"Capasity" : null,
		"Fuell" : null,
		"Transmission" : null,
		"DataRange" : "2000"
	},
	{
		"ID" : 1,
		"Name" : "Chevrolet Europe",
		"ID" : 14,
		"ID_mark" : 1,
		"ID_region" : 3,
		"Name" : "Matiz + Spark (M100) [GEN]",
		"Code" : "M98",
		"Type" : null,
		"YearFrom" : "1998",
		"YearTo" : "2006",
		"ID" : 104,
		"ID_model" : 14,
		"Code" : "2001",
		"Type" : null,
		"Body" : null,
		"Class" : null,
		"Capasity" : null,
		"Fuell" : null,
		"Transmission" : null,
		"DataRange" : "2001"
	},
	{
		"ID" : 1,
		"Name" : "Chevrolet Europe",
		"ID" : 14,
		"ID_mark" : 1,
		"ID_region" : 3,
		"Name" : "Matiz + Spark (M100) [GEN]",
		"Code" : "M98",
		"Type" : null,
		"YearFrom" : "1998",
		"YearTo" : "2006",
		"ID" : 109,
		"ID_model" : 14,
		"Code" : "2002",
		"Type" : null,
		"Body" : null,
		"Class" : null,
		"Capasity" : null,
		"Fuell" : null,
		"Transmission" : null,
		"DataRange" : "2002"
	},
	{
		"ID" : 1,
		"Name" : "Chevrolet Europe",
		"ID" : 14,
		"ID_mark" : 1,
		"ID_region" : 3,
		"Name" : "Matiz + Spark (M100) [GEN]",
		"Code" : "M98",
		"Type" : null,
		"YearFrom" : "1998",
		"YearTo" : "2006",
		"ID" : 114,
		"ID_model" : 14,
		"Code" : "2003",
		"Type" : null,
		"Body" : null,
		"Class" : null,
		"Capasity" : null,
		"Fuell" : null,
		"Transmission" : null,
		"DataRange" : "2003"
	},
	{
		"ID" : 1,
		"Name" : "Chevrolet Europe",
		"ID" : 14,
		"ID_mark" : 1,
		"ID_region" : 3,
		"Name" : "Matiz + Spark (M100) [GEN]",
		"Code" : "M98",
		"Type" : null,
		"YearFrom" : "1998",
		"YearTo" : "2006",
		"ID" : 120,
		"ID_model" : 14,
		"Code" : "2004",
		"Type" : null,
		"Body" : null,
		"Class" : null,
		"Capasity" : null,
		"Fuell" : null,
		"Transmission" : null,
		"DataRange" : "2004"
	},
	{
		"ID" : 1,
		"Name" : "Chevrolet Europe",
		"ID" : 14,
		"ID_mark" : 1,
		"ID_region" : 3,
		"Name" : "Matiz + Spark (M100) [GEN]",
		"Code" : "M98",
		"Type" : null,
		"YearFrom" : "1998",
		"YearTo" : "2006",
		"ID" : 126,
		"ID_model" : 14,
		"Code" : "2005",
		"Type" : null,
		"Body" : null,
		"Class" : null,
		"Capasity" : null,
		"Fuell" : null,
		"Transmission" : null,
		"DataRange" : "2005"
	},
	{
		"ID" : 1,
		"Name" : "Chevrolet Europe",
		"ID" : 14,
		"ID_mark" : 1,
		"ID_region" : 3,
		"Name" : "Matiz + Spark (M100) [GEN]",
		"Code" : "M98",
		"Type" : null,
		"YearFrom" : "1998",
		"YearTo" : "2006",
		"ID" : 133,
		"ID_model" : 14,
		"Code" : "2006",
		"Type" : null,
		"Body" : null,
		"Class" : null,
		"Capasity" : null,
		"Fuell" : null,
		"Transmission" : null,
		"DataRange" : "2006"
	},
	{
		"ID" : 1,
		"Name" : "Chevrolet Europe",
		"ID" : 15,
		"ID_mark" : 1,
		"ID_region" : 2,
		"Name" : "NUBIRA (J150) [EUR]",
		"Code" : "J99",
		"Type" : null,
		"YearFrom" : "1999",
		"YearTo" : "2003",
		"ID" : 23,
		"ID_model" : 15,
		"Code" : "1999",
		"Type" : null,
		"Body" : null,
		"Class" : null,
		"Capasity" : null,
		"Fuell" : null,
		"Transmission" : null,
		"DataRange" : "1999"
	},
	{
		"ID" : 1,
		"Name" : "Chevrolet Europe",
		"ID" : 15,
		"ID_mark" : 1,
		"ID_region" : 2,
		"Name" : "NUBIRA (J150) [EUR]",
		"Code" : "J99",
		"Type" : null,
		"YearFrom" : "1999",
		"YearTo" : "2003",
		"ID" : 27,
		"ID_model" : 15,
		"Code" : "2000",
		"Type" : null,
		"Body" : null,
		"Class" : null,
		"Capasity" : null,
		"Fuell" : null,
		"Transmission" : null,
		"DataRange" : "2000"
	},
	{
		"ID" : 1,
		"Name" : "Chevrolet Europe",
		"ID" : 15,
		"ID_mark" : 1,
		"ID_region" : 2,
		"Name" : "NUBIRA (J150) [EUR]",
		"Code" : "J99",
		"Type" : null,
		"YearFrom" : "1999",
		"YearTo" : "2003",
		"ID" : 32,
		"ID_model" : 15,
		"Code" : "2001",
		"Type" : null,
		"Body" : null,
		"Class" : null,
		"Capasity" : null,
		"Fuell" : null,
		"Transmission" : null,
		"DataRange" : "2001"
	},
	{
		"ID" : 1,
		"Name" : "Chevrolet Europe",
		"ID" : 15,
		"ID_mark" : 1,
		"ID_region" : 2,
		"Name" : "NUBIRA (J150) [EUR]",
		"Code" : "J99",
		"Type" : null,
		"YearFrom" : "1999",
		"YearTo" : "2003",
		"ID" : 37,
		"ID_model" : 15,
		"Code" : "2002",
		"Type" : null,
		"Body" : null,
		"Class" : null,
		"Capasity" : null,
		"Fuell" : null,
		"Transmission" : null,
		"DataRange" : "2002"
	},
	{
		"ID" : 1,
		"Name" : "Chevrolet Europe",
		"ID" : 15,
		"ID_mark" : 1,
		"ID_region" : 2,
		"Name" : "NUBIRA (J150) [EUR]",
		"Code" : "J99",
		"Type" : null,
		"YearFrom" : "1999",
		"YearTo" : "2003",
		"ID" : 41,
		"ID_model" : 15,
		"Code" : "2003",
		"Type" : null,
		"Body" : null,
		"Class" : null,
		"Capasity" : null,
		"Fuell" : null,
		"Transmission" : null,
		"DataRange" : "2003"
	},
	{
		"ID" : 1,
		"Name" : "Chevrolet Europe",
		"ID" : 16,
		"ID_mark" : 1,
		"ID_region" : 2,
		"Name" : "EVANDA (V200) [EUR]",
		"Code" : "V99",
		"Type" : null,
		"YearFrom" : "2003",
		"YearTo" : "2006",
		"ID" : 42,
		"ID_model" : 16,
		"Code" : "2003",
		"Type" : null,
		"Body" : null,
		"Class" : null,
		"Capasity" : null,
		"Fuell" : null,
		"Transmission" : null,
		"DataRange" : "2003"
	},
	{
		"ID" : 1,
		"Name" : "Chevrolet Europe",
		"ID" : 16,
		"ID_mark" : 1,
		"ID_region" : 2,
		"Name" : "EVANDA (V200) [EUR]",
		"Code" : "V99",
		"Type" : null,
		"YearFrom" : "2003",
		"YearTo" : "2006",
		"ID" : 47,
		"ID_model" : 16,
		"Code" : "2004",
		"Type" : null,
		"Body" : null,
		"Class" : null,
		"Capasity" : null,
		"Fuell" : null,
		"Transmission" : null,
		"DataRange" : "2004"
	},
	{
		"ID" : 1,
		"Name" : "Chevrolet Europe",
		"ID" : 16,
		"ID_mark" : 1,
		"ID_region" : 2,
		"Name" : "EVANDA (V200) [EUR]",
		"Code" : "V99",
		"Type" : null,
		"YearFrom" : "2003",
		"YearTo" : "2006",
		"ID" : 53,
		"ID_model" : 16,
		"Code" : "2005",
		"Type" : null,
		"Body" : null,
		"Class" : null,
		"Capasity" : null,
		"Fuell" : null,
		"Transmission" : null,
		"DataRange" : "2005"
	},
	{
		"ID" : 1,
		"Name" : "Chevrolet Europe",
		"ID" : 16,
		"ID_mark" : 1,
		"ID_region" : 2,
		"Name" : "EVANDA (V200) [EUR]",
		"Code" : "V99",
		"Type" : null,
		"YearFrom" : "2003",
		"YearTo" : "2006",
		"ID" : 59,
		"ID_model" : 16,
		"Code" : "2006",
		"Type" : null,
		"Body" : null,
		"Class" : null,
		"Capasity" : null,
		"Fuell" : null,
		"Transmission" : null,
		"DataRange" : "2006"
	},
	{
		"ID" : 1,
		"Name" : "Chevrolet Europe",
		"ID" : 17,
		"ID_mark" : 1,
		"ID_region" : 3,
		"Name" : "Nubira (J150) [GEN]",
		"Code" : "J99",
		"Type" : null,
		"YearFrom" : "1999",
		"YearTo" : "2003",
		"ID" : 95,
		"ID_model" : 17,
		"Code" : "1999",
		"Type" : null,
		"Body" : null,
		"Class" : null,
		"Capasity" : null,
		"Fuell" : null,
		"Transmission" : null,
		"DataRange" : "1999"
	},
	{
		"ID" : 1,
		"Name" : "Chevrolet Europe",
		"ID" : 17,
		"ID_mark" : 1,
		"ID_region" : 3,
		"Name" : "Nubira (J150) [GEN]",
		"Code" : "J99",
		"Type" : null,
		"YearFrom" : "1999",
		"YearTo" : "2003",
		"ID" : 100,
		"ID_model" : 17,
		"Code" : "2000",
		"Type" : null,
		"Body" : null,
		"Class" : null,
		"Capasity" : null,
		"Fuell" : null,
		"Transmission" : null,
		"DataRange" : "2000"
	},
	{
		"ID" : 1,
		"Name" : "Chevrolet Europe",
		"ID" : 17,
		"ID_mark" : 1,
		"ID_region" : 3,
		"Name" : "Nubira (J150) [GEN]",
		"Code" : "J99",
		"Type" : null,
		"YearFrom" : "1999",
		"YearTo" : "2003",
		"ID" : 105,
		"ID_model" : 17,
		"Code" : "2001",
		"Type" : null,
		"Body" : null,
		"Class" : null,
		"Capasity" : null,
		"Fuell" : null,
		"Transmission" : null,
		"DataRange" : "2001"
	},
	{
		"ID" : 1,
		"Name" : "Chevrolet Europe",
		"ID" : 17,
		"ID_mark" : 1,
		"ID_region" : 3,
		"Name" : "Nubira (J150) [GEN]",
		"Code" : "J99",
		"Type" : null,
		"YearFrom" : "1999",
		"YearTo" : "2003",
		"ID" : 110,
		"ID_model" : 17,
		"Code" : "2002",
		"Type" : null,
		"Body" : null,
		"Class" : null,
		"Capasity" : null,
		"Fuell" : null,
		"Transmission" : null,
		"DataRange" : "2002"
	},
	{
		"ID" : 1,
		"Name" : "Chevrolet Europe",
		"ID" : 17,
		"ID_mark" : 1,
		"ID_region" : 3,
		"Name" : "Nubira (J150) [GEN]",
		"Code" : "J99",
		"Type" : null,
		"YearFrom" : "1999",
		"YearTo" : "2003",
		"ID" : 115,
		"ID_model" : 17,
		"Code" : "2003",
		"Type" : null,
		"Body" : null,
		"Class" : null,
		"Capasity" : null,
		"Fuell" : null,
		"Transmission" : null,
		"DataRange" : "2003"
	},
	{
		"ID" : 1,
		"Name" : "Chevrolet Europe",
		"ID" : 18,
		"ID_mark" : 1,
		"ID_region" : 2,
		"Name" : "LACETTI + NUBIRA + OPTRA (J200) [EUR]",
		"Code" : "J03",
		"Type" : null,
		"YearFrom" : "2003",
		"YearTo" : "2011",
		"ID" : 43,
		"ID_model" : 18,
		"Code" : "2003",
		"Type" : null,
		"Body" : null,
		"Class" : null,
		"Capasity" : null,
		"Fuell" : null,
		"Transmission" : null,
		"DataRange" : "2003"
	},
	{
		"ID" : 1,
		"Name" : "Chevrolet Europe",
		"ID" : 18,
		"ID_mark" : 1,
		"ID_region" : 2,
		"Name" : "LACETTI + NUBIRA + OPTRA (J200) [EUR]",
		"Code" : "J03",
		"Type" : null,
		"YearFrom" : "2003",
		"YearTo" : "2011",
		"ID" : 48,
		"ID_model" : 18,
		"Code" : "2004",
		"Type" : null,
		"Body" : null,
		"Class" : null,
		"Capasity" : null,
		"Fuell" : null,
		"Transmission" : null,
		"DataRange" : "2004"
	},
	{
		"ID" : 1,
		"Name" : "Chevrolet Europe",
		"ID" : 18,
		"ID_mark" : 1,
		"ID_region" : 2,
		"Name" : "LACETTI + NUBIRA + OPTRA (J200) [EUR]",
		"Code" : "J03",
		"Type" : null,
		"YearFrom" : "2003",
		"YearTo" : "2011",
		"ID" : 54,
		"ID_model" : 18,
		"Code" : "2005",
		"Type" : null,
		"Body" : null,
		"Class" : null,
		"Capasity" : null,
		"Fuell" : null,
		"Transmission" : null,
		"DataRange" : "2005"
	},
	{
		"ID" : 1,
		"Name" : "Chevrolet Europe",
		"ID" : 18,
		"ID_mark" : 1,
		"ID_region" : 2,
		"Name" : "LACETTI + NUBIRA + OPTRA (J200) [EUR]",
		"Code" : "J03",
		"Type" : null,
		"YearFrom" : "2003",
		"YearTo" : "2011",
		"ID" : 60,
		"ID_model" : 18,
		"Code" : "2006",
		"Type" : null,
		"Body" : null,
		"Class" : null,
		"Capasity" : null,
		"Fuell" : null,
		"Transmission" : null,
		"DataRange" : "2006"
	},
	{
		"ID" : 1,
		"Name" : "Chevrolet Europe",
		"ID" : 18,
		"ID_mark" : 1,
		"ID_region" : 2,
		"Name" : "LACETTI + NUBIRA + OPTRA (J200) [EUR]",
		"Code" : "J03",
		"Type" : null,
		"YearFrom" : "2003",
		"YearTo" : "2011",
		"ID" : 66,
		"ID_model" : 18,
		"Code" : "2007",
		"Type" : null,
		"Body" : null,
		"Class" : null,
		"Capasity" : null,
		"Fuell" : null,
		"Transmission" : null,
		"DataRange" : "2007"
	},
	{
		"ID" : 1,
		"Name" : "Chevrolet Europe",
		"ID" : 18,
		"ID_mark" : 1,
		"ID_region" : 2,
		"Name" : "LACETTI + NUBIRA + OPTRA (J200) [EUR]",
		"Code" : "J03",
		"Type" : null,
		"YearFrom" : "2003",
		"YearTo" : "2011",
		"ID" : 72,
		"ID_model" : 18,
		"Code" : "2008",
		"Type" : null,
		"Body" : null,
		"Class" : null,
		"Capasity" : null,
		"Fuell" : null,
		"Transmission" : null,
		"DataRange" : "2008"
	},
	{
		"ID" : 1,
		"Name" : "Chevrolet Europe",
		"ID" : 18,
		"ID_mark" : 1,
		"ID_region" : 2,
		"Name" : "LACETTI + NUBIRA + OPTRA (J200) [EUR]",
		"Code" : "J03",
		"Type" : null,
		"YearFrom" : "2003",
		"YearTo" : "2011",
		"ID" : 78,
		"ID_model" : 18,
		"Code" : "2009",
		"Type" : null,
		"Body" : null,
		"Class" : null,
		"Capasity" : null,
		"Fuell" : null,
		"Transmission" : null,
		"DataRange" : "2009"
	},
	{
		"ID" : 1,
		"Name" : "Chevrolet Europe",
		"ID" : 18,
		"ID_mark" : 1,
		"ID_region" : 2,
		"Name" : "LACETTI + NUBIRA + OPTRA (J200) [EUR]",
		"Code" : "J03",
		"Type" : null,
		"YearFrom" : "2003",
		"YearTo" : "2011",
		"ID" : 82,
		"ID_model" : 18,
		"Code" : "2010",
		"Type" : null,
		"Body" : null,
		"Class" : null,
		"Capasity" : null,
		"Fuell" : null,
		"Transmission" : null,
		"DataRange" : "2010"
	},
	{
		"ID" : 1,
		"Name" : "Chevrolet Europe",
		"ID" : 18,
		"ID_mark" : 1,
		"ID_region" : 2,
		"Name" : "LACETTI + NUBIRA + OPTRA (J200) [EUR]",
		"Code" : "J03",
		"Type" : null,
		"YearFrom" : "2003",
		"YearTo" : "2011",
		"ID" : 85,
		"ID_model" : 18,
		"Code" : "2011",
		"Type" : null,
		"Body" : null,
		"Class" : null,
		"Capasity" : null,
		"Fuell" : null,
		"Transmission" : null,
		"DataRange" : "2011"
	},
	{
		"ID" : 1,
		"Name" : "Chevrolet Europe",
		"ID" : 19,
		"ID_mark" : 1,
		"ID_region" : 3,
		"Name" : "Lacetti + Optra (J200) [GEN]",
		"Code" : "J03",
		"Type" : null,
		"YearFrom" : "2003",
		"YearTo" : "2011",
		"ID" : 116,
		"ID_model" : 19,
		"Code" : "2003",
		"Type" : null,
		"Body" : null,
		"Class" : null,
		"Capasity" : null,
		"Fuell" : null,
		"Transmission" : null,
		"DataRange" : "2003"
	},
	{
		"ID" : 1,
		"Name" : "Chevrolet Europe",
		"ID" : 19,
		"ID_mark" : 1,
		"ID_region" : 3,
		"Name" : "Lacetti + Optra (J200) [GEN]",
		"Code" : "J03",
		"Type" : null,
		"YearFrom" : "2003",
		"YearTo" : "2011",
		"ID" : 121,
		"ID_model" : 19,
		"Code" : "2004",
		"Type" : null,
		"Body" : null,
		"Class" : null,
		"Capasity" : null,
		"Fuell" : null,
		"Transmission" : null,
		"DataRange" : "2004"
	},
	{
		"ID" : 1,
		"Name" : "Chevrolet Europe",
		"ID" : 19,
		"ID_mark" : 1,
		"ID_region" : 3,
		"Name" : "Lacetti + Optra (J200) [GEN]",
		"Code" : "J03",
		"Type" : null,
		"YearFrom" : "2003",
		"YearTo" : "2011",
		"ID" : 127,
		"ID_model" : 19,
		"Code" : "2005",
		"Type" : null,
		"Body" : null,
		"Class" : null,
		"Capasity" : null,
		"Fuell" : null,
		"Transmission" : null,
		"DataRange" : "2005"
	},
	{
		"ID" : 1,
		"Name" : "Chevrolet Europe",
		"ID" : 19,
		"ID_mark" : 1,
		"ID_region" : 3,
		"Name" : "Lacetti + Optra (J200) [GEN]",
		"Code" : "J03",
		"Type" : null,
		"YearFrom" : "2003",
		"YearTo" : "2011",
		"ID" : 134,
		"ID_model" : 19,
		"Code" : "2006",
		"Type" : null,
		"Body" : null,
		"Class" : null,
		"Capasity" : null,
		"Fuell" : null,
		"Transmission" : null,
		"DataRange" : "2006"
	},
	{
		"ID" : 1,
		"Name" : "Chevrolet Europe",
		"ID" : 19,
		"ID_mark" : 1,
		"ID_region" : 3,
		"Name" : "Lacetti + Optra (J200) [GEN]",
		"Code" : "J03",
		"Type" : null,
		"YearFrom" : "2003",
		"YearTo" : "2011",
		"ID" : 141,
		"ID_model" : 19,
		"Code" : "2007",
		"Type" : null,
		"Body" : null,
		"Class" : null,
		"Capasity" : null,
		"Fuell" : null,
		"Transmission" : null,
		"DataRange" : "2007"
	},
	{
		"ID" : 1,
		"Name" : "Chevrolet Europe",
		"ID" : 19,
		"ID_mark" : 1,
		"ID_region" : 3,
		"Name" : "Lacetti + Optra (J200) [GEN]",
		"Code" : "J03",
		"Type" : null,
		"YearFrom" : "2003",
		"YearTo" : "2011",
		"ID" : 147,
		"ID_model" : 19,
		"Code" : "2008",
		"Type" : null,
		"Body" : null,
		"Class" : null,
		"Capasity" : null,
		"Fuell" : null,
		"Transmission" : null,
		"DataRange" : "2008"
	},
	{
		"ID" : 1,
		"Name" : "Chevrolet Europe",
		"ID" : 19,
		"ID_mark" : 1,
		"ID_region" : 3,
		"Name" : "Lacetti + Optra (J200) [GEN]",
		"Code" : "J03",
		"Type" : null,
		"YearFrom" : "2003",
		"YearTo" : "2011",
		"ID" : 151,
		"ID_model" : 19,
		"Code" : "2009",
		"Type" : null,
		"Body" : null,
		"Class" : null,
		"Capasity" : null,
		"Fuell" : null,
		"Transmission" : null,
		"DataRange" : "2009"
	},
	{
		"ID" : 1,
		"Name" : "Chevrolet Europe",
		"ID" : 19,
		"ID_mark" : 1,
		"ID_region" : 3,
		"Name" : "Lacetti + Optra (J200) [GEN]",
		"Code" : "J03",
		"Type" : null,
		"YearFrom" : "2003",
		"YearTo" : "2011",
		"ID" : 155,
		"ID_model" : 19,
		"Code" : "2010",
		"Type" : null,
		"Body" : null,
		"Class" : null,
		"Capasity" : null,
		"Fuell" : null,
		"Transmission" : null,
		"DataRange" : "2010"
	},
	{
		"ID" : 1,
		"Name" : "Chevrolet Europe",
		"ID" : 19,
		"ID_mark" : 1,
		"ID_region" : 3,
		"Name" : "Lacetti + Optra (J200) [GEN]",
		"Code" : "J03",
		"Type" : null,
		"YearFrom" : "2003",
		"YearTo" : "2011",
		"ID" : 159,
		"ID_model" : 19,
		"Code" : "2011",
		"Type" : null,
		"Body" : null,
		"Class" : null,
		"Capasity" : null,
		"Fuell" : null,
		"Transmission" : null,
		"DataRange" : "2011"
	},
	{
		"ID" : 1,
		"Name" : "Chevrolet Europe",
		"ID" : 20,
		"ID_mark" : 1,
		"ID_region" : 2,
		"Name" : "LEGANZA (V100) [EUR]",
		"Code" : "V97",
		"Type" : null,
		"YearFrom" : "1998",
		"YearTo" : "2002",
		"ID" : 19,
		"ID_model" : 20,
		"Code" : "1998",
		"Type" : null,
		"Body" : null,
		"Class" : null,
		"Capasity" : null,
		"Fuell" : null,
		"Transmission" : null,
		"DataRange" : "1998"
	},
	{
		"ID" : 1,
		"Name" : "Chevrolet Europe",
		"ID" : 20,
		"ID_mark" : 1,
		"ID_region" : 2,
		"Name" : "LEGANZA (V100) [EUR]",
		"Code" : "V97",
		"Type" : null,
		"YearFrom" : "1998",
		"YearTo" : "2002",
		"ID" : 24,
		"ID_model" : 20,
		"Code" : "1999",
		"Type" : null,
		"Body" : null,
		"Class" : null,
		"Capasity" : null,
		"Fuell" : null,
		"Transmission" : null,
		"DataRange" : "1999"
	},
	{
		"ID" : 1,
		"Name" : "Chevrolet Europe",
		"ID" : 20,
		"ID_mark" : 1,
		"ID_region" : 2,
		"Name" : "LEGANZA (V100) [EUR]",
		"Code" : "V97",
		"Type" : null,
		"YearFrom" : "1998",
		"YearTo" : "2002",
		"ID" : 28,
		"ID_model" : 20,
		"Code" : "2000",
		"Type" : null,
		"Body" : null,
		"Class" : null,
		"Capasity" : null,
		"Fuell" : null,
		"Transmission" : null,
		"DataRange" : "2000"
	},
	{
		"ID" : 1,
		"Name" : "Chevrolet Europe",
		"ID" : 20,
		"ID_mark" : 1,
		"ID_region" : 2,
		"Name" : "LEGANZA (V100) [EUR]",
		"Code" : "V97",
		"Type" : null,
		"YearFrom" : "1998",
		"YearTo" : "2002",
		"ID" : 33,
		"ID_model" : 20,
		"Code" : "2001",
		"Type" : null,
		"Body" : null,
		"Class" : null,
		"Capasity" : null,
		"Fuell" : null,
		"Transmission" : null,
		"DataRange" : "2001"
	},
	{
		"ID" : 1,
		"Name" : "Chevrolet Europe",
		"ID" : 20,
		"ID_mark" : 1,
		"ID_region" : 2,
		"Name" : "LEGANZA (V100) [EUR]",
		"Code" : "V97",
		"Type" : null,
		"YearFrom" : "1998",
		"YearTo" : "2002",
		"ID" : 38,
		"ID_model" : 20,
		"Code" : "2002",
		"Type" : null,
		"Body" : null,
		"Class" : null,
		"Capasity" : null,
		"Fuell" : null,
		"Transmission" : null,
		"DataRange" : "2002"
	},
	{
		"ID" : 1,
		"Name" : "Chevrolet Europe",
		"ID" : 21,
		"ID_mark" : 1,
		"ID_region" : 3,
		"Name" : "Epica (V200) [GEN]",
		"Code" : "V99",
		"Type" : null,
		"YearFrom" : "2003",
		"YearTo" : "2006",
		"ID" : 117,
		"ID_model" : 21,
		"Code" : "2003",
		"Type" : null,
		"Body" : null,
		"Class" : null,
		"Capasity" : null,
		"Fuell" : null,
		"Transmission" : null,
		"DataRange" : "2003"
	},
	{
		"ID" : 1,
		"Name" : "Chevrolet Europe",
		"ID" : 21,
		"ID_mark" : 1,
		"ID_region" : 3,
		"Name" : "Epica (V200) [GEN]",
		"Code" : "V99",
		"Type" : null,
		"YearFrom" : "2003",
		"YearTo" : "2006",
		"ID" : 122,
		"ID_model" : 21,
		"Code" : "2004",
		"Type" : null,
		"Body" : null,
		"Class" : null,
		"Capasity" : null,
		"Fuell" : null,
		"Transmission" : null,
		"DataRange" : "2004"
	},
	{
		"ID" : 1,
		"Name" : "Chevrolet Europe",
		"ID" : 21,
		"ID_mark" : 1,
		"ID_region" : 3,
		"Name" : "Epica (V200) [GEN]",
		"Code" : "V99",
		"Type" : null,
		"YearFrom" : "2003",
		"YearTo" : "2006",
		"ID" : 128,
		"ID_model" : 21,
		"Code" : "2005",
		"Type" : null,
		"Body" : null,
		"Class" : null,
		"Capasity" : null,
		"Fuell" : null,
		"Transmission" : null,
		"DataRange" : "2005"
	},
	{
		"ID" : 1,
		"Name" : "Chevrolet Europe",
		"ID" : 21,
		"ID_mark" : 1,
		"ID_region" : 3,
		"Name" : "Epica (V200) [GEN]",
		"Code" : "V99",
		"Type" : null,
		"YearFrom" : "2003",
		"YearTo" : "2006",
		"ID" : 135,
		"ID_model" : 21,
		"Code" : "2006",
		"Type" : null,
		"Body" : null,
		"Class" : null,
		"Capasity" : null,
		"Fuell" : null,
		"Transmission" : null,
		"DataRange" : "2006"
	},
	{
		"ID" : 1,
		"Name" : "Chevrolet Europe",
		"ID" : 22,
		"ID_mark" : 1,
		"ID_region" : 2,
		"Name" : "KALOS + AVEO (T200) [EUR]",
		"Code" : "T02",
		"Type" : null,
		"YearFrom" : "2003",
		"YearTo" : "2008",
		"ID" : 44,
		"ID_model" : 22,
		"Code" : "2003",
		"Type" : null,
		"Body" : null,
		"Class" : null,
		"Capasity" : null,
		"Fuell" : null,
		"Transmission" : null,
		"DataRange" : "2003"
	},
	{
		"ID" : 1,
		"Name" : "Chevrolet Europe",
		"ID" : 22,
		"ID_mark" : 1,
		"ID_region" : 2,
		"Name" : "KALOS + AVEO (T200) [EUR]",
		"Code" : "T02",
		"Type" : null,
		"YearFrom" : "2003",
		"YearTo" : "2008",
		"ID" : 49,
		"ID_model" : 22,
		"Code" : "2004",
		"Type" : null,
		"Body" : null,
		"Class" : null,
		"Capasity" : null,
		"Fuell" : null,
		"Transmission" : null,
		"DataRange" : "2004"
	},
	{
		"ID" : 1,
		"Name" : "Chevrolet Europe",
		"ID" : 22,
		"ID_mark" : 1,
		"ID_region" : 2,
		"Name" : "KALOS + AVEO (T200) [EUR]",
		"Code" : "T02",
		"Type" : null,
		"YearFrom" : "2003",
		"YearTo" : "2008",
		"ID" : 55,
		"ID_model" : 22,
		"Code" : "2005",
		"Type" : null,
		"Body" : null,
		"Class" : null,
		"Capasity" : null,
		"Fuell" : null,
		"Transmission" : null,
		"DataRange" : "2005"
	},
	{
		"ID" : 1,
		"Name" : "Chevrolet Europe",
		"ID" : 22,
		"ID_mark" : 1,
		"ID_region" : 2,
		"Name" : "KALOS + AVEO (T200) [EUR]",
		"Code" : "T02",
		"Type" : null,
		"YearFrom" : "2003",
		"YearTo" : "2008",
		"ID" : 61,
		"ID_model" : 22,
		"Code" : "2006",
		"Type" : null,
		"Body" : null,
		"Class" : null,
		"Capasity" : null,
		"Fuell" : null,
		"Transmission" : null,
		"DataRange" : "2006"
	},
	{
		"ID" : 1,
		"Name" : "Chevrolet Europe",
		"ID" : 22,
		"ID_mark" : 1,
		"ID_region" : 2,
		"Name" : "KALOS + AVEO (T200) [EUR]",
		"Code" : "T02",
		"Type" : null,
		"YearFrom" : "2003",
		"YearTo" : "2008",
		"ID" : 67,
		"ID_model" : 22,
		"Code" : "2007",
		"Type" : null,
		"Body" : null,
		"Class" : null,
		"Capasity" : null,
		"Fuell" : null,
		"Transmission" : null,
		"DataRange" : "2007"
	},
	{
		"ID" : 1,
		"Name" : "Chevrolet Europe",
		"ID" : 22,
		"ID_mark" : 1,
		"ID_region" : 2,
		"Name" : "KALOS + AVEO (T200) [EUR]",
		"Code" : "T02",
		"Type" : null,
		"YearFrom" : "2003",
		"YearTo" : "2008",
		"ID" : 73,
		"ID_model" : 22,
		"Code" : "2008",
		"Type" : null,
		"Body" : null,
		"Class" : null,
		"Capasity" : null,
		"Fuell" : null,
		"Transmission" : null,
		"DataRange" : "2008"
	},
	{
		"ID" : 1,
		"Name" : "Chevrolet Europe",
		"ID" : 23,
		"ID_mark" : 1,
		"ID_region" : 3,
		"Name" : "Lanos (T100) [GEN]",
		"Code" : "T97",
		"Type" : null,
		"YearFrom" : "1997",
		"YearTo" : "2002",
		"ID" : 87,
		"ID_model" : 23,
		"Code" : "1997",
		"Type" : null,
		"Body" : null,
		"Class" : null,
		"Capasity" : null,
		"Fuell" : null,
		"Transmission" : null,
		"DataRange" : "1997"
	},
	{
		"ID" : 1,
		"Name" : "Chevrolet Europe",
		"ID" : 23,
		"ID_mark" : 1,
		"ID_region" : 3,
		"Name" : "Lanos (T100) [GEN]",
		"Code" : "T97",
		"Type" : null,
		"YearFrom" : "1997",
		"YearTo" : "2002",
		"ID" : 91,
		"ID_model" : 23,
		"Code" : "1998",
		"Type" : null,
		"Body" : null,
		"Class" : null,
		"Capasity" : null,
		"Fuell" : null,
		"Transmission" : null,
		"DataRange" : "1998"
	},
	{
		"ID" : 1,
		"Name" : "Chevrolet Europe",
		"ID" : 23,
		"ID_mark" : 1,
		"ID_region" : 3,
		"Name" : "Lanos (T100) [GEN]",
		"Code" : "T97",
		"Type" : null,
		"YearFrom" : "1997",
		"YearTo" : "2002",
		"ID" : 96,
		"ID_model" : 23,
		"Code" : "1999",
		"Type" : null,
		"Body" : null,
		"Class" : null,
		"Capasity" : null,
		"Fuell" : null,
		"Transmission" : null,
		"DataRange" : "1999"
	},
	{
		"ID" : 1,
		"Name" : "Chevrolet Europe",
		"ID" : 23,
		"ID_mark" : 1,
		"ID_region" : 3,
		"Name" : "Lanos (T100) [GEN]",
		"Code" : "T97",
		"Type" : null,
		"YearFrom" : "1997",
		"YearTo" : "2002",
		"ID" : 101,
		"ID_model" : 23,
		"Code" : "2000",
		"Type" : null,
		"Body" : null,
		"Class" : null,
		"Capasity" : null,
		"Fuell" : null,
		"Transmission" : null,
		"DataRange" : "2000"
	},
	{
		"ID" : 1,
		"Name" : "Chevrolet Europe",
		"ID" : 23,
		"ID_mark" : 1,
		"ID_region" : 3,
		"Name" : "Lanos (T100) [GEN]",
		"Code" : "T97",
		"Type" : null,
		"YearFrom" : "1997",
		"YearTo" : "2002",
		"ID" : 106,
		"ID_model" : 23,
		"Code" : "2001",
		"Type" : null,
		"Body" : null,
		"Class" : null,
		"Capasity" : null,
		"Fuell" : null,
		"Transmission" : null,
		"DataRange" : "2001"
	},
	{
		"ID" : 1,
		"Name" : "Chevrolet Europe",
		"ID" : 23,
		"ID_mark" : 1,
		"ID_region" : 3,
		"Name" : "Lanos (T100) [GEN]",
		"Code" : "T97",
		"Type" : null,
		"YearFrom" : "1997",
		"YearTo" : "2002",
		"ID" : 111,
		"ID_model" : 23,
		"Code" : "2002",
		"Type" : null,
		"Body" : null,
		"Class" : null,
		"Capasity" : null,
		"Fuell" : null,
		"Transmission" : null,
		"DataRange" : "2002"
	},
	{
		"ID" : 1,
		"Name" : "Chevrolet Europe",
		"ID" : 24,
		"ID_mark" : 1,
		"ID_region" : 2,
		"Name" : "TACUMA + REZZO (U100) [EUR]",
		"Code" : "U00",
		"Type" : null,
		"YearFrom" : "2000",
		"YearTo" : "2008",
		"ID" : 29,
		"ID_model" : 24,
		"Code" : "2000",
		"Type" : null,
		"Body" : null,
		"Class" : null,
		"Capasity" : null,
		"Fuell" : null,
		"Transmission" : null,
		"DataRange" : "2000"
	},
	{
		"ID" : 1,
		"Name" : "Chevrolet Europe",
		"ID" : 24,
		"ID_mark" : 1,
		"ID_region" : 2,
		"Name" : "TACUMA + REZZO (U100) [EUR]",
		"Code" : "U00",
		"Type" : null,
		"YearFrom" : "2000",
		"YearTo" : "2008",
		"ID" : 34,
		"ID_model" : 24,
		"Code" : "2001",
		"Type" : null,
		"Body" : null,
		"Class" : null,
		"Capasity" : null,
		"Fuell" : null,
		"Transmission" : null,
		"DataRange" : "2001"
	},
	{
		"ID" : 1,
		"Name" : "Chevrolet Europe",
		"ID" : 24,
		"ID_mark" : 1,
		"ID_region" : 2,
		"Name" : "TACUMA + REZZO (U100) [EUR]",
		"Code" : "U00",
		"Type" : null,
		"YearFrom" : "2000",
		"YearTo" : "2008",
		"ID" : 39,
		"ID_model" : 24,
		"Code" : "2002",
		"Type" : null,
		"Body" : null,
		"Class" : null,
		"Capasity" : null,
		"Fuell" : null,
		"Transmission" : null,
		"DataRange" : "2002"
	},
	{
		"ID" : 1,
		"Name" : "Chevrolet Europe",
		"ID" : 24,
		"ID_mark" : 1,
		"ID_region" : 2,
		"Name" : "TACUMA + REZZO (U100) [EUR]",
		"Code" : "U00",
		"Type" : null,
		"YearFrom" : "2000",
		"YearTo" : "2008",
		"ID" : 45,
		"ID_model" : 24,
		"Code" : "2003",
		"Type" : null,
		"Body" : null,
		"Class" : null,
		"Capasity" : null,
		"Fuell" : null,
		"Transmission" : null,
		"DataRange" : "2003"
	},
	{
		"ID" : 1,
		"Name" : "Chevrolet Europe",
		"ID" : 24,
		"ID_mark" : 1,
		"ID_region" : 2,
		"Name" : "TACUMA + REZZO (U100) [EUR]",
		"Code" : "U00",
		"Type" : null,
		"YearFrom" : "2000",
		"YearTo" : "2008",
		"ID" : 50,
		"ID_model" : 24,
		"Code" : "2004",
		"Type" : null,
		"Body" : null,
		"Class" : null,
		"Capasity" : null,
		"Fuell" : null,
		"Transmission" : null,
		"DataRange" : "2004"
	},
	{
		"ID" : 1,
		"Name" : "Chevrolet Europe",
		"ID" : 24,
		"ID_mark" : 1,
		"ID_region" : 2,
		"Name" : "TACUMA + REZZO (U100) [EUR]",
		"Code" : "U00",
		"Type" : null,
		"YearFrom" : "2000",
		"YearTo" : "2008",
		"ID" : 56,
		"ID_model" : 24,
		"Code" : "2005",
		"Type" : null,
		"Body" : null,
		"Class" : null,
		"Capasity" : null,
		"Fuell" : null,
		"Transmission" : null,
		"DataRange" : "2005"
	},
	{
		"ID" : 1,
		"Name" : "Chevrolet Europe",
		"ID" : 24,
		"ID_mark" : 1,
		"ID_region" : 2,
		"Name" : "TACUMA + REZZO (U100) [EUR]",
		"Code" : "U00",
		"Type" : null,
		"YearFrom" : "2000",
		"YearTo" : "2008",
		"ID" : 62,
		"ID_model" : 24,
		"Code" : "2006",
		"Type" : null,
		"Body" : null,
		"Class" : null,
		"Capasity" : null,
		"Fuell" : null,
		"Transmission" : null,
		"DataRange" : "2006"
	},
	{
		"ID" : 1,
		"Name" : "Chevrolet Europe",
		"ID" : 24,
		"ID_mark" : 1,
		"ID_region" : 2,
		"Name" : "TACUMA + REZZO (U100) [EUR]",
		"Code" : "U00",
		"Type" : null,
		"YearFrom" : "2000",
		"YearTo" : "2008",
		"ID" : 68,
		"ID_model" : 24,
		"Code" : "2007",
		"Type" : null,
		"Body" : null,
		"Class" : null,
		"Capasity" : null,
		"Fuell" : null,
		"Transmission" : null,
		"DataRange" : "2007"
	},
	{
		"ID" : 1,
		"Name" : "Chevrolet Europe",
		"ID" : 24,
		"ID_mark" : 1,
		"ID_region" : 2,
		"Name" : "TACUMA + REZZO (U100) [EUR]",
		"Code" : "U00",
		"Type" : null,
		"YearFrom" : "2000",
		"YearTo" : "2008",
		"ID" : 74,
		"ID_model" : 24,
		"Code" : "2008",
		"Type" : null,
		"Body" : null,
		"Class" : null,
		"Capasity" : null,
		"Fuell" : null,
		"Transmission" : null,
		"DataRange" : "2008"
	}
]}
