<?xml version="1.0" encoding="utf-8"?>
<!-- Generator: Adobe Illustrator 19.2.1, SVG Export Plug-In . SVG Version: 6.00 Build 0)  -->
<svg version="1.1" id="Слой_1" xmlns="http://www.w3.org/2000/svg" xmlns:xlink="http://www.w3.org/1999/xlink" x="0px" y="0px"
	 viewBox="0 0 453.5 198.4" style="enable-background:new 0 0 453.5 198.4;" xml:space="preserve">
<style type="text/css">
	.st0{fill:#010202;}
</style>
<path d="M48.1,44.6c-5.2,1.5-8,2.3-8.4,2.5c0.4,0.1,3.2,0.9,8.4,2.5c-1.4,5.6-4,10.4-7.8,14.2c-4.5,4.6-10.1,6.9-16.7,6.9
	c-6.5,0-12.1-2.3-16.7-6.9S0,53.6,0,47.1S2.3,35,6.9,30.4s10.2-6.9,16.7-6.9c6.6,0,12.2,2.3,16.7,6.9C43.8,33.9,46.4,38.7,48.1,44.6
	z M28.5,50.2c-0.2,0.3-0.4,0.5-0.5,0.6c-1.1,1.1-2.5,1.7-4.1,1.7s-3-0.6-4.1-1.7c-1.2-1.1-1.7-2.5-1.7-4.1s0.6-3,1.7-4.1
	c1.1-1.1,2.5-1.7,4.1-1.7s2.9,0.6,4.1,1.7c0.3,0.3,0.6,0.8,0.9,1.3l11-3.2c-0.9-2.2-2.2-4.1-3.9-5.9c-3.4-3.4-7.6-5.1-12.4-5.1
	s-8.9,1.7-12.4,5.1c-3.4,3.4-5.1,7.5-5.1,12.3s1.7,9,5.1,12.4s7.5,5.1,12.4,5.1c4.8,0,9-1.7,12.4-5.1c1.7-1.8,3-3.7,3.9-5.9
	L28.5,50.2z"/>
<path d="M103,70.3H76.3c-0.3-1.1-0.6-2.2-0.8-3.1c-0.2,0.9-0.5,2-0.7,3.1H47.9L64.4,24h22.4L103,70.3z M81.2,64h13L82.4,30.2H68.9
	L56.8,64h13l1-4.2H80L81.2,64z M75.5,43.6l2.6,8.1h-5.2L75.5,43.6z"/>
<path d="M139.6,52.3c1.7,2.7,5.7,8.7,11.8,18h-49.3V24h21.5c6,0,10.7,1.5,14.2,4.4c3.8,3.2,5.7,7.6,5.7,13.3c0,3.8-1,7-3,9.7
	C140.5,51.3,140.2,51.7,139.6,52.3z M126.2,64h13.6l-9-13.8c2-0.2,3.6-1.1,4.7-2.7c1.2-1.5,1.7-3.5,1.7-5.9c0-3.7-1.2-6.5-3.5-8.5
	c-2.3-1.9-5.7-2.9-10.2-2.9h-15.3V64h12.1V52.9L126.2,64z M121.8,38.9c0.9,0,1.6,0.2,2.1,0.7s0.7,1.1,0.7,2c0,0.8-0.2,1.5-0.7,1.9
	c-0.5,0.5-1.2,0.7-2.1,0.7h-1.5v-5.3C120.3,38.9,121.8,38.9,121.8,38.9z"/>
<path class="st0" d="M202.2,44.6c-5.2,1.5-8,2.3-8.4,2.5c0.4,0.1,3.2,0.9,8.4,2.5c-1.4,5.6-4,10.4-7.8,14.2
	c-4.5,4.6-10.1,6.9-16.7,6.9c-6.5,0-12.1-2.3-16.7-6.9c-4.6-4.6-6.9-10.2-6.9-16.7s2.3-12.1,6.9-16.7c4.6-4.6,10.2-6.9,16.7-6.9
	c6.6,0,12.2,2.3,16.7,6.9C197.9,33.9,200.5,38.7,202.2,44.6z M182.6,50.2c-0.2,0.3-0.4,0.5-0.5,0.6c-1.1,1.1-2.5,1.7-4.1,1.7
	s-3-0.6-4.1-1.7c-1.2-1.1-1.7-2.5-1.7-4.1s0.6-3,1.7-4.1c1.1-1.1,2.5-1.7,4.1-1.7s2.9,0.6,4.1,1.7c0.3,0.3,0.6,0.8,0.9,1.3l11-3.2
	c-0.9-2.2-2.2-4.1-3.9-5.9c-3.4-3.4-7.6-5.1-12.4-5.1c-4.8,0-8.9,1.7-12.4,5.1c-3.4,3.4-5.1,7.5-5.1,12.3s1.7,9,5.1,12.4
	c3.4,3.4,7.5,5.1,12.4,5.1c4.8,0,9-1.7,12.4-5.1c1.7-1.8,3-3.7,3.9-5.9L182.6,50.2z"/>
<path class="st0" d="M211,24h37.1v46.3h-37.1L211,24L211,24z M241.8,30.3h-24.5V64h24.5v-9.1h-12.6v-3.6h12.6v-8.7h-12.6v-3.3h12.6
	V30.3z"/>
<path class="st0" d="M257.7,24H304v46.3h-46.3V24z M297.7,30.3H286v16.6l-10.1-16.6H264V64h11.7V47.6l10,16.4h12V30.3z"/>
<path class="st0" d="M353.3,24v23.6h-8.7v22.7h-24.7V47.6h-8.7V24H353.3z M347,30.3h-29.5v11h8.7V64h12.1V41.3h8.7L347,30.3
	L347,30.3z"/>
<path class="st0" d="M396.4,52.3c1.7,2.6,5.7,8.6,11.8,17.9h-49.3V24h21.5c6,0,10.7,1.5,14.2,4.4c3.8,3.2,5.7,7.6,5.7,13.3
	c0,3.8-1,7-3,9.7C397.4,51.3,397.1,51.7,396.4,52.3z M383,64h13.6l-9-13.8c2-0.2,3.6-1.1,4.7-2.7c1.2-1.5,1.7-3.5,1.7-5.9
	c0-3.7-1.2-6.5-3.5-8.5c-2.3-1.9-5.7-2.9-10.2-2.9H365V64h11.9V52.9L383,64z M378.7,38.9c0.9,0,1.6,0.2,2.1,0.7s0.7,1.1,0.7,2
	c0,0.8-0.2,1.5-0.7,1.9c-0.5,0.5-1.2,0.7-2.1,0.7h-1.5v-5.3C377.2,38.9,378.7,38.9,378.7,38.9z"/>
<path class="st0" d="M416.4,24h37.1v46.3h-37.1V24z M447.2,30.3h-24.5V64h24.5v-9.1h-12.6v-3.6h12.6v-8.7h-12.6v-3.3h12.6V30.3z"/>
<g>
	<path class="st0" d="M452.1,85.8c-0.1,0.5-0.5,0.8-1,1c-5.6,3.1-11.5,5.7-19.1,6.7H290.6c-27.5,3.1-46.3,14.9-61.4,30.5
		c5.1,6.6,9.6,13.8,13.4,21.6c2.7-9.7,7.4-17.4,12.9-24.3c9.8-9.8,22.8-16.3,40.8-18h134.6c0-0.1,0-0.1,0-0.1c0.7,0,1.4-0.1,2.1-0.3
		c0.2,0,0.3,0,0.4,0c8.2-3.5,15.8-7.5,19.1-16C453.5,86.6,452.7,86,452.1,85.8z"/>
	<path class="st0" d="M444.4,103.8c-3.6,0.9-6.7,2.3-10.3,3.1c-36.7,2-79,1.1-116.6,0.5c0.1,3,0.1,6-1,7.8h112
		c1.9-0.9,4.2-1.4,6.2-2.1c3.9-2.5,9.4-6.1,10.7-9.9C444.9,103.4,444.5,103.4,444.4,103.8z"/>
	<path class="st0" d="M313.8,119.3c-0.4,1,1.1,4.4,0.5,7.2h87.8c3.4-0.8,7.4-0.9,10.3-2.1c2.2-0.9,7.4-3.8,5.7-5.1H313.8z"/>
	<path class="st0" d="M307.1,132.8c1.4,1.1,2.4,2.7,3.1,4.6h71.3c5.8-1.1,11.9-1.9,13.9-6.7h-83.1
		C311.4,132.1,308.6,131.9,307.1,132.8z"/>
	<path class="st0" d="M300.9,147.2c3.6,2.6,8.6,1.5,13.4,1.5h46.4c5.2-1.5,10.7-2.7,12.9-7.2h-63
		C308.8,144.7,305.1,146.2,300.9,147.2z"/>
	<path class="st0" d="M307,112.8c3-0.4,8.3,1.4,8.2-2.1c-3.5-1.5-17.6-5-18,1.5C301.1,111.8,303.4,113,307,112.8z"/>
	<path class="st0" d="M294.8,120.8c5.9,1.2,11.4,2.7,17,4.2c0.2-8-10.8-4.6-16-7.2C295.3,118.7,294.9,119.6,294.8,120.8z"/>
	<path class="st0" d="M291.2,132.8c4.5,2.8,9.8,5,15,7.2c1.4-7.5-9.9-6.4-14.4-9.8C291.8,131.3,290.7,131.2,291.2,132.8z"/>
	<path class="st0" d="M286,141.5c0.1,1.3-0.9,1.6-1,2.6c5,2.5,8.5,6.6,13.9,8.7C299.7,146,290.4,144.8,286,141.5z"/>
	<path class="st0" d="M282.8,111c3.9-0.2,10.5,2.3,11.9-1.5C291.2,109.4,284.2,107.5,282.8,111z"/>
	<path class="st0" d="M278.7,152.3c0,1-1.4,0.7-1,2.1c3.7,3.4,7.9,9,11.9,10.3C288.8,157.8,282.8,156,278.7,152.3z"/>
	<path class="st0" d="M267.4,161.6c2.8,5.2,6.4,9.7,10.3,13.9c3-6.7-5.1-10.5-7.8-15C270,161.7,268.6,161.6,267.4,161.6z"/>
	<path class="st0" d="M270.5,116.1c0.1,0.4,0.4,0.5,1,0.5c3.3,1.2,6.8,2.2,10.3,3.1c2.5,0.4,8.5,4.3,10.3,0.5
		C285.7,118.8,276,115.2,270.5,116.1z"/>
	<path class="st0" d="M258.1,128.6c4.5,2.3,7.8,5.7,11.9,8.2c3.6,1.4,8.2,9.4,12.4,5.1c-6.4-4.9-15.8-11.4-24.8-15.5
		C257.6,127.4,257.7,128.2,258.1,128.6z"/>
	<path class="st0" d="M256.5,168.3c2.1,5.5,3.9,11.1,7.2,15.5c3.9-5.4-2.6-12.1-5.1-16C258.6,168.6,257.4,168.3,256.5,168.3z"/>
	<path class="st0" d="M262.7,121.8c6.2,3,16.9,11.1,25.2,10.3c-7-4.8-16.3-7.5-24.8-10.8C263.3,120.8,262.6,121,262.7,121.8z"/>
	<path class="st0" d="M254.5,134.3c3.5,2.7,6.4,6.4,9.8,9.8c3,3,6.3,8,11.4,7.2c-7.4-6.2-13.4-13.8-21.6-19.1
		C253.9,133.1,254.1,133.7,254.5,134.3z"/>
	<path class="st0" d="M247.8,147.2c0.3,7,3.7,15.2,9.8,18C254.8,158.7,251.5,152.8,247.8,147.2z"/>
	<path class="st0" d="M250.4,138.3c-0.2,0.8-0.7,0.9,0,1.5c5.8,6,8,15.8,16.5,19.1c-4.8-7.2-10.2-14-15.5-20.7
		C251.3,137.8,250.8,138.1,250.4,138.3z"/>
	<path class="st0" d="M244.2,173c1.6,5.4,2.3,11.8,4.7,16.5c4.6-3.9-1-10.9-1.5-16C245.7,173.9,245.4,173,244.2,173z"/>
	<path class="st0" d="M246.2,170.4c-0.5-4.2-2.1-11.6-5.1-15c-0.5,0-0.7-0.4-1-0.5C242.1,160.1,241.1,168.3,246.2,170.4z"/>
	<path class="st0" d="M159,92.4c-44.2,0-87.5,0.9-132.1,0.5C17,91.8,8.2,89.7,1.1,85.8c-0.3,0-0.7,0.1-0.5,0.5
		c3.3,5.2,7.9,9.3,13.4,12.4c0.1,0,0.2,0,0.2,0c0.4,0.2,0.9,0.3,1.3,0.4l0,0c2.7,0.9,6,1.2,8.7,2.1h129.5c26.3,2.4,42.5,15,51,35.1
		c1.4,4.2,3.1,8,3.6,12.9h29.4C223.4,118.5,199.1,97.6,159,92.4z"/>
	<path class="st0" d="M236,172.4c-0.8-4.4-0.5-14.2-4.2-17.6C232.1,159.8,230.6,170.8,236,172.4z"/>
	<path class="st0" d="M232.4,174.5c0.7,5.9-1,14.1,2.1,17.6c3.3-3.6,0.8-11.6,0.5-16.5C233.2,175.9,233.3,174.7,232.4,174.5z"/>
	<path class="st0" d="M224.6,155.4h-1.5c0.1,5.2-3,14.8,1,17.5C225.3,168.2,224.3,161.1,224.6,155.4z"/>
	<path class="st0" d="M219.9,174c-0.7,5.9-1.5,11.6-1.5,18c5-1.5,2.6-10.4,4.2-15.5C222,175.4,220.4,175.2,219.9,174z"/>
	<path class="st0" d="M212.7,171.9c1.6-4.9,2.3-10.7,3.1-16.5h-2.1C213.8,160.6,208.2,168.8,212.7,171.9z"/>
	<path class="st0" d="M207,170.9c-0.7,6-5.2,13.7-4.2,18c4.6-0.4,6.1-13.1,5.1-17.6C208,171,207.7,170.8,207,170.9z"/>
	<path class="st0" d="M204.9,155.4c-0.7,4.2-7.5,10.7-2.6,13.9c1.1-5.1,3.5-8.9,4.7-13.9H204.9z"/>
	<path class="st0" d="M191.6,164.7c3.1-7,9.3-13.3,10.3-20.7c-0.1-0.4-0.4-0.7-1-0.5c-1.7,3.8-4,7-6.2,10.3
		C193.7,157.3,188,161.4,191.6,164.7z"/>
	<path class="st0" d="M197.7,136.4c-4.8,7.4-12.8,11.6-16,20.7c6.2-4.2,12-13.1,17-20.1C198.7,136.5,198.4,136.3,197.7,136.4z"/>
	<path class="st0" d="M196.7,166.2c-3.7,5.2-6.1,11.8-9.3,17.6c7.4-1.7,8.3-9.9,10.4-17C197.6,166.3,197.3,166.2,196.7,166.2z"/>
	<path class="st0" d="M173.4,149.3c4.3-0.4,7.8-6,11.4-8.7c3.7-3.4,8.2-5.9,10.8-10.3h-2.1C187.7,137.1,178,140.6,173.4,149.3z"/>
	<path class="st0" d="M174,176c6.6-0.1,10.1-10.2,12.4-14.4C180.4,164.2,176.4,171.6,174,176z"/>
	<path class="st0" d="M190.1,124.5c-3.5,3-8.4,4.7-11.9,7.8c-3.7,2.5-10.8,3.8-10.8,8.3c8.2-5,17.3-9.2,24.3-15.5
		C190.9,124.9,190.8,124.3,190.1,124.5z"/>
	<path class="st0" d="M177.1,154.8c-7.8-0.8-10.1,7.7-15.5,10.8C168.6,167.8,172.4,158.4,177.1,154.8z"/>
	<path class="st0" d="M179.1,114.6c-4.9-0.3-18.3-0.4-20.7,5.1C165.5,118.2,173.4,117.6,179.1,114.6z"/>
	<path class="st0" d="M183.8,120.3c-0.1,0.4-0.4,0.5-1,0.5c-3.4,1.4-6.9,2.7-10.8,3.6c-2.5,2.5-9.2,0.8-9.3,5.7
		c6.7-1.4,14.4-6.2,22.2-8.3C184.9,121,184.5,120.5,183.8,120.3z"/>
	<path class="st0" d="M173.1,110.2c-1.6-3.5-10.1-1.7-14.4-1.5C160.3,112.5,168.3,110.1,173.1,110.2z"/>
	<path class="st0" d="M151.3,153.9c7.2,2.8,11-5.4,16-8.2C161.8,144.3,156,150.9,151.3,153.9z"/>
	<path class="st0" d="M144,139.4c4.9,5.2,12.7-2.6,17-4.7C155.2,132.4,150.2,138.7,144,139.4z"/>
	<path class="st0" d="M146.7,108.5c-3.6-0.2-6,0.9-9.8,0.5c0.4,6.7,14.5,3.1,18,1.5C155,107.1,149.6,108.9,146.7,108.5z"/>
	<path class="st0" d="M139.5,125.4c5,3.9,11.8-1.3,17.6-1.5C154.2,118.8,143.8,124.1,139.5,125.4z"/>
	<path class="st0" d="M143.1,144c-2.1-0.5-1.7-3.4-4.2-3.6c-20.4,0.3-42.3-0.7-62,0.5c4.7,3,9.8,5.4,16,6.7h49.6
		c1.9-0.5,6.2,1.4,5.7-1.5C148.6,145.2,144.4,144.8,143.1,144z"/>
	<path class="st0" d="M142.5,131.7c-4.7-4-12-3.1-19.1-3.1H55.3c-0.3,0-0.7,0.1-0.5,0.5c4.4,3.1,9.3,5.5,15.5,6.7h57.3
		C133.3,135.8,140.5,137.3,142.5,131.7z"/>
	<path class="st0" d="M133.2,106.4c-37.8-0.1-78.4,2-115.1-0.5c-3.6-1.2-8.4-3.9-10.8-4.7c5.7,6.9,13.7,11.5,24.8,12.9h102.2
		C134.1,111.4,133,109.6,133.2,106.4z"/>
	<path class="st0" d="M136.4,117.8H34.2c0,0.9,0.4,1.3,1,1.5c4.5,3.1,10.5,4.7,17,5.7h82.5C134.3,121.6,135.7,120.1,136.4,117.8z"/>
</g>
</svg>
