<svg width="150" height="75" viewBox="0 0 59 15" fill="none" xmlns="http://www.w3.org/2000/svg">
<path fill-rule="evenodd" clip-rule="evenodd" d="M9.59 4.77002H10.54V8.37C10.54 8.66 10.56 8.93994 10.59 9.18994C10.61 9.32994 10.63 9.44003 10.65 9.53003L10.69 9.67004L10.75 9.81995C10.85 10.0999 11.02 10.33 11.25 10.52H8.89001C9.12001 10.33 9.29001 10.0999 9.39001 9.81995L9.44 9.67004L9.48001 9.53003C9.50001 9.45003 9.52001 9.33994 9.54001 9.18994C9.57001 8.92994 9.59 8.66 9.59 8.37V6.71997L7.63 10.11L5.66 6.71997V8.37C5.66 8.66 5.67999 8.93994 5.70999 9.18994C5.72999 9.32994 5.74999 9.44003 5.76999 9.53003L5.81 9.67004L5.85999 9.81995C5.95999 10.0999 6.12999 10.33 6.35999 10.52H4C4.23 10.33 4.39 10.0999 4.5 9.81995L4.54999 9.67004L4.59 9.53003C4.61 9.45003 4.62999 9.33994 4.64999 9.18994C4.67999 8.92994 4.70001 8.66 4.70001 8.37V4.77002H5.64999L7.62 8.15002L9.59 4.77002Z" fill="white"/>
<path fill-rule="evenodd" clip-rule="evenodd" d="M7.62 0.410034L7.82001 1.02002H8.47L7.95001 1.40002L8.14001 2.01001L7.62 1.64001L7.10001 2.01001L7.29999 1.40002L6.76999 1.02002H7.42001" fill="white"/>
<path fill-rule="evenodd" clip-rule="evenodd" d="M7.62 14.88L7.42001 14.28L6.76999 14.27L7.29999 13.89L7.10001 13.28L7.62 13.65L8.14001 13.28L7.95001 13.89L8.47 14.27L7.82001 14.28" fill="white"/>
<path fill-rule="evenodd" clip-rule="evenodd" d="M11.24 13.92L10.76 13.49L10.2 13.8101L10.46 13.22L9.98001 12.78L10.63 12.85L10.89 12.26L11.03 12.89L11.67 12.96L11.11 13.29" fill="white"/>
<path fill-rule="evenodd" clip-rule="evenodd" d="M13.89 11.27L13.26 11.13L12.94 11.6899L12.87 11.05L12.24 10.91L12.82 10.65L12.76 10.01L13.19 10.48L13.78 10.22L13.46 10.78" fill="white"/>
<path fill-rule="evenodd" clip-rule="evenodd" d="M14.86 7.65002L14.25 7.84998V8.48999L13.87 7.96997L13.25 8.17004L13.63 7.65002L13.25 7.12L13.87 7.31995L14.25 6.80005V7.43994" fill="white"/>
<path fill-rule="evenodd" clip-rule="evenodd" d="M13.89 4.03003L13.46 4.51001L13.78 5.06995L13.19 4.81006L12.76 5.28003L12.82 4.64001L12.24 4.38L12.87 4.23999L12.94 3.59998L13.26 4.16003" fill="white"/>
<path fill-rule="evenodd" clip-rule="evenodd" d="M11.24 1.37L11.11 2.01001L11.67 2.32996L11.03 2.40002L10.89 3.03003L10.63 2.43994L9.98001 2.51001L10.46 2.06995L10.2 1.47998L10.76 1.80005" fill="white"/>
<path fill-rule="evenodd" clip-rule="evenodd" d="M4 1.38L4.48001 1.80005L5.04001 1.47998L4.78 2.06995L5.26001 2.51001L4.62 2.43994L4.35001 3.03003L4.22 2.40002L3.57999 2.32996L4.13 2.01001" fill="white"/>
<path fill-rule="evenodd" clip-rule="evenodd" d="M1.35001 4.03003L1.98001 4.16003L2.31 3.59998L2.38 4.23999L3.01001 4.38L2.42001 4.64001L2.48001 5.28003L2.04999 4.81006L1.45999 5.06995L1.78 4.51001" fill="white"/>
<path fill-rule="evenodd" clip-rule="evenodd" d="M0.380005 7.65002L0.98999 7.43994V6.80005L1.38 7.31995L1.98999 7.12L1.62 7.65002L1.98999 8.17004L1.38 7.96997L0.98999 8.48999V7.84998" fill="white"/>
<path fill-rule="evenodd" clip-rule="evenodd" d="M1.35001 11.27L1.78 10.78L1.45999 10.22L2.04999 10.48L2.48001 10.01L2.42001 10.65L3.01001 10.91L2.38 11.05L2.31 11.6899L1.98001 11.13" fill="white"/>
<path fill-rule="evenodd" clip-rule="evenodd" d="M4 13.92L4.13 13.29L3.57999 12.96L4.22 12.89L4.35001 12.26L4.62 12.85L5.26001 12.78L4.78 13.22L5.04001 13.8101L4.48001 13.49" fill="white"/>
<path d="M17.76 10.52V4.77002H19.54L20.61 8.68994L21.66 4.77002H23.45V10.52H22.34V6L21.17 10.52H20.03L18.86 6V10.52" fill="white"/>
<path d="M29.95 10.52H28.66L28.14 9.21997H25.78L25.29 10.52H24.03L26.33 4.78003H27.59M27.76 8.23999L26.95 6.10999L26.15 8.23999H27.76Z" fill="white"/>
<path d="M30.61 10.52V4.77002H31.8V9.54004H34.76V10.52" fill="white"/>
<path d="M35.64 10.52V4.77002H36.83V9.54004H39.79V10.52" fill="white"/>
<path d="M40.4 7.68005C40.4 7.11005 40.49 6.64 40.67 6.25C40.8 5.97 40.98 5.70999 41.22 5.48999C41.45 5.25999 41.71 5.09999 41.98 4.98999C42.35 4.83999 42.77 4.77002 43.25 4.77002C44.12 4.77002 44.81 5.02003 45.33 5.53003C45.85 6.04003 46.11 6.74002 46.11 7.65002C46.11 8.55002 45.85 9.25 45.33 9.75C44.81 10.26 44.12 10.51 43.26 10.51C42.38 10.51 41.69 10.26 41.17 9.75C40.65 9.26 40.4 8.56005 40.4 7.68005ZM41.62 7.64001C41.62 8.27001 41.77 8.73995 42.08 9.06995C42.39 9.39995 42.78 9.56006 43.25 9.56006C43.72 9.56006 44.11 9.39996 44.42 9.07996C44.72 8.75996 44.88 8.28 44.88 7.63C44.88 6.99001 44.73 6.51996 44.43 6.20996C44.13 5.89996 43.74 5.73999 43.25 5.73999C42.76 5.73999 42.36 5.89996 42.06 6.20996C41.77 6.51996 41.62 7.00001 41.62 7.64001Z" fill="white"/>
<path d="M50.81 8.38L51.96 8.71997C51.78 9.32997 51.49 9.77995 51.08 10.0699C50.67 10.3599 50.15 10.51 49.51 10.51C48.73 10.51 48.08 10.26 47.58 9.75C47.08 9.25 46.82 8.56005 46.82 7.68005C46.82 6.76005 47.07 6.04003 47.58 5.53003C48.09 5.02003 48.75 4.76001 49.58 4.76001C50.3 4.76001 50.89 4.95999 51.34 5.35999C51.61 5.59999 51.81 5.94 51.94 6.38L50.76 6.64001C50.69 6.35001 50.54 6.11996 50.32 5.95996C50.1 5.78996 49.83 5.70996 49.52 5.70996C49.08 5.70996 48.73 5.86002 48.46 6.15002C48.19 6.45002 48.05 6.91997 48.05 7.58997C48.05 8.28997 48.19 8.78997 48.45 9.08997C48.72 9.38997 49.07 9.54004 49.49 9.54004C49.8 9.54004 50.08 9.44001 50.31 9.26001C50.55 9.09001 50.71 8.79 50.81 8.38Z" fill="white"/>
<path d="M58.3 10.52H57.01L56.49 9.21997H54.13L53.64 10.52H52.38L54.67 4.78003H55.93M56.11 8.23999L55.3 6.10999L54.51 8.23999H56.11Z" fill="white"/>
<path d="M19.11 13.34C19.08 13.05 18.9 12.91 18.58 12.91C18.44 12.91 18.33 12.94 18.24 13C18.15 13.06 18.1 13.15 18.1 13.28L18.17 13.46L18.36 13.5699C18.44 13.5899 18.53 13.62 18.63 13.63C18.73 13.65 18.82 13.67 18.92 13.7C19.02 13.73 19.11 13.76 19.19 13.8L19.39 13.98C19.44 14.06 19.46 14.16 19.46 14.27C19.46 14.38 19.43 14.4801 19.39 14.5601L19.19 14.76C19.11 14.81 19.02 14.84 18.92 14.87C18.82 14.89 18.73 14.91 18.62 14.91C18.37 14.91 18.16 14.85 17.99 14.72C17.82 14.59 17.74 14.41 17.74 14.16H18.01C18.01 14.33 18.07 14.46 18.19 14.54C18.31 14.63 18.46 14.67 18.63 14.67C18.78 14.67 18.91 14.64 19.01 14.58C19.11 14.52 19.17 14.42 19.17 14.28L19.1 14.08L18.91 13.96C18.83 13.93 18.74 13.91 18.64 13.89C18.54 13.87 18.45 13.8499 18.35 13.8199C18.25 13.7999 18.16 13.76 18.08 13.73L17.88 13.5601C17.83 13.4901 17.81 13.4 17.81 13.29C17.81 13.09 17.88 12.93 18.04 12.83C18.19 12.72 18.37 12.67 18.59 12.67C18.82 12.67 19.01 12.73 19.15 12.84C19.29 12.95 19.37 13.12 19.38 13.34" fill="white"/>
<path d="M19.98 13.3H20.22V13.53H20.23C20.34 13.35 20.51 13.27 20.73 13.27C20.95 13.27 21.1 13.36 21.15 13.53C21.26 13.35 21.42 13.27 21.63 13.27C21.97 13.27 22.14 13.42 22.14 13.72V14.85H21.89V13.84C21.89 13.73 21.87 13.65 21.83 13.59C21.79 13.53 21.71 13.5 21.6 13.5C21.47 13.5 21.38 13.54 21.3 13.61C21.23 13.68 21.19 13.78 21.19 13.9V14.86H20.94V13.85C20.94 13.74 20.92 13.66 20.88 13.6C20.84 13.54 20.76 13.51 20.65 13.51C20.52 13.51 20.42 13.55 20.35 13.64C20.28 13.73 20.24 13.82 20.24 13.9V14.86H19.99" fill="white"/>
<path d="M24.11 14.83L23.93 14.87C23.79 14.87 23.71 14.79 23.71 14.64C23.58 14.8 23.4 14.87 23.17 14.87C23.02 14.87 22.9 14.84 22.8 14.77C22.71 14.7 22.66 14.59 22.66 14.45L22.7 14.24L22.82 14.1L22.98 14.02L23.18 13.97L23.31 13.95L23.44 13.9301L23.54 13.91L23.63 13.88L23.68 13.83L23.7 13.75C23.7 13.58 23.59 13.49 23.36 13.49C23.11 13.49 22.99 13.59 22.98 13.78H22.73C22.74 13.6 22.8 13.47 22.92 13.39C23.04 13.31 23.19 13.27 23.38 13.27C23.77 13.27 23.96 13.4099 23.96 13.6899V14.48L23.97 14.62L24.04 14.65L24.12 14.63M23.7 14.04C23.66 14.07 23.59 14.09 23.5 14.11C23.41 14.13 23.32 14.14 23.24 14.14L23.03 14.22L22.94 14.42L23.03 14.59L23.24 14.64C23.39 14.64 23.51 14.6 23.59 14.53L23.71 14.29V14.04H23.7Z" fill="white"/>
<path d="M24.55 13.3H24.79V13.63H24.8C24.86 13.5 24.94 13.41 25.03 13.35C25.12 13.29 25.23 13.27 25.37 13.27V13.54C25.17 13.54 25.03 13.59 24.94 13.7C24.85 13.81 24.81 13.96 24.81 14.16V14.84H24.56" fill="white"/>
<path d="M26.11 13.3H26.42V13.52H26.11V14.47L26.15 14.58L26.3 14.6H26.42V14.8199H26.23C26.09 14.8199 26 14.8 25.94 14.75C25.89 14.71 25.86 14.62 25.86 14.48V13.5H25.6V13.28H25.86V12.8199H26.11" fill="white"/>
<path d="M27.99 12.71H28.28V13.77L29.36 12.71H29.73L28.83 13.5699L29.76 14.84H29.4L28.63 13.76L28.28 14.1V14.84H27.99" fill="white"/>
<path d="M30.42 13.02H30.17V12.71H30.42V13.02ZM30.17 13.3H30.42V14.84H30.17V13.3Z" fill="white"/>
<path d="M31.38 13.3H31.69V13.52H31.38V14.47L31.42 14.58L31.57 14.6H31.69V14.8199H31.5C31.36 14.8199 31.27 14.8 31.21 14.75C31.16 14.71 31.13 14.62 31.13 14.48V13.5H30.87V13.28H31.13V12.8199H31.38" fill="white"/>
<path d="M33.23 13.79C33.19 13.59 33.06 13.48 32.85 13.48C32.68 13.48 32.56 13.54 32.48 13.65C32.4 13.76 32.37 13.91 32.37 14.08C32.37 14.24 32.41 14.37 32.48 14.48C32.55 14.59 32.67 14.64 32.82 14.64C33.07 14.64 33.21 14.52 33.24 14.27H33.5C33.47 14.46 33.4 14.61 33.28 14.71C33.16 14.81 33.01 14.86 32.82 14.86C32.59 14.86 32.41 14.79 32.29 14.65C32.16 14.51 32.1 14.32 32.1 14.08C32.1 13.84 32.16 13.64 32.29 13.49C32.41 13.34 32.59 13.26 32.83 13.26C33.01 13.26 33.17 13.3 33.29 13.39C33.41 13.48 33.48 13.61 33.5 13.79" fill="white"/>
<path d="M34 12.71H34.25V13.52H34.26C34.3 13.43 34.36 13.3699 34.45 13.3199C34.54 13.2799 34.64 13.25 34.74 13.25C34.93 13.25 35.07 13.3 35.15 13.4C35.23 13.5 35.27 13.6399 35.27 13.8199V14.83H35.02V13.79C35.02 13.69 34.99 13.6201 34.94 13.5601C34.88 13.5001 34.81 13.48 34.71 13.48C34.56 13.48 34.45 13.52 34.37 13.61C34.29 13.7 34.25 13.82 34.25 13.96V14.83H34" fill="white"/>
<path d="M37.18 14.35C37.15 14.52 37.07 14.65 36.96 14.74C36.85 14.83 36.7 14.87 36.52 14.87C36.28 14.87 36.1 14.8 35.98 14.65C35.86 14.5 35.79 14.3101 35.78 14.0601C35.78 13.8301 35.85 13.64 35.99 13.49C36.13 13.34 36.3 13.26 36.51 13.26C36.62 13.26 36.71 13.2799 36.79 13.3199L36.99 13.47L37.12 13.6801L37.19 13.92L37.2 14.15H36.05C36.05 14.29 36.08 14.41 36.17 14.51C36.25 14.61 36.37 14.65 36.53 14.65C36.75 14.65 36.89 14.55 36.93 14.35M36.94 13.92C36.93 13.8 36.89 13.69 36.8 13.61C36.72 13.53 36.61 13.49 36.49 13.49C36.36 13.49 36.26 13.53 36.18 13.61C36.1 13.69 36.06 13.8 36.05 13.92H36.94Z" fill="white"/>
<path d="M37.68 13.3H37.92V13.54H37.93C38.03 13.35 38.2 13.26 38.43 13.26C38.62 13.26 38.76 13.31 38.84 13.41C38.92 13.51 38.96 13.65 38.96 13.83V14.84H38.71V13.8C38.71 13.7 38.68 13.6299 38.63 13.5699C38.57 13.5199 38.5 13.49 38.4 13.49C38.25 13.49 38.14 13.53 38.06 13.62C37.98 13.71 37.94 13.83 37.94 13.97V14.84H37.69" fill="white"/>
<path d="M41.41 13.89H40.55V14.13H41.41V13.89Z" fill="white"/>
<path d="M44.28 13.34C44.25 13.05 44.07 12.91 43.75 12.91C43.61 12.91 43.5 12.94 43.41 13C43.32 13.06 43.27 13.15 43.27 13.28L43.34 13.46L43.53 13.5699C43.61 13.5899 43.7 13.62 43.8 13.63C43.9 13.65 43.99 13.67 44.09 13.7C44.19 13.73 44.28 13.76 44.36 13.8L44.56 13.98C44.61 14.06 44.63 14.16 44.63 14.27C44.63 14.38 44.6 14.4801 44.56 14.5601L44.36 14.76C44.28 14.81 44.19 14.84 44.09 14.87C43.99 14.89 43.9 14.91 43.79 14.91C43.54 14.91 43.33 14.85 43.16 14.72C42.99 14.59 42.91 14.41 42.91 14.16H43.18C43.18 14.33 43.24 14.46 43.36 14.54C43.48 14.63 43.63 14.67 43.8 14.67C43.95 14.67 44.08 14.64 44.18 14.58C44.28 14.52 44.34 14.42 44.34 14.28L44.27 14.08L44.07 13.96C43.99 13.93 43.9 13.91 43.8 13.89C43.7 13.87 43.61 13.8499 43.51 13.8199C43.41 13.7999 43.32 13.76 43.24 13.73L43.04 13.5601C42.99 13.4901 42.97 13.4 42.97 13.29C42.97 13.09 43.05 12.93 43.2 12.83C43.35 12.72 43.53 12.67 43.75 12.67C43.98 12.67 44.17 12.73 44.31 12.84C44.45 12.95 44.53 13.12 44.54 13.34" fill="white"/>
<path d="M45.15 13.3H45.39V13.53H45.4C45.51 13.35 45.68 13.27 45.9 13.27C46.12 13.27 46.27 13.36 46.32 13.53C46.43 13.35 46.59 13.27 46.81 13.27C47.15 13.27 47.32 13.42 47.32 13.72V14.85H47.07V13.84C47.07 13.73 47.05 13.65 47.01 13.59C46.97 13.53 46.89 13.5 46.77 13.5C46.65 13.5 46.55 13.54 46.48 13.61C46.41 13.68 46.37 13.78 46.37 13.9V14.86H46.12V13.85C46.12 13.74 46.1 13.66 46.06 13.6C46.02 13.54 45.94 13.51 45.83 13.51C45.7 13.51 45.6 13.55 45.53 13.64C45.46 13.73 45.42 13.82 45.42 13.9V14.86H45.17" fill="white"/>
<path d="M49.28 14.83L49.1 14.87C48.96 14.87 48.89 14.79 48.89 14.64C48.76 14.8 48.58 14.87 48.35 14.87C48.2 14.87 48.07 14.84 47.98 14.77C47.89 14.7 47.84 14.59 47.84 14.45L47.88 14.24L48 14.1L48.16 14.02L48.36 13.97L48.49 13.95L48.61 13.9301L48.71 13.91L48.8 13.88L48.85 13.83L48.87 13.75C48.87 13.58 48.76 13.49 48.53 13.49C48.28 13.49 48.16 13.59 48.15 13.78H47.9C47.91 13.6 47.97 13.47 48.09 13.39C48.21 13.31 48.36 13.27 48.55 13.27C48.94 13.27 49.13 13.4099 49.13 13.6899V14.48L49.14 14.62L49.21 14.65L49.29 14.63M48.86 14.04C48.82 14.07 48.75 14.09 48.66 14.11C48.57 14.13 48.48 14.14 48.4 14.14L48.18 14.22L48.09 14.42L48.18 14.59L48.39 14.64C48.54 14.64 48.66 14.6 48.74 14.53L48.86 14.29V14.04Z" fill="white"/>
<path d="M49.71 13.3H49.95V13.63H49.96C50.02 13.5 50.1 13.41 50.19 13.35C50.28 13.29 50.39 13.27 50.53 13.27V13.54C50.33 13.54 50.19 13.59 50.1 13.7C50.01 13.81 49.97 13.96 49.97 14.16V14.84H49.72" fill="white"/>
<path d="M51.28 13.3H51.59V13.52H51.28V14.47L51.32 14.58L51.47 14.6H51.59V14.8199H51.4C51.26 14.8199 51.17 14.8 51.11 14.75C51.05 14.7 51.03 14.62 51.03 14.48V13.5H50.77V13.28H51.03V12.8199H51.28" fill="white"/>
<path d="M53.16 12.71H53.45V14.6H54.57V14.84H53.16" fill="white"/>
<path d="M55.26 13.02H55.01V12.71H55.26V13.02ZM55.01 13.3H55.26V14.84H55.01V13.3Z" fill="white"/>
<path d="M55.97 13.52H55.71V13.3H55.97V13.0699C55.97 12.9399 56.01 12.85 56.08 12.79C56.15 12.73 56.26 12.6899 56.4 12.6899L56.56 12.71V12.9301L56.42 12.91L56.27 12.95L56.22 13.08V13.29H56.52V13.51H56.22V14.8199H55.97" fill="white"/>
<path d="M58.28 14.35C58.25 14.52 58.17 14.65 58.06 14.74C57.95 14.83 57.8 14.87 57.62 14.87C57.38 14.87 57.2 14.8 57.08 14.65C56.96 14.5 56.89 14.3101 56.88 14.0601C56.88 13.8301 56.95 13.64 57.09 13.49C57.22 13.34 57.4 13.26 57.61 13.26C57.72 13.26 57.81 13.2799 57.89 13.3199L58.09 13.47L58.22 13.6801L58.29 13.92L58.3 14.15H57.14C57.14 14.29 57.18 14.41 57.26 14.51C57.34 14.61 57.46 14.65 57.62 14.65C57.84 14.65 57.98 14.55 58.02 14.35M58.03 13.92C58.02 13.8 57.98 13.69 57.89 13.61C57.81 13.53 57.71 13.49 57.58 13.49C57.45 13.49 57.35 13.53 57.27 13.61C57.19 13.69 57.15 13.8 57.14 13.92H58.03Z" fill="white"/>
</svg>
