{
  "股票": ["股票代码", "股票名称", "股票名称拼音", "注册资本", "上市板块", "成立日期","上市时间", "省份", "城市"],
  "股票数据": ["更新时间", "开盘价", "收盘价", "最高价", "最低价", "涨跌幅", "涨幅", "跌幅","成交量","成交额", "成交","涨停连板天数","涨停连板","涨停","红三兵", "价格", "现价"],
  "股票季财务信息":["更新时间","更新年份", "更新季度", "净利润", "利润", "存货周转率"],
  "股票半年财务信息 ":["更新时间","更新年份", "更新季度", "净利润", "利润", "存货周转率"],
  "股票年财务信息":["更新时间","更新年份", "更新季度", "净利润", "利润", "存货周转率"],
  "新股": ["发行代码", "发行数量", "网上发行日期"],
  "董事长": ["姓名", "性别", "任职日期", "离职日期"],
  "股东": ["公司名称"],
  "行业": ["行业代码", "行业名称"],
  "行业数据": ["更新时间","开盘价","收盘价","最高价","最低价","涨跌幅", "涨幅", "跌幅","价格", "现价"],
  "资讯": ["id","名称"],
  "公募基金": ["基金代码", "基金名称", "销售状态", "管理费", "最新规模", "认购开始时间", "认购结束时间", "最新净值", "净值", "收益率"],
  "基金经理人": ["姓名", "性别", "学历"],
  "产业": ["名称","规模"],
  "股票-新股": ["上市时间"],
  "股东-股票": ["持股比例", "流通持股比例"],
  "基金-股票": ["持仓比例", "持仓金额"],
  "股票-资讯": ["利空", "中性", "利多"],
  "基金-资讯": ["利空", "中性", "利多"]
}