冬阴功 是 泰国 最 著名 的 菜 之一 ， 它 虽然 不是 很 豪华 ， 但 它 的 味道 确实 让 人 上瘾 ， 做法 也 不难 、 不 复杂 。
首先 ， 我们 得 准备 ： 大虾 六 到 九只 、 盐 一 茶匙 、 已 做好 的 柠檬汁 三 汤匙 、 泰国 柠檬 叶 三叶 、 柠檬 香草 一根 、 鱼酱 两 汤匙 、 辣椒 6 粒 、 纯净水 4 量杯 、 香菜 半 量杯 和 草菇 10 个 。
这样 ， 你 就 会 尝到 泰国人 死爱 的 味道 。
另外 ， 冬阴功 对 外国人 的 喜爱 不断 地 增加 。
这部 电影 不仅 在 国内 ， 在 国外 也 很 有名 。
不管 是 真正 的 冬阴功 还是 电影 的 “ 冬阴功 ” ， 都 在 人们 的 心里 刻骨铭心 。
随着 中国 经济 突飞猛进 ， 建造 工业 与日俱增 。
虽然 工业 的 发展 和 城市 规模 的 扩大 对 经济 发展 有 积极 作用 ， 但是 同时 也 对 环境 问题 日益严重 造成 了 空气污染 问题 。
那些 空气污染 也 没 有助于 人生 的 身体健康 。
由此可见 ， 首先 我们 要 了解 一些 关于 空气污染 对 我们 人生 有 什么 危害 的 话题 ， 知道 了 这些 常识 以后 对 我们 人类 会 有 积极 作用 ， 以及 要 学会 怎样 应对 和 治理 空气污染 的 问题 。
任何 事情 都 是 各有利弊 ， 众所周知 ， 建立 工业 越对 经济 方面 有所 发展 。
在我看来 ， 曼古 空气污染 的 问题 与日俱增 。
每天 会 有 不少 的 毒 气体 泄漏 从 工厂 里 出来 。
在 工厂 里 的 工作人员 为了 工作 ， 而 每天 吸 了 不少 的 毒 气体 ， 经过 了 一年 多 的 时间 ， 连 工作人员 也 得 了 严重 的 病 ， 更 不用说 住 在 这家 工厂 附近 的 家庭 。
沙尘暴 也 是 空气污染 之一 。
不管 是从 口 、 眼 、 鼻子 进去 这样 会 伤害 身体 的 健康 。
这样 做 可以 避免 遭受 沙尘暴 。
最后 ， 要 关注 一些 关于 天气预报 的 新闻 。
中国 ， 悠久 的 历史 ， 灿烂 的 文化 ， 真是 历史 上 最 难忘 的 国家 。
对 一个 生名 医生 来说 ， 空气污染 是 很 危险 的 问题 ， 对 身体 不好 。
抽烟 对 身体 非常 不好 ， 对 身体 非常 有害 。
在 中国 ， 不管是谁 ， 都 抽烟 。
但是 医生 说 ， 他 的 身体 跟 抽烟 的 人 完全 一样 ， 好像 抽烟 抽 了 六十年 一样 。
在 证治 方面 空气污染 也 很 不好 。
现在 人们 会 认为 中国 ， 特别 是 北京 ， 没有 “ 自然 ” 的 感觉 。
例如 ， 天气 非常 好 的 时候 和 天气 非常 不好 的 时候 完全 不 一样 ， 天气 好 时 大部分 的 人会 高兴 。
工业 发展 是 好 东西 ， 但是 好 的 东西 也 有 不好 的 东西 。
工业 发展 把 中国 当作 一个 很强 的 国家 。
北京 的 空气 太 污染 了 ， 住 在 北京 的 人 一定 要 注意 ， 别 抽烟 。
大家 都 希望 过 着 富裕 的 生活 。
我 认为 空气污染 是 跟 我们 的 生活 密切 的 问题 ， 所以 一定 要 最 优先 解决 ， 尤其 是 像 北京 那样 的 大城市 。
林冲 一路 来到 了 李小二 的 店里 ， 选 了 一张 比较 隐蔽 的 桌子 坐 了 下来 。
现代 社会 的 就业 难 太 厉害 。
因为 准备 就业 的 时间 越来越少 了 。
但是 这种 想法 太 近视眼 了 ， 而且 有 很大 的 错误 。
一般 人 觉得 只有 流利 的 英语 实力 、 好多 证件 、 丰富 的 活动 经历 什么 的 人才 能 找到 好 工作 。
如果 读 各种各样 的 书 ， 能 培养 各种各样 的 能力 ， 变得 更 创新 ， 而 思考 的 深度 更深 ， 那 多么 公司 会 需要 录用 他 。
大学 是 让 学生 们 能 成为 一名 好 成人 ， 好 的 社会 的 一部分 。
不管 对 就业 有没有 直接 的 好处 ， 学生 们 都 要 认真学习 。
当然 现在 的 情况 下 ， 在 大学 学生 们 只 读书 是 难 的 事情 ， 准备 找 工作 也 重要 极了 。
近来 就业 难 是 一个 社会 问题 ， 大学 毕业生 也 不 例外 。
所以 一些 人 说 ， 读书 一点 用处 都 没有 。
他们 的 主张 里 的 最大 的 错误 就 在 这里 。
学习 是 以 得到 智慧 ， 不是 就业 。
社会 越来越 变得 专业化 、 灵通 化 。
照 此 趋势 类推 ， 将来 更多 的 人 被 机器 掠夺 了 。
现代 的 科学技术 发展 已经 能 代替 人 做 那种 作业 。
为了 找到 这些 稳定 的 工作 ， 我们 有 读书 的 必要 。
读 一 本书 可以 让 你 看到 另外 的 角度 ， 而且 获得 宝贝 的 知识 。
读 很多 书 让 我们 明白 ， 并且 可以 有 逻辑思维 。
总之 ， 面试 非常 重要 。
你 读 很多 书 的话 ， 你 就 可以 获得成功 。
可 现在 有 很多 大学 ， 大部分 人 几乎 都 在 上 大学 。
这样 的 事情 让 政府 感到 有些 负担 。
找 工作 的 人 比 公司 更 多 。
我家 附近 有 很多 考试 补习班 。
如果 结果 好 的话 ， 没关系 ， 可 不好 的话 ， 浪费时间 。
最近 高中生 比起 有名 的 大学 更 喜欢 技术 大学 。
因为 这个 问题 ， 所以 最近 头疼 。
大学 的 功能 不是 这样 的 ， 而是 学 的 。
我 非常 荣幸 能够 选修 这 门 课程 ， 这个 班级 。
这 学期 学到 了 多种形式 的 文章 ， 从 日常 书信 、 专用 书信 、 便条 、 字据 、 说明文 和 总结 等 。
从 学习 写 日常 书信 和 专用 书信 的 课 中 ， 我 学到 了 如何 在 不同 场合 使用 不同 语言 的 方式 。
我 学到 了 如何 更 简练 ， 更 书面 地 表达 自己 的 意见 。
我 学到 了为 自己 的 过去 进行 歹思 并 鼓起勇气 的 方法 。
阅读 与 写作 是 在 华 留学生 必修 的 一门 课 ， 有 它 ， 让 我们 的 留学 生活 更 充实 ， 更 完美 。
因为 几乎 的 人们 还 没 感到 污染 对 自己 的 直接 的 影响 。
空气 虽然 是 不可 忽视 的 物质 ， 但是 是 生活 中 不可 缺少 的 特质 。
遵守 一个 一个 ， 自己 制定 的 小 活动 。
近代 木柴 被 认为 重要 的 资源 、 能源 ， 因此 被 用得 越来越 多 。
每年 被 用 在 树木 上 的 树木 比 植物 的 树木 多 很多 。
树 越多 ， 空气 的 污染 就 越快 。
列车 、 汽车 、 飞机 等 人类 科技 发展 的 结果 也 是 重大 问题 。
1. 少 骑 汽车 ； 2. 多用 公共设施 ， 如 地铁 、 公共汽车 等 ； 3. 多 走路 多 骑 自行车 。
导致 空气污染 的 代表 要素 是 汽车尾气 。
不仅 学会 了 很多 知识 ， 而且 发现 了 对 自己 合适 、 有效 的 学习 方法 。
这些 问题 其实 是 不该 犯 的 ， 写文章 再 要 细心 ， 重视 细节 。
总的来说 ， 我 对 这个 学期 的 学习 情况 较 满意 。
中国 近 几十年 来 的 发展 带来 了 很多 大 问题 ， 最大 的 可以 说 是 环境 上 的 几样 ， 特别 值得 关注 的 是 空气污染 。
空气污染 的 问题 已 变成 一个 世界 上 共存 的 问题 之一 。
我们 应该 怎么 去 治理 和 保护 自己 ， 先 需要 知道 空气污染 是 什么 。
空气污染 已经 对 普通 公民 有 一定 的 危害 了 。
大使馆 所 查到 的 都 可以 上网 ， 或者 下 一个 应用 去 自己 看 。
如果 全世界 多 注意 ， 可能 有 一天 我们 就 不用 出门 害怕 空气污染 了 。
其 结果 导致 全世界 的 环境 问题 越来越 严重 。
空气污染 后 受害 的 不是 空气 ， 而是 我们 人类 受害 。
我们 吸收 污染 的 空气 ， 会 致癌 。
可以 把 污染 的 空气 变成 清新 的 空气 。
工厂 的 排放 导致 雾 霾 ， 所以 政府 主动 地 控制 工厂 的 排放量 。
空气污染 的 危害性 是 不用 再说 的 ， 应该 每个 人 都 知道 。
为什么 我 这么 说 呢 ， 因为 全世界 的 人们 都 生活 在 地球 上 ， 要是 地球 因为 环境污染 而 受到 很大 的 冲击 的话 ， 就 会 影响 到 在 地球 上 生活 的 人 。
但是 不能 因此 停滞不前 或 退缩 。
人 为了 生存 不管 是 干净 的 空气 ， 污染 的 空气 都 要 呼吸 。
空气污染 会 影响 人们 的 生活 质量 和 过 幸福 的 生活 的 权力 。
空气污染 不但 带来 健康 的 问题 ， 还 会 带来 物质 上 的 问题 。
车 尾气 是 空气污染 的 罪魁祸首 。
林冲 觉得 困 ， 很 累 ， 想 吃 点 东西 ， 喝 点 酒 。
我 就 在 此 了解 了 你 这 罪魁祸首 ， 平平 风气 ！
林冲 想 把 这些 头 回京 ， 府 里 见 太郎 时 给 他 。
有 一天 晚上 他 下 了 决定 向 富丽堂皇 的 宫殿 里 走 ， 偷偷地 进入 宫内 。
我 的 人生 怎么 这么 残酷 呢 ?
林冲 因 富安 、 陆 谦和 差 拨 三个 人 无法 容忍 的 背叛 行为 ， 仿佛 是 他们 三个 在 背后 攥 了 他 一刀 一样 ， 一 想起 山神庙 的 事气 得 直达 牙关 。
官僚 腐败 ， 尤其 几个 贪官污吏 老 是 抢夺 人民 的 财产 ， 百姓生活 更加 贫穷 。
我 转学 的 时候 ， 感到痛苦 ， 之所以 转学 是因为 失去 了 我 在 学校 的 一切 美丽 时光 。
刚 到 康桥 中学 时 ， 我 眼前 的 情景 是 韩国 留学生 的 上课 拒绝 。
有 一天 ， 他们 终于 让 善良 的 女老师 哭 了 ， 跑 出 教室 。
虽然 我 是 无能 的 ， 而且 喜欢 玩电脑 的 笨猪 ， 但是 眼前 的 场景 是 不可 容纳 的 ， 也 不 允许 的 。
然后 跑 出 教室 安慰 那位 女老师 以及 所有 的 情况 告诉 班主任 老师 。
我 考上 北大 之后 偶然 听到 欺负 我 的 那些 留学生 的 消息 。
可 它 的 表情 是 从来 没见 过 的 。
我 把 弟弟 叫醒 过来 后 ， 一起 开始 找 答案 。
从此以后 ， 我 再也 不 撒谎 、 抄 答案 等等 行为 了 。
那天 ， 我们 要 做 比 原来 多两倍 的 作业 。
高中 时 我们 穿着 朴素 端正 的 校服 ， 不 需 华丽 的 装饰 ， 那时 我们 只 报 一个 书包 就 幸福 了 。
我 高中 生活 的 滋味 蔓延到 我 全身 ， 意犹未尽 ， 沁人心脾 。
有 为 之 没 走进 唱片 行 了 ， 有 为 之 没 感受 到 当初 的 那种 冲动 了 呢 ？
就 我 个人 而言 ， 在 一个 城市 里 ， 文物 和 城市 发展 这 两个 都 非常 重要 。
日本 的 京都 奈良 、 历史 虽然 比不上 西安 、 但是 从 建都 以来 的 重要 文物 几乎 全部 保护 到 现在 。
城市 历史 文化 保护 关系 到 城市 的 文化 品位 、 知名度 ， 总合 竞争力 ， 是 一个 重要 的 课题 。
但是 ， 互联网 对 我们 有利 还是 有 弊 都 在于 我们 如何 使用 。
不 知道 的 知识 我们 会 赶快 找到 。
我 的 父亲 是 染色 技术 研究所 的 职员 。
她 已经 大学毕业 了 ， 专业 是 视觉 设计 。
学 外语 是 很 难 的 事情 ， 而且 汉语 有 许多 汉字 ， 也 有 古代 使用 的 汉字 。
时间 过 得 很快 ， 我 已经 变成 了 三年级 。
有 可能 是因为 我 的 生活 很 忙 ， 所以 感觉 时间 过 得 很快 。
学习 汉语 的 很多 外国 学生 在 写作 汉语 时 ， 伤 了 不少 脑筋 。
阳光灿烂 的 今天 我 走进 了 清华大学 的 校园 。
它们 的 美 逐渐 使 我 迷住 了 。
如果 我 遇到困难 ， 他们 会 帮助 我 、 关照 我 。
从 那天 开始 ， 我们 每天 在 北语 哪家 咖啡厅 一起 看 电视剧 。
我 推荐 你 也 每天 看 一二节 的 电视剧 ， 对 学 韩语 的 口语 、 听力 肯定 有大 进步 ！
我 一个 人 在 云南 旅行 当中 ， 和 你 认识 是 很 幸福 的 事 。
我 一个 人 看 名胜古迹 的 时候 ， 你 先 对 我 说话 ， 而且 你 就 介绍 给 你 亲密 的 朋友 们 。
我 绝对 不能 忘记 和 你 在 一起 的 时间 ， 我 真 感谢 你 。
八月 末 ， 你 和 你 的 男朋友 会 邀请 你 参加 婚礼 。
我 跟 老师 已经 6 年 多 没 联系 了 。
这 是 我 第一次 给 你 写 的 信 ， 所以 我 不 知道 怎么 开始 。
国庆 期间 ， 我 多 看 北京 的 名胜古迹 ， 多 吃 北京 的 名菜 。
你 还 记得 我们 第一次 见面 吗 ？
但是 现在 我 的 汉语 水平 进步 了 ， 跟 你 聊天 没 问题 了 。
我 现在 跟 以前 一样 不 那么 忧郁 ， 反而 现在 性格 变得 开朗 得 不得了 。
最近 我 开始 第一 学期 ， 很 努力 地 学习 。
这里 的 学习 比 青岛 更 紧张 ， 但是 我 感觉 到 我 的 汉语 水平 在 逐渐 地 提高 。
有时候 ， 备课 和 讲课 让 我 感到 很 累 。
但是 一个月 之后 我 再 见到 你 的 时候 ， 我 看到 你 进步 的 样子 。
半年 后 ， 我们 完全 只用 韩语 交流 ， 真 让 我 大吃一惊 。
你 告诉 我 只要 不 放弃 ， 我们 的 人生 就 没有 失败 。
我 在 北大 学习 的 第一年 我 吃 了 不少 苦 。
我 每天 要 预习 和 复习 ， 努力完成 老师 的 任务 。
我 和 家人 一起 在 关岛 度过 了 很 幸福 的 时间 。
从 那天 开始 ， 我 一直 在 忙 着 做作业 。
最近 天气 越来越 冷 了 ， 你 要 注意 别 感冒 了 ！
不 在 我 的 丹东 像 没鱼 的 鸭绿江 一样 吧 ？
老师 讲课 时 ， 那 既 独特 ， 又 美妙 的 声音 我 忘不了 。
我 起床 的 时候 很 难 ， 总是 再 睡觉 。
我 以前 上 高中 的 时候 ， 一句 话 也 说不出来 。
你 选 了 我 ， 我 心里 很 受 感动 。
我 被 交通事故 了 。
我 听说 最近 韩国 来 台风 的 消息 ， 你家 哪儿 一切 好 吧 ？
现在 几乎 每天 的 空气污染 指数 都 很 高 ， 天上 蒙 着 厚厚的 烟雾 ， 再 加上 偶尔 刮 大风 的 时候 随地 一起 刮 的 沙尘 ， 对 身体 的 压力 还是 很大 啊 。
或许 你们 看过 在 奥运会 上 默默地 跑 马拉松 的 选手 吗 ？
光明 不能 拿 钱 买 的 ， 不能 容易 求取 的 。
大多数 人 一旦 在 黑暗 下 不 知道 自己 怎么 面对 这些 困难 。
其次 需要 对 黑暗 的 思考 方法 进行 分析 。
有 经历 过 摆脱 黑暗 的 人 ， 可以 面对 更 难 、 更深 的 黑暗 ， 在 这个 时候 才能 得到 自信 感 和 勇气 。
慢慢 地 走 在 黑暗 中 走 出来 ， 需要 的 是 决心 和 耐心 ， 还 需要 通气 。
在 新石器 时代 ， 人类 开始 害怕 黑暗 ， 所以 为了 避免 恐惧 的 心理 需要 光明 。
光明 与 许 是 贤王 的 统治 ， 也许 是 无 战争 的 和平 。
代表 黑暗 的 形态 的 也 很多 ： 疾病 、 天灾 、 战争 ， 竞争 激烈 的 现代 社会 带来 的 压力 ， 环境污染 等 。
即使 它们 都 存在 过 ， 但 至少 一种 状况 持续 了 很 长时间 。
有 疾病 就 有 药疗 ， 有 死亡 就 有 生命 。
一个 小孩 在 阳光明媚 的 大白天 感到 平安 和 舒服 ， 但 一旦 放到 漆黑 的 房间 里 或 在 晚上 让 他 自己 呆 在 外面 ， 孩子 就 开始 哇哇大哭 。
她 说话 非常 幽默 讨人喜欢 ， 所以 她 在 许多 节目 上当 了 主持人 。
他 每天 过 着 非常 寒冷 、 困苦 的 日子 。
有 一天 ， 一个 大学生 在 他 眼前 玩 滑板 。
他 请 他 的 朋友 借钱 ， 不过 他们 都 拒绝 了 。
看到 光明 与 黑暗 ， 我会 不得不 想起 我 的 高三 时期 。
她 的 人生 就 在 那 黑暗世界 里 ， 就 像 永远 找 不到 光明 一样 的 时候 ， 导师 安妮 帮助 了 她 走出 黑暗世界 。
他 的 家庭 也 没 那么 富裕 ， 当 他 长大 以后 可以 打工 在 车库里 生活 。
人生 就是 过山车 ， 又 高 又 低 ， 又 光明 又 黑 。
回想 那 一些 人生 的 一部分 ， 我 才能 明白 人生 里 存在 的 光明 与 黑暗 是 必须 得 存在 的 要素 。
虽然 这 新世界 我 不 知道 ， 不 熟悉 ， 但是 有 我 的 父母 ， 就 能 战胜 未来 。
仅仅 这 两次 的 经历 ， 多数 次 的 光明 与 黑暗 影响 了 我 的 人生 。
我 小 的 时候 很 想养 狗 。
我 班里 有 很漂亮 的 女同学 ， 我 一见钟情 。
所以 一段 时期 ， 一天 吃 一顿饭 ， 睡 得 不好 。
妈 也 是 第一次 打 我 ， 我 也 是 第一次 被 妈 打 。
还 解放后 发生 6 · 25 战争 ， 因此 这些 给 韩国 带来 的 打击 很大 。
现在 到 韩国 的 光明 时期 的 原因 是 ， 通过 黑暗 的 时代 充满 着 如同 劲草 般 刚强 不屈 的 好胜心 。
在 成长 的 过程 中 不 摔跤 是 不 可能 的 ， 但 会 有 恐惧 ， 如果 再过 这 关会 得到 光明 。
最近 很多 有 被 偷东西 的 事情 ， 所以 为了 避免 发生 同样 的 事情 ， 请 学生 们 注意 。
这个 宿舍 的 隔声 不好 ， 在 晚上 时 ， 别 大声 说话 。
请勿 晚上 9 点 以后 发出 大 声音 。
请勿 培养 宠物 。
严禁 在 宿舍楼 内 抽烟 。
请勿 在 楼道 上 吵嚷 。
有 麻烦 的 事 ， 来 管理处 。
为了 更好 的 住宿 环境 ， 请 学生 们 遵守 以下几点 内容 。
韩国 战争 结束 后 的 韩国 是 一片 黑暗 的 国家 ， 什么 地方 也 没有 吃 的 、 穿 的 。
但 过 了 许多年 韩国 成为 了 世界 贸易 的 中心 。
考试 不及格 了 怎么办 ？
面临 困境 的 时候 我们 常常 很 容易 地 抛弃 克服 那些 困境 的 机会 ， 那 可能 因为 是 我们 没有勇气 ， 人生 中 没有 遇到 过 那么 大 的 困境 。
这段话 给 我们 有 道理 的 ， 虽然 现在 黑暗 ， 但 等 着 、 忍 着 ， 光明 会 到来 的 。
无论 现在 怎么样 ， 我们 努力下去 ， 光明 不到 远 的 地步 。
一般 人 认为 光明 是 好 的 ， 就 把 好事 比喻 在 光明 ， 就 有 了 “ 光明磊落 ” 这种 成语 。
虽然 这种 想法 是 人类 产生 之后 一直 保存 下来 的 ， 但是 我 想 如果 没有 黑暗 的话 ， 我们 就 看不到 光明 的 光明 。
因为 我们 在 夜里 休息 ， 早上 可以 更 用力 ， 专心 自己 要 做 的 工作 。
世界 历史 上 成就 到 的 伟大 的 业绩 都 是 追求 光明 而 得以 实现 的 。
这 对 现代科学 发展 产生 了 巨大 的 影响 。
他 开始 找 如此 感到 黑暗 的 理由 ， 但 找不着 理由 了 。
从此 之后 ， 他 退休 了 从 公司 ， 就 开始 在 社会 服务 团体 里 参加 活动 。
虽然 这 两则 的 性格 很 相同 ， 但是 这 两则 不能 同时 存在 于 某 一件 事 上 。
互联网 成 了 对 我们 的 生活 很 重要 的 部分 。
但是 ， 上网 也 有些 不好 的 地方 。
我们 迎来 了 最 美好 的 中秋佳节 。
途中 又 很 不幸 恰逢 班机 延误 。
但 充满 了 每个 学生 的 心意 和 温暖 。
此次 活动 的 主要 目的 是 拉近 师生 之间 的 关系 。
听 他 母亲 说 他 是 副经理 。
本 公司 为 远方 地区 的 难民 捐出 了 一大笔 款 。
我 希望 将来 会 像 贵 公司 一样 为 别人 做出 贡献 。
手机 是 三星 品牌 的 、 后面 贴着 许多 小型 动物 的 贴子 。
直到 二十 世纪末 ， 印尼政府 《 精确 拼音 》 的 发布 才 有所 改变 。
如 在 美国 与 英国 ， 尽管 在 拼写 上 的 差别 很小 。
英语 是 一种 不折不扣 的 语言 。
大多数 程序 是 用 英语 写 的 。
培育 了 中华民族 成长 的 汉语 又称 中文 、 华语 、 国语 、 中国 语 等 其他 名称 。
可 变得 有趣 多 了 。
其中 就是 对 数字 能力 的 影响 。
与 一些 亚洲 国家 产生 较大 的 距离 。
中美 两国 的 数学 能力 存在 着 差异 。
从 第四类 的 混种 语 可见 日本 人 比较 喜欢 四个 假名 的 字 。
它 吸收 了 各个 国家 的 文化 ， 非常复杂 ， 所以 学 起来 比较 难 。
但是 因为 这么 模糊 又 复杂 ， 所以 学 起来 很 有趣 。
这时 表达 的 心 在 七上八下 。
大多数 程序 是 用 英语 写 的 。
不慎 将 手机 遗失在 草坪 里 。
实际上 两者 是 存在 着 差异 的 ， 就 好比 英式 英语 和 美式英语 。
对于 打发 周末 时间 没有 具体 的 安排 。
怎么 度过 时间 呢 ？
留学 的 城市 就是 北京 、 大连 、 杭州 和 徐州 的 总共 4 个 地方 。
晚上 还要 做作业 或者 跟 朋友 们 一起 玩儿 ， 然后 睡 晚觉 。
就是 为了 补充 精神 、 练习 汉语 。
在 留学 生活 中 需要 很多 钱 ， 有人 难得 开支 另外 的 费用 。
她 在 周末 不 学习 就 不能 追赶 汉语 课 因为 她 觉得 课 很 难 。
留学 的 主要 目的 就是 了解 外国 的 文化 习惯 和 学习 那个 国家 的 文化 。
让 留学生 的 留学 经验 更 有 收获 。
只是 性格 和 体力 这 调查 有点 瓜葛 。
他们 为了 健康 投资 了 自己 的 身体 。
就是 学习 英语 或者 专业 方面 的 。
最少 比如 去 宗教 活动 和 跟 朋友 们 见面 。
我们 有 七个 音乐 队 88 天 的 练习 。
您 给予 的 对 我 来说 是 一个 很好 的 机会 。
因此 ， 上周 应该 要交 的 文件 。
可以 非常容易 与 自己 系 的 同学 交流 。
但是 难于 与 别的 系 的 同学 或 老师 们 交流 。
这 问卷调查 的 目的 是 询问 北大 留学生 的 周末 生活 。
因此 我 不能 担任 辅助 人员 。
老师 们 找出 汉语 优秀 的 学生 。
造成 了 电脑 爆发 的 事故 。
您 作为 北大 第一 社团 “ 爱心 社 ” 的 负责 任 老师 不少 帮助 周围 的 小孩 。
点评 我们 在 汉语 中 所 存在 的 问题 并 提出 宝贵 的 建议 。
从 昨日 开始 已 达到 四十度 。
我们 还 需要 用 ppt 和 几篇 视频 来 表演 。
我们 活动 是 必要 的 电脑 活动 。
昨天晚上 就 出 了 故障 。
上面 共有 一个 仁兄 。
历史 、 语系 、 文法 、 词汇 、 很多 地方 都 没有 明确 的 规矩 。
它 吸收 了 各个 国家 的 文化 。
此 手机 是 iphone ## 4 戴 着 粉色 手机 壳 的 iphone ## 4 。
用 完 我会 准备 十一月 十六日 及时 送还 。
“ 周末 留学生 和 谁过 ， 怎么 过 ？ ” 问题 进行 了 问卷调查 。
33.3 % 的 人 在家 休息 。
第一点 韩语 是从 爱民 的 心 开始 ， 发展 得来 的 宝物 。
希腊语 慢慢 地 变好 了 。
期盼 已 久 的 第十一届 “ 北京 摇滚音乐 会 ” 将 于 11 月 16 日 7 点 半 在 北京 俱乐部 举行 。
共有 二十一 个人 来 准备 舞台 设计 。
这场 比赛 是 中文系 一年 举办 一次 的 活动 。
因此 向 贵 公司 申请 了 十五 台 电脑 ， 一个 路由器 和 一个 网线 出租 。
颜色 是 黑色 ， 极其 小 的 屏幕 。
让 我 签订 了 贵 公司 的 合同 。
而且 还 通过 体育 活动 预防 环季 期间 的 疾病 。
每个 人 都 付出 很多 时间 和 努力 准备 。
我们 公司 将 改正 各 方面 的 缺点 。
为了 提高 留学生 说 汉语 的 水平 ， 举行 了 一场 很大 的 比赛 。
为了 让 本系 留学生 加强 、 提高 演讲 汉语 的 水平 。
2013 年 最后 一夜 的 欢悦 气氛 。
巴士 将 在 当天 下午 六点 从 北大 理科 教学楼 前面 出发 。
本次 讨论会 的 计划 为 贾平凹 的 《 高老庄 》 。
举办 一场 名为 “ 教学相长 ” 的 师生 交流活动 ， 由 中文系 中国 学生 与 留学生 联合 举办 。
有 一天 ， 宋 老师 发给 我们 一些 繁体字 抄写 ， 之所以 国庆节 时间 太 长 。
在 放假 期间 ， 我 看 那些 抄本 ， 突然 想起 ： “ 虽然 我 抄写 一千 字 ， 但是 老师 却 要 看 100 名 同学 的 几万个 字 。 ” 哎 ， 我们 应该 反省 自己 。
那 瞬间 ， 我 就 感到 惭愧 。
我 不想 辜负 宋 老师 的 期待 。
除了 宋 老师 以外 ， 北大 的 老师 们 都 很 厉害 。
所以 ， 我 觉得 她 很 负责 、 很 严格 。
对 工作 这样 热衷 ， 对于 学生 这样 热心 是 值得 我们 敬佩 的 。
老师 的 这样 一个 人生观 、 人格 也 是 值得 我们 去 学习 的 好 老师 。
这 就是 我 的 写作 课 老师 ， 是 大学生 以来 我 最 喜欢 的 老师 。
当时 的 我 汉语 不够 流畅 ， 唯一 最好 的 就是 数学 了 ， 我 做 的 几乎 都 对 。
从那以后 我 轻松 地 融入 了 班级 。
希望 有朝一日 能 去 看看 并 拥抱 那位 矮小 而 高大 ； 文雅 而 活泼 ， 严俊 而 慈祥 的 老师 ！
老师 们 都 知道 我 是 什么 都 听不懂 的 韩国 人 ， 可能 是 可怜 又 可能 是 不管 我 ， 都 没 叫 我 。
他 的 声音 很 开朗 而且 幽默 。
有 一天 他 布置 了 作业 ， 是 读 鲁迅 的 小说 以后 写 二篇 读后感 。
进来 以后 把 办公室 扫视 了 一篇 ， 办公室 的 最 底角 上 他 在 批改作业 ， 老师 抬头 看着 我 ， 担心 地 说 什么 事儿 。
我 怯怯 怯 地 说 我 的 情况 ， 说话 说 得 不 太 流利 ， 可是 他 耐心 地 怜听 我 的话 。
到 了 我 的 程序 ， 他 给 我 布置 了 作业 。
就是 基督教 在 凌晨 祈祷 的 行为 ， 老师 把 这种 形式 借 过来 用来 用成 商谈 时间 。
我 和 其他 朋友 们 会 站 在 他 的 边 说话 ， 老师 会 给 他 一个 解决 方法 。
我们 都 觉得 很 害羞 ， 不 知道 往 哪儿 躲 ， 但是 有 一种 不知不觉 的 幸福感 充满 了 我 的 心 。
他 每天 准备 一个 名句 给 我们 听 ， 然后 给 我们 解释 ， 最后 选出 五个 人 来 表达 自己 的 感想 。
金钟 九 老师 对 我 的 影响 极大 ， 到 现在 我 还 没 回国 的话 去 找 他 。
6 个 月 ， 不 短 ， 但是 学 一门 语言 很 短 。
我 希望 ， 我 以后 跟着 我 最 尊敬 的 老师 “ 活到老 ， 学到老 ” 。
那天 是 刚 开学 ， 来到 新 的 学校 ， 见到 新 的 老师 和 同学 ， 心中 不由得 起 了 一丝 恐惧 。
她 说 她 可能 不会 宽恕 留学生 。
在 课堂 上 ， 她 讲课 热情 ， 不 驯于 学校 内 的 任何 一位 年轻 老师 。
她 真的 对待 我 像 中国 学生 一样 、 太平 等 了 。
我 对 她 的 第一印象 是 她 是 一个 温柔 而 和蔼 的 人 。
每个 星期二 ， 老师 让 我们 布置 作业 。
我 在 教室 里 期待 着 等待 新 的 老师 。
我 大吃一惊 ， 因为 我 以为 他 很 年轻 。
我 以前 根本 没有 关于 中国 古汉语 的 知识 。
这个 学期 也 上宋 老师 的 课 ， 我 希望 学到 的 东西 更 多 ， 而 希望 我 的 水平 更 提高 。
北京 的 发展 很快 ， 所以 10 年 前来 过 北京 的 朋友 再 来 北京 时 ， 为 北京首都机场 的 规模 和 现代 式 的 设计 而 感叹 。
在 好 大学 附近 和 朋友 们 学习 ， 感觉 大家 学习 都 很 热情 ， 老师 也 教课 更 热情 ， 能 增进 学习效果 。
在我看来 北京 人 很 爽快 。
看 周围 ， 我们 就 会 发现 已经 不少 人 在 天漠 （ 离 北京 最近 的 沙漠 ） 栽种 树木 ， 少 用 汽车 。
我 过去 对 中国 有 偏见 。
第一个 理由 是 我 的 朋友 会 喜欢 北京 ， 因为 北京 非常 大 ， 有 很多 旅游胜地 。
我 来 北京 将近 两个 月 了 ， 但 我 还 没看 完 北京 的 旅游胜地 。
还有 这 是 我 的 第二次 访问 北京 ， 即使 是 同样 的 地方 ， 每次 都 不同 。
但是 在 北京 ， 因为 故宫 非常 大 ， 你 一天 就 不能 看到 。
我 的 朋友 喜欢 去 看热闹 ， 所以 我 相信 我 的 朋友 对 北京 的 规模 感到 吃惊 。
所以 要是 她 来 北京 ， 我 说大话 可能 她 不 希望 回国 。
我 不能 出去 外边 一个 星期 ， 我 看不到 蔚蓝 的 蓝天 ， 都 是 黄色 的 。
我 相信 我 的 朋友 看到 这 不好 的 光景 ， 她 大失所望 。
我们 家人 都 在 中国 ， 得 赶紧 回国 看看 爷爷 ， 这 时间 会 是 最后 看 爷爷 生前 的 。
凌晨 1 点 才 到 。
她 不 回答 ， 马上 变成 那 赤练蛇 缠死 他 段誉吓 到 了 横冲直撞 。
那 赤 青蛇 它 爱 上 了 段 誉 ， 谁 都 不 可以 亲近 他 。
所以 一直 没有 妻子 和 亲朋好友 。
但 路人 却 增 不减 ， 也就是说 本地人 都 不 出门 ， 或 去 其他 地方 了 ， 在 北京 大多数 是 游客 。
那 是 一张 青春 亮丽 的 脸庞 ， 堆满 不屑 和 调侃 的 笑意 。
众人 也 跟着 转移视线 ， 纷纷 盯 着 这 两个 不知死活 的 一男一女 。
以后 ， 不仅仅 是 工作 上 ， 在 为人处事 上 我 也 会 努力 地 做到 。
听 着 夏天 百鸟争鸣 的 声音 。
为了 保持 留学生 与 中国 学生 之间 的 良好 关系 并且 提高 互相间 的 了解 ， 我 系 留学生 将 于 十月 三十日 举行 一场 联谊 晚会 。
我 在 办理 临时 住宿 登记表 上 遇到 了 很多 问题 ， 经 贵 公司 解决 ， 终于 可以 放心 ， 可以 将 时间 与 力气 用 在 学习 上 。
这时候 我 天天 坐立不安 ， 不能 集中 注意力 ， 也 影响 到 我 的 学习 和 工作 。
最后 有贵 公司 的 一位 职员 帮 我 解决 了 这个 问题 。
加拿大 日 每个 城市 都 庆祝 。
大家 都 想 吃 烧烤 和 做 运动 。
为了 好好 庆祝 加拿大 日 ， 各个 国家 都 开 了 一场 游行 。
如果 人们 享受 好 节日 就 行 。
其实 加拿大 日 没有 什么 安排 ， 没有 一定 要 做 的 东西 。
在 全国性 当中 ， 既有 国家 法定 节日 ， 也 有 民间 风俗 性 节日 。
日语 中 叫 “ 元 日 ” ， 亦 即 新年 ， 并且 中国 的 春节 一样 具有 驱逐 魔鬼 、 迎接 神灵 的 含义 。
比如 ， 除夕 之前 大门口 搭建 “ 门松 ” 。
甚至 许多 过年 风俗 比如 ， 除夕夜 去 神社 撞钟 、 唱 神酒 、 拜年 、 给 小孩 压岁钱 等 ， 与 中国 相同 。
6 ， 史用 共同 物品 后 ， 把 物品 清洗 干净 。
一 ， 请勿吸烟 者 在 宿舍楼 内 的 任何 地方 吸烟 。
四 ， 严厉 在 宿舍 内养 伴侣 。
三 ， 请勿 舍弃 垃圾 ， 请用 每 屋 走廊 前面 的 垃圾桶 或者 房间 里 的 垃圾 。
朝鲜 时代 正祖 （ 朝鲜 的 22 代王 ） 的 命令 下 建筑 的 。
这 座 城市 是 很 有名 的 旅游区 ， 在 那里 举行 了 很多 活动 。
第一个 是 妙 年糕 ， 韩国 人 一般 都 喜欢 吃 的 菜 之一 。
第二个 是 土司 ， 芝士 培根 金枪鱼 土司 ， 这 也 很 简单 。
但 在 国家 的 支持 下 ， 他们 开始 重新 建筑 。
由于 韩国 人民 想 保修 原来 的 样子 ， 所以 保修 的 时间 很 长 。
在 冬至 吃 的 红豆 粥 里 窝 聚 着 新年 一路平安 、 恶气 被 驱赶 的 心愿 。
把 面团 和 盐 放入 蒸着 的 红豆 粥 里 。
很久以前 ， 寺庙 里 曾 有 闻名 的 一干尊 佛像 和 一座 佛塔 。
寺内 还有 新罗 时代 石匠 们 雕刻 的 许多 美术品 。
很久以前 ， 63 座 大厦 占 韩国 最高 的 大厦 。
因此 63 座 大厦 到 现在 深受 游客 和 韩国 市民 的 爱护 。
糖醋 饺子 的 最 重要 的 部分 就是 做 酱 。
牛 排骨汤 源于 韩国 以前 做 的 先农 祭祀 。
参 鸡汤 在 韩国 是 一道 非常 著名 的 菜肴 。
做 参 鸡汤 时 需要 的 材料 比较 多 ， 就是 小鸡 1 、 糯米 1 杯 、 水 参 、 枣 6 个 、 松子 仁 6 颗 、 人参 1 支 、 栗子 6 颗 。
东方明珠 塔 是 景色 美丽 即 代表 上海 的 著名 现代 建筑 。
8. 把 刚 做好 的 作料 均匀 地 抹 在 每片 白菜叶 上 。
裙带菜 汤越 煮 越好 。
其中 之一 就是 比萨斜塔 。
韩国泡菜 所取 的 原料 都 是 新鲜 的 各种 蔬菜 。
据 信 他们 让 成千上万 的 工人 推 着 石块 爬 上 斜坡 ， 可惜 的 是 印加人 并未 掌握 文字 的 技巧 而 没有 留下 任何 描述 文字 。
豆浆 石花菜 或者 豆浆 都 是 本来 不 放糖 ， 这 是 南方 料理 的 特色 。
我 要 介绍 一款 减肥 食品 — — 鸡胸肉 海带 汤 的 做法 。
那天 在 大部分 的 新闻 上 的 题目 就是 ： “ 欢迎 我们 的 第一号 国宝 ， 崇礼 门 回来 ！ ”
听 了 我 的 介绍 ， 你们 觉得 怎么样 ， 对 泰式 炒面 了 吧 。
因为 在 北大 里 有 很多 留学生 ， 所以 北大 想 建立 留学生 公寓 。
学校 应该 赶快 想尽方法 为 外国 留学生 提供 宿舍 。
我 个人 觉得 学校 是 一个 留学生 的 网站 。
每年 举行 一次 留学生 运动会 。
我 希望 你们 管理员 找 一 找 缓和 这个 问题 的 办法 。
第二天 ， 我 有事 出门 ， 发现 电梯 里 还有 昨天 室友 说 的 吐 。
我 希望 您 和 全体 工作人员 负 起 责任 ， 应该 不让 人们 在 宿舍楼 内 抽烟 。
而且 他们 拿 着 照相机 随便 进来 学生 的 房子 拍照 。
每层 墙上 都 明显 贴着 “ 禁止 吸烟 ” 的 标志 ， 但 满屋子 都 是 烟味 。
要 形迹 不准 的 陌生人 应该 提高警惕 ！
我 想 说 的 是 关于 留学生 宿舍 安全 的 问题 ， 尤其 是 “ 勺园 ” 。
我 这个 星期二 早上 ， 起床 以后 ， 为了 去 洗手间 出 我 个人 的 房间 。
所有 住 勺园 的 留学生 都 担心 房子 问题 。
但 我 发现 很多 同学 还 没 去过 其它 的 地方 旅游 。
首先 ， 办 一个 ‘ 中文系 旅行团 ’ 。
现代人 在 所有 的 方面 ， 都 有 很多 事 要 和 别人 联系 。
说实话 ， 我 几天 不能 入睡 ， 是因为 有时 住 上层 的 人 吵 得 很 ， 有时 住 前房 的 人 非常 嘈杂 。
对 留学生 来说 ， 要 花 很多 的 钱 。
首先 ， 房间 不 太 大 ， 进去 三四个 人 的 时候 ， 没有 坐 的 位置 。
很多 人 只用 这 两个 洗衣机 。
我 感觉 好像 韩国 的 大学 生活 一样 比较 舒服 。
与 平时 不同 的 是 ， 我 在 电邮 里 感到 不安 ， 电 递 突然 开始 上下 摇摆 。
我 认为 ， 对 贵 宿舍 的 电 递 要 进行 专门 的 修理 。
然而 ， 有些 人 就 迷惑 于豪楼 大厦 。
四 、 在 房间 里 安静 。
你们 应该 不 犯罪 。
大学 生活 在 外边 ， 身边 没有 父母 ， 只有 我 一个 人 生活 。
但 由于 很多 战争 ， 有 的 建筑物 消失 了 。
真 不幸 的 是 ， 2008 年 2 月 10 号 有 一个 人 放火 了 。
正门 的 两侧 原来 有 城郭 ， 但 现在 不 存在 了 。
而且 石花菜 本来 是 卡 各里 低 的 健康 食品 。
把 豆浆 倒 进 石花菜 上面 。
煮 石花菜 ， 水 开 了 之后 ， 用 中 低 火 煮 了 一个 小时 以上 。
黄豆 要 在 前夕 洗完 水泡 。
裙带菜 既 营养 丰富 ， 又 具有 降低 血压 与 增强 血管 级 的 作用 。
肉 熟 后 ， 把 用 酱油 拌 的 裙带菜 放入 锅 内 ， 再 加 香油 一起 炒 。
把 裙带菜 洗净 ， 泡透 大概 20 分钟 ， 撕成 小 块 。
可谓 古代 文化遗产 极多 的 寺院 。
一般 的 男人 都 不会 做饭 、 采摘 ， 只有 少数 会 做 而已 。
因此 人们 为了 尝试 地道 的 安洞 炖鸡 的话 必须 要 去 安洞 。
然后 修理 别的 材料 。
佛国 寺 表达 出 了 新罗 人 的 信仰 和 愿望 。
然后 把 鸡块 用 餐厅 纸 擦掉 。
把 鸡肉 要 切块 ， 然后 在 鸡肉 上 的 肥肉 都 要 拿到 。
博物馆 外面 的 环境 跟 博物馆 的 风格 非常 融洽 。
排骨汤 里面 的 铁分 ， 维生素 b 有助于 血管 ， 甚至 能防 衰老 ， 对 皮肤 也 很 好 。
锅 开 之后 ， 放入 事先 准备 好 的 萝卜 ， 人参 ， 和 大葱 ， 生姜 末 和 蒜泥 一道 。
当 牛肉 排骨 煮 了 一段时间 之后 ， 用 快子 插 一下 牛肉 ， 检查 煮熟 了 没有 。
它 是 朝鲜 建国初期 为 防御 外敌 建筑 的 城墙 。
还有 一种 说法 ， 日语 的 “ 豆 ” 和 “ 魔目 ” 、 “ 魔 灭 ” 都 是 谐音 ， 所以 大豆 可以 灭 魔鬼 。
这 是因为 把 附近 的 祸气 和 魔鬼 等等 的 坏东西 集中 在 神社 里 ， 神社 能 不能 让 它们 随便 胡闹 ， 保护 神社 附近 的 老百姓 。
节分 时 ， 我们 吃 的 鱼 ， 卷 寿司 ， 报 大豆 。
我们 认为 ， 变 季节 的 时候 会 发生 邪气 ， 所以 要 把 邪气 灭掉 。
这样的话 ， 下 一年 的 幸福 会 来到 自己 身上 。
因为 那 时候 月亮 是 满月 ， 泰国 正是 河水 高涨 ， 正是 月儿 清辉 的 美好 季节 。
以前 是 为了 供奉 印度 的 主神 三位 有 大梵天 、 大自在天 与 妙天 。
可 对 我们 泰国人 来说 举行 水 灯节 的 活动 最 重要 的 是 赔罪 水女 。
企业 在 招聘 时 的 条件 也 存在 门槛 过 高 的 现象 。
可 有 多少 机率 他 或是 她 已经 在 稳定 的 工作 生活 呢 ？
职 场上 求职 竞争 越来越 激烈 ， 即使 大学 毕业生 也 频频 面临 失业 危机 。
随着 失业率 的 连年 上升 ， 现在 美国 全国 失业率 总 人数 已 达到 77 ## 0 万 。
现今 ， 很多 大学 毕业生 开开心心 地 从 大学 门口 走 出来 ， 就 遇到 了 意想不到 的 困境 — — 就业 问题 。
要 缓解 就业 问题 ， 我 认为 应该 做到 这 几个 方面 。
在 4 年 的 大学 生活 中 ， 有 的 大学生 光顾 着 怎么 用 轻松 的 办法 拿到 学位 。
所以 ， 上 大学 不是 为了 就业 能 有个 很好 的 跳板 。
尤其 中小企业 ， 追求 实用 和 低成本 ， 不 愿 承担 新人 的 在 岗 费用 ； 更 有着 缺乏 现代化 管理 方式 。
据 某一 资料 提到 过 ， 原 国家文物局 长得勒 先生 曾 提出 过 ： 最近 出现 不 经 文物部门 审批 就 擅自 把 文物保护 范围 内 的 土地 或是 带有 文化 遗址 的 土地批租 转让 给 外商 的 事情 。
传统 代表 着 民族 的 智慧 ， 这种 现象 尤其 是从 文物 中 ， 我们 可以 看到 先人 的 智慧 。
甚至 ， 两个 洗衣机 中 的 一个 被 破坏 了 。
我 希望 你们 贵部 能 接纳 ， 请 你们 考虑 增加 洗衣机 的 数量 而且 改善服务 态度 。
他 竟然 说 那 不是 他们 的 问题 。
我 认为 我们 有 权利 提出 我们 的 意见 。
在 那 时候 余 司令 流下 的 不仅 是 红红的 血 ， 还有 两行 泪水 也 是从 他 坚硬 的 脸上 流下来 的 。
在 《 天龙八部 》 中 马五德 虽然 并 不是 主角 ， 但 金庸 对 他 的 描写 也 很 清晰 。
其中 也 有 正面 描写 ， 也 有 通过 侧面 描写 的 。
到 了 后来 段誉 被 打 ， 文章 写 到 “ 马五德 心中 不忍 ， 抢过去 伸手 扶 起 ” ， 这 是 心理 描写 和 动作 描写 。
对 战士 背上 的 创伤 感到 羞耻 。
陈光杰 的 身体 连 说完 话 前 都 已经 倒下 了 。
段誉 看 了 看 少女 的 华丽 武功 ， 一眼 就 爱 上 了 少女 ， 心里 想 怎样才能 得到 她 的 好感 呢 ？
那 姑娘 根本 就 对 左子穆 不 害怕 。
少女 的 那 黑色 皮肤 渐渐 变白 。
这时 从 窗外 传来 了 一位 秀丽 的 男生 。
他 脸色 变 红 ， 对 她 大声 喊 ： “ 赶紧 下来 ！ 要不然 我 就 把 你 分成 两块 儿 ！ ”
它们 像是 一队 训练 的 精锐 军队 。
左子穆 看 了 死 过去 的 光杰 ， 冲过去 ， 大喊 ： “ 光杰 ， 打起精神 来 ， 打起精神 来 。
他们 开始 对段 誉 产生 好奇 ， 不知 为何 段誉 如此 地 狂 ， 如此 地 胆子 那么 大 。
段誉 大吃一惊 地 瞧 了 在 梁 上 的 少女 ， 便 向 少女 表示感谢 的 动作 。
众人 虽 惊奇 少女 的 出现 ， 但 注意力 很快 又 回到 这 年轻 弟子 身上 。
贵 公司 对于 外国 工作人员 的 照顾 非常 好 。
如果 有 时间 请来 参加 本次 活动 。
若非 不是 贵 公司 可能 很 难 学 得到 。
在 贵 公司 给予 支持 下 我 有 了 充分 的 信心 。
开始 之前 ， 我 学会 了 多方面 的 知识 ， 做好 了 精神 准备 。
老师 们 这 一年 当中 为 中文系 和 我系 的 同学 们 竭尽所能 。
当做 计算机 作业 的 时候 ， 我会 毫无 困难 地 完成 作业 ， 我 想 这 离不开 李先生 及 各位 的 帮助 和 表扬 。
但是 在 老师 们 的 悉心 关怀 和 孜孜不倦 的 教诲 下 ， 我 慢慢 了解 了 研究所 的 工作 。
现在 我 已 回到 北京 的 学校 ， 已经 完成 了 学生 生活 。
但 更 令 我 感谢 的 是 贵 公司 给予 我 的 鼓励 与 帮助 。
贵 公司 收到 我 的 联系 之后 ， 立刻 派遣 有关 部门 的 主任 和 律师 ， 引起 当地 警察 的 合作 。
希望 这次 晚会 时 ， 同学 与 老师 都 能 有 美好 的 回忆 ！
本人 在 暑假 期间 在 贵 公司 学习 ， 事务 能力 增加 了 很多 。
4 月 3 日 ， 我 在 网上 开始 找能 实习 的 公司 ， 然后 和 领导 见面 ， 这时 ， 虽然 我 是 实习生 但 他 很 热情 。
中文系 的 各位 老师 都 对 这 一年 的 中文系 作出 了 很大 的 贡献 。
现在 我们 留学生 跟 老师 们 交流 的 机会 太 少 了 ， 而且 我们 有 很多 问题 要 向 老师 问 。
我们 非常 感动 职员 们 的 态度 。
本人 是 在 贵 公司 的 一名 实习生 。
那时 ， 李经理 全心全意 地 教导 我 ， 而且 他 带领 我 去 熟悉 周围 的 环境 ， 很 热情 地 对待 我 。
在 飞行 过程 中 ， 张 小姐 和 刘先生 不时 来 我 身边 看护 ， 对 我 的 关怀 无微不至 。
中国 语言文学 可谓 一种 代表 中国 的 文化 ， 并且 北京大学 中国 语言 文学系 的 历史 非常 悠久 。
6 月 20 日 ， 我 初次 来到 贵 公司 ， 因 我 的 小 失误 影响 了 贵 公司 的 重要 合同 ， 但 贵 公司 的 王经理 并 不 向 我 指责 。
您 在 语言 研究 以及 日常用语 方面 有着 极大 的 成就 。
本人 在 贵 公司 实习 了 两个 多月 ， 此 时间 经历 了 许多 新鲜 的 事情 。
我 在 超市 里 工作 是 第一次 ， 所以 我 工作 前 很 害怕 ， 工作 的 速度 也 很慢 。
工作 内容 ： 做菜 ， 能 从事 法国菜 的 人 优先 考虑 。
在 贵 公司 实习 学期 ， 我 得到 您 的 关心 和 爱护 使 我 学到 很多 东西 。
我 感到 好像 爸爸 的 关心 一样 温暖 ， 而且 很 感动 。
伤心地 哭 时 ， 您 安慰 我 告诉 我 在 公司 里 做事 需要 注意 细心 一点 。
我们 系 留学生 热衷 地 邀请 您 参加 我们 的 大赛 并且 任 评委 一 职 ， 给 我们 点评 我们 在 汉语 中 存在 的 问题 以及 建议 。
每当 经历 一些 问题 的 时候 ， 都 会 想起 您 对 我 的 忠告 ， 使 我 很快 地 克服困难 。
面试 要求 ： 流畅 的 说 北京 话 和 有 一点 法语 基础 的 厨师 优先 。
中秋节 时 一般 韩国 人 都 回 自己 的 故乡 去 见 父母 。
由于 中国 风俗 的 影响 ， 韩国 人 也 有 扫墓 的 风俗 。
他们 中秋节 时 把 收获 的 谷物 中 的 一部分 ， 然后 捆 一捆 。
每年 韩国 人 都 应该 意识 到 这 一点 。
中秋节 时 有 好多 韩国 的 风俗 ， 其中 我 介绍 几个 。
春节 代表 的 食物 是 年糕 汤 。
春节 是 韩国 中 最大 的 风俗 ， 所以 ， 每个 人 都 有 特别 的 关心 。
圣 露西 是 一个 以 仁爱 闻名 的 圣徒 。
越来越 强 的 是 女生 们 做 的 团体 游戏 。
中秋节 晚上 洗碗 完 后 望月 出来 时 ， 年轻 的 夫妇 们 在 宽坦 的 地方 一起 拉 着手 旋绕 。
开始 按 慢慢 的 节奏 跳舞 ， 以后 节奏 越来越快 ， 人们 的 快乐 也 越来越 强 ， 这 就是 强调 水 越来越 多 的 特征 。
在 北朝鲜 玩 ‘ 火 游戏 ’ 的 时候 让 孩子 们 在 栗子 树 下面 着火 ， 打 栗子 树 。
元宵节 的 来源 在 “ 三国 遗事 ” 。
韩国 的 元宵节 有 这么 多 的 意义 ， 而且 能 跟 邻居们 团聚 。
十二月 是 瑞典 一年 中 黑夜 最长 的 白天 之一 。
现代化 不是 一件 坏事 ， 但是 世界 各处 都 有 一样 的 摩天大楼 、 一样 的 道路 。
因此 人们 要 认识 到 ， 要 学会 保护 一些 好 的 传统 ， 发扬 民族 的 精神 。
法国巴黎 是 一座 具有 独特 魅力 的 城市 。
但是 社会 的 高速 发展 导致 了 损坏 文化遗产 。
损坏 的 文化遗产 不能 恢复 其 原来 的 价值 。
如果 我们 为了 社会 的 发展 损坏 了 一个 文化遗产 ， 以后 可以 再 建造 一个 跟 它 相似 的 建筑 。
对 一个 国家 社会 的 发展 和 保护 文物 都 是 很 重要 的 。
所以 人们 想到 了 放慢 城市 发展 。
随着 科学 、 信息技术 的 发展 ， 城市 发展 与 文化 保存 之间 出现 了 冲突 。
就 像 现代人 到处 留言 到处 做 纪念 一样 ， 我们 的 祖先 必然 也 是 希望 自己 存在 过 的 证据 。
历史 上 曾经 出现 过 的 几次 世界 大 变动 都 是 在 类似 的 环境 下 出现 的 。
孔子 认为 没有 稳定 的 文化 基础 ， 就 没有 发展 。
现在 所 流下 的 文物 在 自然 的 法则 下 无法 逃脱 最终 毁掉 命运 。
那 混乱 的 场景 中 ， 少女 已经 到 了 段誉 的 后边 。
交流 ： 指 的 是 家长 要 保持 一个 与 孩子 交流 ， 避免 长期 后 家长 和 孩子 相处 变得 尴尬 。
她 既有 教养 又 有 才能 。
他 在 出 生于 好 家庭 后 受到 良好 的 家庭教育 ， 甚至 他 喜欢 读书 、 学习 ， 全力以赴 地 学习 。
家庭教育 对 孩子 的 成长 有 这么 大 的 影响 ， 所以 我们 要 知道 父母 是 孩子 的 镜子 。
在 这 时刻 最 需要 的 是 既 不是 事 大 主义 ， 又 不是 国粹 主义 ， 而是 拥有 文化 相对主义 的 态度 。
希望 所有 的 父母 都 能 重视 家庭教育 环境 ， 创造 良好 的 家庭 气氛 。
家庭教育 是 个人 在 心里 还有 脑子里 永远 内含 的 ， 因此 父母 得给 孩子 正确 的 家庭教育 。
一个 孩子 在 很 富有 的 家庭 情况 下 长大 ， 而 没有 受好 正确 的 家庭教育 。
人们 总是 一味 地 为 地 需要 光明 ， 而 一味 地 避开 黑暗 。
勤奋 刻苦 ， 不折不挠 的 精神 是从 黑暗 走向 光明 的 人 的 必要条件 。
时间 过 了 不久 ， 和尚 觉得 口渴 无法忍受 ， 但是 他 起来 意外 地 摸到 身旁 有 一滴水 。
背 生词 并 不难 ， 这 取决于 自己 的 心态 和 怎么 复习 。
光明 很 短暂 的 瞬间 。
于是 每个 人 选择 对 自己 合适 的 记忆 生词 的 方法 ， 或者 创造 出新 的 背 生词 的 方法 。
背 完 生词 之后 ， 再 读 课文 ， 那么 更 容易 生词 的 用法 和 意思 。
背 生词 时 ， 不要 只 背单词 ， 如果 背 完 生词 还要 学会 怎么 应用 。
无论如何 语言 是 由 单词 构成 的 。
但 其实 我 同意 他 的 意见 ， 但 我 不 爱 复习 。
虽然 每个 人 有 不同 的 记忆 习惯 、 记忆 方法 、 记忆 方法 ， 但是 用 自己 的 方式 ， 还是 会 遇到困难 ， 试一试 上面 的 方法 。
人 的 脑子 是 无限 的 ， 虽然 每个 人用 不同 的 办法 来 记住 东西 ， 但 这 记忆力 谁 都 不 知道 。
主要 的 原因 是因为 人 对 光明 和 黑暗 有 不同 的 意义 和 感性 。
我 上 中学 的 时候 还 记得 美术 时间 ， 老师 教 我们 明 和 暗 关系 的 重要性 。
如果 我们 认识 黑暗 ， 我们 可以 把 光明 变成 更 明亮 的 明星 。
如果 不 读书 ， 那么 将来 因为 没 读书 做不了 很多 自己 想要 做 的 事情 。
大学 ， 表面 意义 上 来讲 就是 每 一个 学生 享受 更多 的 、 更 高等教育 的 地方 。
再有 ， 即使 有些 人 想 好 不 读书 ， 直接 进入 社会工作 ， 在 这样 的 盲目 的 选择 下 ， 我们 能 为 社会 做出 什么 呢 ？
读书 真的 无用 吗 ？ 我 十分 否定 这个 观点 。
学生 应该 学习 。
简单 的 工作 一定 不能 安心 。
大家 不用 一点 读书 的 时候 ， 就 会 发生 刚才 我 说 的 样子 。
为了 经济 发展 ， 老人 不能 只 做 工作 ， 应该 需要 年轻人 。
但是 年轻人 工作 时候 并 不 困难 。
这话 说 的 人 只 想 个人 。
那 社会 不能 发展 ， 应该 视 集体利益 为 个人利益 。
我们 只有 通过 书 ， 才能 体验 那 时代 的 生活 。
但是 他 读完 关于 美国 的 书 以后 ， 会 体验 美国 的 生活 。
那 时候 我 读 那本书 之后 ， 开始 捐钱 给 非洲 孩子 。
书 不但 给 读者 很多 知识 和 间接经验 的 机会 以外 ， 还给 读者 很大 的 影响 。
或者 觉得 大学 时学 的 内容 和 实在 工作 上用 的 知识 之间 有 很大 的 差别 。
我们 还 关注 现在 大学生 就业 压力 比较 大 的 时候 真的 没用 。
通过 很多 时间 ， 在 人 的 看法 上能 表现 出来 。
读书 一点 用处 都 没有 ， 对 我 来说 ， 确实 是 错 的 。
因为 得 准备 就业 之 忙 ， 所以 时间 能 读 只是 一种 借口 。
现在 找 工作 也 很 难 ， 我 估计 以后 也 会 越来越 难 。
有人 说 读书 的 那 段时间 可以 跟 找 工作 有关 的 事 做到 。
最 重要 的 是 自己 主动 选择 自己 想读 的 ， 谁 也 不能 强迫 别人 读书 。
这样的话 ， 倒 读书 给 我们 的 乐趣 渐渐 少 了 。
我 觉得 读书 利于 找 工作 时能 减少 压力 ， 同时 增长 知识 。
经过 是 很多 研究员 和 员工 的 努力 ， 结果 就是 会 享受 更 方便 的 生活 环境 。
即使 大学毕业 后 会 遇到 就业 难 。
但 从 人类 会 笔记 以后 ， 生活 环境 跟 以前 比不上 丰富 了 。
我们 的 人生 中 ， 当然 会 面临 各种各样 的 情况 。
所以 我们 人生 中 会 面临 各种各样 的 困难 的 问题 。
我们 以后 看 什么样 的 书 最好 呢 ？ 我们 要 选择 好 的 书 。
虽然 学历 木是 完全 证明 一个 人 有 能力 。
但是 轻视 读书 是 错 的 。
读书无用 论 是不是 不 对 。
这个 情况 下 就 出来 了 读书 的 知识 。
我 觉得 大学生 开始 不 知道 自己 的 兴趣 。
可是 我 对 这个 观点 站不住脚 。
可是 书 只能 花 100 元 左右 ， 可以 尝试 名人 的 知识 ， 这 多么 好 啊 ！
我 以前 是 不 爱 读书 的 人 ， 觉得 现在 人们 想 的 一样 。
当时 面临 的 问题 ， 应该 用书 来 解决 ， 克服 。
现在 很多 人 认为 大学 只是 为了 找 工作 而已 。
为了 学生 们 的 安全 ， 请 遵守 下面 写 的 几些 事情 。
特别 是 大学生 的 就业 难 是 最近 越来越 严格 。
大学 会 是 一个 开阔 人际关系 的 场所 。
还有 最近 大学 为了 缓解 学生 的 就业 难 ， 跟 一些 公司 结了婚 。
还有 书 可以 让 人 拥有 一个 自己 的 思想 。
甚至 母语 也 能 通过 读书 学习 。
读书 不但 给 人 知识 ， 而且 给 人 自己 的 思想 或者 意见 等 事物 。
但是 光明 只是 短暂 的 ， 黑暗 总是 追 我们 。
黑暗 也 像 光明 一样 具有 能力 。
我 一个 人 住 在 房间 里 ， 偶尔 会 突然 停电 。
眼前 突然 一片 黑暗 ， 我 没想到 会 那么 害怕 。
如果 身边 有 朋友 或 同屋 的话 ， 我会 不 那么 害怕 。
黑暗 没有 什么 声音 ， 直接 过来 ， 模 模模糊糊 的 ， 什么 都 想不起来 了 。
只有 这样 ， 才能 让 孩子 在 爱 中 健康成长 ， 才能 感受 孩子 的 内心世界 和 思想 ， 才能 组成 和睦 的 家庭 。
这样 的 父母 能 给予 孩子 更多 的 情感 温暖 与 理解 ， 可以 促进 儿童 道德感 、 适应能力 。
上学 之后 ， 也 一直 到 独立 ， 甚至 独立 之后 ， 受到 父母 的 教育 和 影响 。
因此 家长 不要 只顾 学业 方面 ， 忽视 道德 方面 。
有 的 孩子 在 打骂 下 成材 ， 有的是 在 关怀 里 成材 ， 为 孩子 创造 一个 对 孩子 最合适 的 健康 、 和谐 、 温馨 的 家庭 。
那 我们 要 知道 在 家庭 对 孩子 怎样 教育 ， 对 孩子 的 成长 有 什么 好处 ？
以色列 虽然 国家 比较 大 ， （ 美国 、 法国 等 ） 势力 小 ， 但是 他们 已经 把 诺贝尔奖 获得 了 ， 人口 已经 超过 了 20 万 。
市教 教研室 对 25 万人次 进行 了 大型 调查 ， 通过 对 “ 中小学生 英语 能力 展示 活动 ” 、 “ 近两年 中 高考 各学科 成绩 反馈 ” ， “ 双语学校 部分 家长 调查 ” 等 12 个 项目 的 观察 和 分析 。
在 这个 年龄段 开始 学习外语 ， 不会 与 母语 冲突 效率 极 高 。
在 与 别人 交流 中 ， 表现 出 适应 和 积极 行为能力 。
孩子 会 通过 家庭教育 ， 学到 基本 的 生活习惯 和 生活 能力 。
晚上 8 点 之前 就寝 的 孩子 第二天 自己 起床 63.1 % ， 吃 早饭 的 时候 是 86.9 % 。
而且 ， 在 儿童 时期 养成 的 基本 习惯 对 以后 的 成长 发展 有 颇 大 影响 。
有 了 孩子 后 ， 父母 不仅 为了 努力 工作 赚钱 ， 还 为了 孩子 的 将来 ， 为了 孩子 的 未来 ， 应该 意识 家庭教育 。
也 能 成为 在 国 现在 社会 里 生存 的 一个 重要 的 武器 。
最后 我 再 一次 证明 我 的 观点 ： 学习外语 不会 影响 母语 的 退化 。
我 虽然 没有 在 母语 的 环境 里 ， 但 我 相信 好 的 学习 方法 会 让 汉语 和 母语 一起 提高 。
他 接受 采访 时说 自己 的 成长 过程 当中 ， 不管 是 在 物理 方面 还是 在 心理 方面 ， 都 有 了 非常 大 的 困难 。
不同 的 家庭教育 影响 着 孩子 的 性格 、 学习 及 将来 的 成长 道路 。
这 就是 为 培养 他们 成为 歌手 提高 物质条件 和 可能性 。
有 的 孩子 生来 就 观察 ， 这 就是 为 他们 学 绘画 ， 等等 。
这次 有 了 这个 计划 ， 我们 在 网上 找到 了 印度 咖喱 的 做法 。
这 是 个 很 幸运 的 事情 ， 因为 我 小时候 学 过 一点儿 摩登 芭蕾 。
但是 ， 小时候 学 过 ， 后来 完全 忘记 了 东西 ， 把 它 重新学习 ， 真不容易 。
每个 人 做 一 、 两种 点心 ， 但是 也 发生 了 没想到 的 事情 。
我 从小 自己 学会 做 点心 ， 现在 已经 习惯 了 ， 做 点心 的 要 注意 的 几个 地方 ， 现在 都 无意识 地 做 。
虽然 这次 有 了 不少 麻烦 ， 但是 起来 之后 看到 大家 发来 的 短信 ， 知道 了 大家 都 很 满意 ， 我 也 很 高兴 。
吃 、 玩 到 晚上 十点 多 就要 赶快 坐地铁 回去 了 ， 我 坐 超过 海淀 黄庄 ， 坐到 巴沟 。
这 也 教 我 以后 要 小心 不要 马虎 ， 不要 玩 手机 玩 得 不知不觉 就 会 发生 笨蛋 的 事情 。
我 一 开始 以为 他 打电话 是因为 想 过来 找 我 ， 但是 他 只是 问 了 我 五道口 哪里 有卖 的 名牌 帆布鞋 。
为什么 这个 时候 ， 最 不想 早起 的 时候 ， 早点 起床 不可 ？
我 明白 ， 是因为 要 办 签证 ， 而且 这 很 重要 ， 办 得 越快越好 。
刚好 办完 签证 的 手续 ， 我 出 办公室 的 时候 ， 从 姐姐 来 了 个 电话 说 ： 在 外边 下雪 了 。
这周 我 一直 没有 干劲 的 原因 ， 都 是因为 这 雪害 我 的 ！
不知 为什么 从 周三 开始 天气 越来越 暖和 了 。
我 走向 前 ， 问 她 是否 发生 了 什么 事情 ， 她 显得 那么 不 开心 。
她 说 她 将 自行车 停放 在 地下 停车场 ， 过 了 几天 回去 取 ， 发现 自行车 已不 在 原位 。
希望 明天 的 天气 将 会 是 艳阳高照 ， 但愿 时间 能 抹 淡 我 心中 的 伤痛 。
不过 庆幸 我 在 北京 认识 了 一群 非常 要 好 的 朋友 ， 使 我 在 北京 的 日子 不会 过 得 那么 慢 。
在 上 一 学期 的 阅读 与 写作 （ 初级 ） 课 上 写 一篇 作文 时 ， 我 发现 用 汉语 写作 自由自在 地 表达 自己 的 想法 感到 很 困难 。
在 这 两年 的 时间 里 ， 我 一句 话 也 没有 说 过 、 听 过 、 写 过 汉语 。
他 也 是 韩国 人 ， 现在 在 清华大学 以 法学 为 专业 。
当 我 刚 来到 中国 时 ， 他 对 我 在 中国 学习 方面 、 生活 方面 等 方面 帮助 了 很多 ， 在 他 的 帮助 下 ， 我 可以 考上 了 北京大学 。
在 这 一年 的 时间 里 ， 我们 只能 通过 网络 短信 联系 。
我 通过 变色 的 日记 发现 的 十多岁 的 我 ， 孤独 、 可怜 。
没有 回忆 的 人生 ， 太 枯燥 了 。
因为 去年 我 当 完 兵役 之后 ， 发生 了 交通事故 ， 我 每天 得服 三次 的 药 。
在 上个 学期 ， 我 身体 状态 不 稳定 ， 所以 在 寒假 的 时候 去 医院 ， 医生 问 我 怎么办
然后 跟 我 的 父母 联系 ， 写日记 ， 去 睡觉 。
我 刚 洗完 米饭 ， 把 米饭 放在 电饭锅 里 。
我 把 我家 人 的 照片 放在 桌子 上面 ， 每次 看到 爸爸妈妈 的 笑容 ， 就 感觉 到 他们 的 温暖 。
对 我 来说 ， 上 个 学期 是 非常 吃力 的 学期 。
今天 晚上 对 我 来说 是 一个 幸福 的 晚上 。
因为 才 感觉 到 这家 是 我 的 家 。
到 了 高中毕业 后 我 就 想 去 与 文学 有 关系 的 地方 ， 所以 我 现在 在 中文系 读书 。
“ 你 正在 干什么 呢 ？ 读书 吗 ？ ”
在 韩国 ， 因为 一家 有 多个 儿子 ， 就 意味着 ， 大多数 的 人 都 至少 有 一个 兄弟姐妹 ， 因此 没有 很多 机会 和 表姐 或 表哥 等 的 亲人 很 难 沟通 。
现在 我 的 “ 出国 ” 不 一定 只有 告别 ， 也 有 了 任务 感 和 能够 见到 校园 里 的 朋友 等 的 幸福感 也 包括 在 里面 。
我 特别 希望 有 一天 给 家人 、 朋友 、 亲人 等 微笑 着 和 他们 说 “ 再见 ” 。
碧蓝色 的 天空 ， 青绿色 的 草地 ， 以及 粉红色 的 大家 的 脸颊 都 融为一体 ， 令人 更为 兴奋 。
从 古老 的 书籍 中 散发出 的 一股 书 味儿 清醒 了 朦胧 的 头脑 ， 记得 大概 三个 月前 也 闻到 过 的 味道 。
是 的 ， 日记 来 抒发 出 我 的 感情 是 一件 多么 值得 去 做 的 事情 。
早上 一 起来 ， 第一 感觉 就 有 一点 担忧 。
在 上课时 的 我 总会 感到 无奈 。
我 的 课表 被 很多 课题 填满 了 ， 当时 的 我 心中 充满 了 强烈 的 意志 。
这样 的 人 一般 很 难 适应 一个 社会 ， 结果 过 着 自己 不 幸福 的 日子 。
虽然 早期 留学 不 一定 挺贵 的 ， 但是 基本上 非常 贵 。
“ 以貌取人 ” 这个 成语 来源于 孔子 的 弟子 ， 一个 叫 宰予 ， 一个 叫 子羽 。
从 “ 以貌取人 ” 的 意思 以及 上面 的 典故 来看 ， 我 更 同意 以貌取人 绝对 不好 的 。
如果 我们 目光如豆 ， 一 看到 他人 的 外表 就 立即 判断 他 的 品行 ， 这样 一定 会 导致 不妙 的 后果 。
然而 ， 有些 人 虽然 有 天赋 却 因为 自己 不 勤奋 ， 而 最终 却 变成 平凡 甚至 平庸 的 人 。
可是 我 跟 朋友 们 一起 吃 午饭 的 时候 ， 他们 给 我 推荐 去 观光 798 艺术 区 。
所以 我 吃 完 后 就 在 网上 查 有关 798 艺术 区 的 资料
在 那儿 有 我 期待 的 所有 的 东西 ， 很 美丽 的 美术品 、 咖啡厅 、 好看 的 路 等等 。
六个月 前 我 来到 了 中国 。
因为 中国 的 饮食 不 合口味 ， 空气 不好 ， 但是 最大 的 问题 是 我 的 汉语 水平 不 高 。
之后 我们 进 了 故宫 。
其实 这 不是 我 第一次 去 故宫 ， 所以 我 有点儿 乏味 ， 不过 我 看到 太和殿 的 时候 ， 我 再次 感叹 不已 。
从 我 来到 了 中国 以后 ， 已经 过 了 一个多 星期 了 。
这 几天 我 上 了 几节课 ， 去 了 一些 地方 ， 买 了 一些 对 一个 人 住 需要 的 东西 。
从 我 初中 到 高中学生 到 高中 ， 我 最 关心 的 事 是 考入 好 的 大学 ， 所以 我 为了 好 成绩 学习 。
离 毕业 还有 两个 学期 。
我 有时候 觉得 尽管 我 找到 好 的 工作 挣 很多 钱 ， 但是 我 能 幸福 地 生活 。
很久以前 ， 我 喜欢 跟 我 很多 朋友 一起 庆祝 我 的 生日 。
所以 这 几年 我 只 跟 我家 人 还有 几个 好 朋友 一起 庆祝 。
今年 的 生日 ， 我 在 北京 ， 没有 家人 或 至亲 的 朋友 ， 所以 我 打算 过 平凡 的 生日 。
这 真是 愉快 的 一天 。
我 想法 的 方式 改变 了 。
来 北京 以后 我 每天 找 新 的 中国 朋友 ， 在 学校 里 ， 在 微信 上 ， 还有 在 路上 找 新 朋友 。
我 关心 跟 历史 方面 的 事情 ， 所以 跟 他 交流 让 我 感觉 非常 满意 。
刚 到 那边 ， 我会 看到 很多 人 在 卖 香 的 东西 。
学 在 韩国 的 时候 ， 我 学 了 关于 孔子 的 一生 。
今天 我 决定 买 一台 电动车 。
同学 们 吃 了 快餐 还是 街口 卖 的 包子 ， 甚至 有人 只是 吃 了 点 饼干 而已 。
看起来 去 观看 杂技 的 人 中 大多数 就是 外国人 。
那 两个 中 用 草帽 的 演员 们 很 有意思 ， 表演 得 还 不错 。
导游 说明 了 这个 和 那个 ， 我 不是 所有 的话 都 听得懂 ， 可是 比 我 一个 人 来得 更 强 。
我 跟 朋友 们 拍 了 很多 照片 。
我 学 汉语 学 得 不 太 多 ， 所以 我 的 汉语 水平 不太好
前年 我 来 旅游 的 时候 ， 我 只 让 人们 告诉 我 什么 地方 怎么 走 ， 所以 我 觉得 说 汉语 这么 难 。
而且 ， 北京 人 都 太 忙 ， 如果 我 听不懂 的话 ， 他们 好像 会 生气 ， 我 越来越 不 自信 了 。
以前 我 在 韩国 的 时候 ， 我 想 我 可能 会 在 中国 生活 得 很 好 。
从 几天 以前 开始 感觉 身子 冷丝丝 ， 结果 感冒 了 。
我 从 韩国 带 感冒药 ， 但是 好像 没有 用处 。
在 去 宿舍 的 路上 ， 不停 地 咳嗽 ， 脖子 痛 了 。
我 没有 胃口 ， 但是 勉强 地 吃了饭 。
可是 原来 今天 是 韩国 外 大学生 们 一起 去 天安门 观光 的 日子 。
同学 们 回来 以后 ， 他们 很 担心 我 的 身体 。
所以 下课 以后 我 跟 朋友 逛 了 逛 学校 ， 看看 有 什么 同伴 。
我 想 以后 通过 同伴 活动 丰富 地 经验 ， 交 很多 中国 朋友 。
是 8 点 开始 的 。
没 带 口罩 的 有些 朋友 们 特别 后悔 。
那 是 中国 人 在 中关村 参加 的 教会 。
我 很 怕 ， 所以 想 快点儿 回 宿舍 。
但是 我 不想 再 经历 黄砂 了 。
出去 的 时候 ， 我 还 不 知道 今天 有 沙尘暴 ， 所以 我 没 带防 沙尘 口罩 。
在 红桥 市场 我们 游览 了 只有 三十分钟 。
在 中国 留学 的 三年 当中 ， 最 使 我 幸福 的 那件事 ， 就是 当 我 考上 了 北京大学 中文系 的 时候 。
今天 没课 ， 但 因为 要 跟 中国 朋友 学 韩语 ， 要 到 下午 两点 去 魏公村 ， 很 倒霉 电动车 的 电池 没电 了 。
但是 五道口 里 韩国 人 ， 韩国 餐厅 太 多 ， 这些 让 我 感觉 还 在 韩国 。
我 认为 中国 的 人 多 车 也 多 ， 经常 堵车 ， 可能 比较 方便 骑 。
有 以下 事例 ： 北京大学 毕业生 卖 猪肉 ， 清华大学 毕业生 当 出租车 司机 等 。
大学生 就业 难 仅仅 是 观念 上 的 问题 ， 不论是 学生 还是 城市 学生 ， 北京 、 上海 、 深圳 绝对 是 最 具 诱惑力 的 前 三个 就业 地点 。
去年 的 奥运 台风 平静下来 ， 不知不觉 地 ， 冬天 来到 了 我们 的 身边 。
可能 因为 天气 越来越 冷 ， 昼夜 温度 的 差距 很大 ， 因此 跑 未名湖 的 人 也 越来越 难 找 了 。
” 我 认为 这 句 话 理所当然 ， 一无所有 反驳 。
奥运 期间 也 是 一样 ， 每个 网站 迅速 地 传达 新来 的 内容 ， 甚至 某个 网站 播放 现场 情况 ， 如果 在 比赛 当中 ， 我国 的 选手 没 取得胜利 ， 人们 不约而同 地 叹息 而 看 他 成 一种 失败者 ， 这 是 人们 盲目 地 追求 胜利 和 结果 造成 的 结果 。
就 这样 ， 体育 是 跟 生活 很 贴切 的 。
反而 一般 人们 不是 为了 金牌 运动 ， 而是 为了 美好 的 生活 和 自己 的 健康 运动 。
如果 竞争 优先 于 健康 的话 ， 那 就是 体育运动 的 本质 。
我们 得 记住 ， 生活 体育 怀孕 是 奥运冠军 ， 而 不是 只 竞争 培养 出来 的 。
有 的 国家 ， 比如 非洲 的 加内 ， 把 参加 奥运会 看成 已经 成功 的 、 很 有 意义 的 。
我们 也 得 着重于 体育 的 本质 和 体育精神 ， 那 使 人们 把 体育 当作 生活 的 目的 ， 而 不是 竞争 的 工具 的 方法 是 什么 ？ 我们 对 体育 教育 需要 改善 。
让 学生 通过 体育 活动 锻炼身体 ， 使 身体健康 ， 明白 体育 的 本质 才能 让 生活 体育 发展 起来 ， 开除 竞争 优先 与 美好 的 生活 和 健康 的 情况 。
“ 大学生 就业 ” 这 问题 是 在 全世界 各个 国家 都 存在 的 问题 。
在 这件 事情 里 我们 可以 看 出现 存在 的 大学生 就业 问题 。
但是 ， 从 现在 已经 相当 发达 的 社会 来说 ， 不 需要 这么 多 的 人才 。
而且 在 读书 四年 中 没 学会 实务 技术 的 人才 是 更 不用说 了 。
因 数次 来到 的 经济危机 让 大学生 追求 安定 的 职业 ， 虽然 这样 的 职业 不管 自己 专业 和 爱好 ， 但 也 想求 这类 的 职业 。
人们 准确 不 知道 春节 什么 时候 开始 。
秋夕 是 农历 8 月 半个 月 、 8 月 15 日 ， 称为 秋天 的 中心 的 月 ， 还有 8 月 的 中心 的 意思 ， 秋夕 是 韩国 最大 的 、 最好 的 节日 之一 。
圆圈 舞 、 拔河比赛 、 韩式 摔跤 是 韩国 最 具 代表性 的 秋夕 游戏 之一 。
三月初 三 的 起源 没有 详细 的 资料 ， 跟 据 韩国 有名 的 作家 、 诗人 崔南善 ， 记念 三月初 三 的 风俗 从 新罗 时代 已经 有 了 ， 传到 朝鲜 时代 。
人们 经常 说 在 这个 三月 三日 ， 去年 （ 农历 ） 九月九 日 去 了 江南 的 燕子 回来 。
本 餐馆 为 顾客 的 要求 ， 诚招 厨师 1 名 。
本 公司 为 适应 法国菜 增加 的 需要 ， 需 招聘 一位 做 法国菜 的 厨师 。
特别 是 在 法国 的 饭店 工作 过 的 人 优先 。
怀着 孝顺 之 心 关键 付诸实施 。
怀有 孝顺 之 心 是 义不容辞 的 责任 。
女 大学生 们 选择 去 当 “ 职业 军人 ” 有 两大 原因 ， 一 为 失败 的 求职 之后 选择 去 当兵 ， 二 为 再次 挑战 职业 战场 ， 把 “ 军人 ” 成为 自己 核心 的 特征 ， 与众不同 的 经历 来 争取 职业 。
可 不单 要 看 问题 的 正面 ， 还要 看 问题 的 反面 ， 就是 大学生 的 就业 问题 。
那 这些 问题 为何 发生 呢 ， 有 哪些 方案 呢 ？
二 从事 法国菜 。
现在 每逢 端午节 ， 各个 地方 都 开展 有关 节日 的 活动 。
譬如 ， “ 江陵 端午节 ” 很 有名 ， 在 2005 年时 ， 联合国教科文组织 把 “ 江陵 端午节 ” 指定 了非 物质 文化遗产 ， （ 人类 口传 与 无形 绝作 ） 。
在 《 魏志 》 的 韩传里 说明 ： “ 播种 后 ， 马韩 人 拜 祭天 地 ， 歌舞 饮酒 。
以后 在 高丽 时代 ， 高丽 歌谣 《 動動動動動 》 里 记载 ； 人们 为了 祭祀 御 • 厄运 ， 用 菖蒲 水洗 头 、 把 菖蒲 的 根 带 着 、 吃 车输饼 、 草药 糕 、 艾瀚 糕 。
“ 宋干 ” 在 泰语 中意 为 “ 移走 ” 或是 “ 换 地方 ” 表示 去年 过去 ， 新年 来临 。
一般 在 家里 的 活动 是 子女 将 带有 香味 的 水 泼洒 到 年龄 最大 的 人 的 手 或者 脚 ， 表示 尊敬 和 感恩 ； 对于 社区 而言 ， 宋干节 可以 促进 社区 的 团结 ； 大家 可以 参加 娱乐活动 ， 互相 交流 ； 比如 ： 泼水 、 摸粉 、 造沙坛 等 ； 对于 社会 而言 ， 宋干节 可以 加强 民众 对 环境 的 关注 ； 一般 的 活动 是 对 一些 房屋 、 寺庙 、 公共 地区 和 公共 地区 的 清洁 进行 清洁 ； 对于 节日 的 教育 ， 也 是 有 意义 的 ， 因为 对于 人们 来说 ， 节约 也 是 有 意义 的 ， 例如 ： 对于 僧侣 们 来说 ， 节约 、 僧侣 们 、 宗教 等
三 一节 是 为了 继承 三 一 运动 的 独立精神 ， 巩固 了 民族团结 ， 以及 培养 国民 的 爱国心 而 设立 的 纪念日 。
当时 无论 孩子 或 老人 ， 基督教 或 佛教 ， 工人 或 商人 ， 都 参与 这个 运动 宣告 韩国 的 独立 。
据 以前 的 纪录 ， 进行 这项 运动 的 次数 超过 2000 次 ， 参与者 大约 是 200 万 人 。
韩国 的 历史 上 ， 这 独立 运动 的 规模 最大 。
对 我 来说 ， 二零零二年 是 印象 非常 深刻 的 一年 ， 韩国 足球队 在 韩国 世界杯 上 进入 了 四 强 。
就是 上 小学 的 时候 ， 在 一个 雨天 ， 放学 后 跟 朋友 们 踢 一场 球 。
十年 前 在世界上 踢球 最好 的 选手 是 巴西 的 ro ## l
因此 ， 开始 天天 踢足球 。
有 一次 ， 她 的 母亲 通过 电视 的 一个 节目 来说 ， 为了 把 她 培养 成 一名 滑冰 选手 花 了 不少 的 钱 ， 要是 日常 锻炼 的 环境 比 她 好 一点 ， 可以 较 容易 地 出现 第二 ， 第三 的 金融 儿 。
大学 毕业生 人数 不断 增加 ， 有 了 毕业生 向 城市 流动 的 趋势 ， 毕业生 的 期望值 不断 增高 ， 企业 对 人才 的 标准 也 在 变化 。
有 这么 一件 事 让 全 中国 人 目瞪口呆 ， 一位 毕业 北京大学 的 男生 在 市场 里 买 猪肉 。
这件 事 已 是 几年 前 的 事 了 ， 几年 间 出现 了 太 多 类似 这 场景 的 事 ， 名牌大学 毕业生 从事 劳动 工作 。
那么 ， 我们 应 怎么 解决 这 问题 呢 ？
大学生 就业 问题 ， 只有 全 社会 共同努力 才能 解决 。
就业 关系 到 人 的 一生 ， 我们 这些 大学生 ， 应 尽早 了解 就业 状况 ， 对 大学 生活 的 规划 树立 一个 前进 的 目标 ， 使 大学 生涯 更有意义 ， 更 有 帮助 。
使得 许多 公司 财政赤字 ， 不得不 作出 裁员 的 决定 。
据 报道 ， 连 北大 的 毕业生 都 没有 找到 好 的 工作 。
有 一个 人 叫 “ 陆步轩 ” ， 是 在 陕西 长安区 文科 状元 成绩 考入 北京大学 中文系 ， 毕业 后 分配 至 长安区 柴油机厂 工作 ， 后 下海经商 ， 做 过 多种 职业 ， 最后 以 “ 眼镜 肉店 ” 老板 身份 闻名 。
” 北京大学 毕业生 陈生 ， 说完 这 第一句 话 ， 几乎 戒烟 了 。
对 大多数 人 来说 ， 网站 和 招聘会 才 是 最 主要 的 就业 渠道 ， 还 不能 满足 毕业生 的 需求 。
第二个 原因 是 学生 的 期望 过 高 ， 很多 的 大学 毕业生 希望 找 一个 高薪 的 工作 ， 他 毕竟 是 大学毕业 的 ， 找 低薪 工作 有点 丢脸 。
韩国 人 喜欢 的 运动 ， 是 由 奥运会 决定 的 。
现在 呢 ， 父母 把 孩子 落 在 水里 ， 休会 游泳 。
但是 汉字 还是 无法 充分 地 表现 韩语 的 发音 和 朝鲜 民众 的 思想感情 ， 普通 朝鲜 平民 根本 不 识 汉字 ， 世宗 非常 同情 国民 的 处境 ， 作为 一个 想要 发展 民族 文化 ， 推进 国家 独立 的 朝鲜 君王 ， 世宗 大王 开始 苦思冥想 ， 后来 ， 梦想 创造 出 一种 独特 而 易学 易懂 的 朝鲜 本土 文字 ， 让 普通 的 朝鲜 人民 也 可以 轻松 驾 朝鲜 的 语言 。
在 朝鲜 谚文 日 的 时候 韩国 举办 了 一些 活动 ， 比如 做 一些 纪念 世宗 大王 的 活动 。
每年 的 公历 10 月 3 日 是 韩国 的 “ 开 天节 ” ， 是 纪念 韩国 传说 中 的 民族 始祖 璋 君 ， 在 公元前 77 ## 3 年 建立 的 古 朝鲜 的 节日 。
“ 开 天节 ” 本来 在 农历 十月初 三 ， 但 1949 年 改成 了 阳历 10 月 3 日 。
现在 开 天节 慢慢 在 人们 的 记忆 中 消失 ， 人们 不 重视 开 天节 ， 但 开 天节 是 对 韩国 历史 来说 必有 的 节日 。
我 希望 人们 更 重视 开 天节 ， 爱国 ， 一起 享受 各种 活动 。
光复节 纪念 节目 是从 1970 年 开始 总统 来 参加 的 。
可是 在 1974 年 的 光复节 纪念 节目 中 ， 因为 令 夫人 被 暗杀 了 所以 有 了 回 曲折 。
如果 光复节 是 纪念 民族 的 解放 和 独立 时间性 礼仪 的话 ， 对 这个 相应 的 表示 空间 的 纪念 机器 是 独立 纪念馆 。
独立 纪念馆 是 在 1971 年 8 月 15 日 开馆 的 。
跟 这个 相反 ， 象征 日本 的 痕迹 的 是 朝鲜 总督府 建筑 在 1995 年 8 月 15 日 被 拆除 了 。
在 光复节 ， 我们 韩国 人 把 太极旗 放在 阳台 上 ， 表示祝贺 我们 国家 的 独立 和 解放 ， 还有 也 包括 一点点 的 对 光复 前 活着 的 我们 祖先 的 尊敬 。
当时 无论 孩子 或 老人 ， 基督教 或 佛教 ， 工人 或 商人 ， 都 参与 这个 运动 宣告 韩国 的 独立 。
据 以前 的 纪录 ， 进行 这项 运动 的 次数 超过 2000 次 ， 参与者 大约 是 200 万 人 。
韩国 的 历史 上 ， 这 独立 运动 的 规模 最大 。
因此 ， 民间 企业 运动 越来越 扩展 ， 也 成 了 韩国 经济 发展 的 主动力 之一 。
现在 每年 各地 还有 两千 个人 参加 的 “ 赛龙舟 ” 活动 ， 挂钩 草 艾叶 荷包 等 活动 。
简短地 说 ， 光复节 是 为了 纪念 韩 民族 获得 了 解放 与 韩国 独立 的 政府 而 建立 的 节日 。
仅供参考 朝鲜 称呼 为 祖国 光复节 ， 亦 是 朝鲜 的 公立 假日 。
当天 有 诸多 纪念活动 ： 在 首尔 举行 中央 庆祝 式 ； 其他 还 举行 各个 市 道 段位 别 活动 。
韩国 大总统 从 1970 年 开始 参加 光复节 纪念活动 ， 说闲话 ， 1974 年 在 活动 场 发生 了 第一夫人 的 遇刺 事件 ， 有 了 这样 的 曲折 。
四 、 待 有 法国菜 证人 优先 考虑 。
对此 ， 来 分析 出现 大学生 就业 难 问题 的 原因 。
另外 ， 大学 毕业生 对 本身 较高 的 学历 持有 自负 心理 ， 在 找 工作 时 ， 不 从 基层 做起 ， 做事 利己主义 ， 缺乏 忍耐 。
对 大学生 建议 不能 自视 过 高 ， 加强 自己 的 能力 ， 卖 猪肉 的 北大 才子 再 后来 成 了 百万富翁 ， 又 引起 了 广大 人民 的 争议 。
毕竟 ， 职业 不 分 贵贱 ， 最 主要 的 就是 靠 个人 对 自己 的 价值 判断 。
大学生 就业 的 问题 主要 在于 供给 与 需求 的 不 均衡 中 。
最近 经常 播 一些 一流大学 的 毕业生 应聘 到 不入流 的 工作 的 新闻 ， 如 某一 清华大学 毕业生 当了 月 收入 2000 的 保安 ， 甚至 也 有 卖 猪肉 卖 鸭脖子 的 ， 即 我们 接触 到 这种 新闻 的 第一 反应 便是 “ 他们 到底 怎么 想 的 ” 、 “ 有没有 脑子 ? ” 。
《 非诚 勿扰 》 的 主持人 孟菲曾 说 过 偏见 是 由于 人 的 无知 与 愚昧 。
大学毕业 后 ， 就业 问题 有 如下 几种 ： 政府 方面 ， 高校 方面 ， 用人单位 方面 ， 还有 大学生 自身 因素 ， 如 观念 因素 等 。
本 餐馆 最好 是 擅长 法国菜 的 ， 招聘 1 名 厨师 。
新罗 庚璃 王常常 让 两个 公主 参加 织布 比赛 ， 那个 比赛 是从 7 月 开始 到 8 月 半个 月 举办 的 ， 而且 她们 常常 让 两个 公主 参加 ， 然后 输 的 人 把酒 和 菜 给 赢 的 人 ， 她们 在 一起 玩 、 喝酒 、 唱歌跳舞 等 ， 从 那 时候 开始 发展 到 今天 秋夕 的 游戏 文化 。
关于 这些 问题 ， 大学 毕业生 首先 应该 了解 自己 。
最近 韩国 学校 的 操场 都 是 一片 绿地 ， 可是 不 像 巴西 、 葡萄牙 ， 免费 开放 。
大学 毕业生 在 这个 时代 该 背水一战 了 。
但 ， 1991 年 ， 由于 来自 韩国 财政 增加 工作 天数 的 压力 ， 此 法定 假期 被 取消 ， 但是 后来 人们 主张 谚文 日 的 时候 应该 休息 ， 所以 2006 年时 这天 又 为 法定 假期 。
但 最近 有 很多 人 把开 天节 看作 一种 宗教 活动 ， 而 不是 民族 的 活动 ， 所以 他们 提倡 把 开 天节 排列 于 共休 日 。
在 被 解放 的 那天 ， 以前 被 日本 军队 抓走 的 韩国 人 也 能 回到 自己 的 国家 ， 韩国 。
在 1967 年 8 月 15 日 ， 祝贺 光复节 一周年 ， 从 那天 开始 ， 光复节 慢慢 也 变成 了 全 民族 的 节日 。
从 1949 年 以后 的 光复节 ， 人们 把 解放 的 意义 和 政府 建立 的 意义 放在 一 起来 庆祝 。
但是 在 东亚 没有 清算 日本 帝国主义 的 支配 与 侵略 战急 的 遗产 ， 而是 韩国 光复 快要 到 了 70 周年 ， 韩国 还是 分段 国家 。
这件 事 不让 光复节 留下 是 个 只 为了 纪念 过去 的 历史 的 事件 , 所以 最近 的 光复节 的 意义 越来越 变成 了 为了 韩 半岛 的 统一 ， 纪念 东亚 的 和平 。
秋夕 是 五谷 、 水果 成熟 的 时期 ， 农夫 把 农业 已经 收成 完 了 ， 人们 都 换上 新 衣服 ， 捏 豆陷 糯米 面 饺子 ， 做 大米饭 ， 去 祖先 的 坟墓 ， 扫墓 ， 进行 祭祀 。
能 擅长 法国菜 的 优先 生 ， 男女 不 限 。
据 报道 韩国 女 大学生 当兵 的 数目 比 去年 增加 了长 约 2 倍 ， 并 为了 参加 “ 将校 考试 ” 去 学院 的 人数 比 去年 增加 了 4 倍 。
这种 现象 在 韩国 已经 是 一种 普遍现象 了 ， 当兵 不仅 是 单纯 服兵役 的 地方 ， 也 是 给 大学生 们 一处 栖息地 ， 在 服兵役 的 过程 中 ， 既 可以 以 以后 在 社会 上 的 就业 做好 准备 ， 又 可以 给 企业 面试 的 时候 留下 一个 好 印象 。
尽管 政府 施实 的 政策 对 解决 大学 毕业生 求职 问题 起 重要 的 作用 ， 但 大学生 正确 地 认识 到 自己 ， 而且 了解 很快 变动 的 社会 ， 是 更 重要 的 。
其实 泰国 是 传统 新年 ， 相当于 中国 的 春节 。
国民 为了 追悼 他们 ， 每个 家庭 的 窗上 都 挂 了 国旗 。
雨天 踢 完球 ， 我 的 衣服 正如 进 一次 黄河 的 感觉 。
这样 的 环境 造成 了 伟大 的 两个 ro ## l
以 滑冰 为 例 ， 韩国 有 一名 出色 的 滑冰 选手 。
对于 学校 来讲 ， 学校 应该 发展 人 的 综合性 能力 ， 开始 正确 的 就业指导 ， 使 学生 成为 综合性 人才 。
可是 乒乓球 的 热气 不到 十年 就 变冷 了 。
按 传说 ， 43 ## 45 年前 的 10 月 3 日 有 一位 天帝 ， 叫 kate 因 ， 他 为了 实现 弘助 人类 派 自己 的 儿子 保护 自己 的 儿子 后代 ， 从 天上 来到 地上 ， 建立 了 神社 ， 从此 开始 建立 民族 社会 。
前 ， 这个 节日 叫 “ 建国 纪念日 ” ， 后来 韩国 解放后 改名 为 “ 开 天节 ” ， 这里 的 “ 开天 ” 表示 最初 的 人 问 社会 神市 的 建立 ， 第一个 国家 是 古 朝鲜 的 建立 。
在 这个 活动 里 放 郑寅普 作词 与 襄 龙河 作曲 的 《 光复节 的 歌 》 。
从 三 一 运动 之前 进行 的 用国 产品 运动 ， 物产 奖励 运动 等 ， 这些 运动 三 一 运动 以后 也 在 继续 进行 的 同时 ， 也 扩展 设立 民间 企业 的 运动 。
当天 为了 高昂 光复节 的 意义 ， 全国 的 所有 的 家庭 都 升国旗 庆祝 。
其 外 政府 当天 晚上 会 招聘 各级 各 层 的 人士 与 外交使节 举行 庆祝 宴会 。
这时 ， 我们 应该 思考 、 追求 问题 的 解决方案 。
这样一来 分析 来 分析 去 ， 还是 按照 原著 的 脚步 走 下去 。
作为 一个 良军 ， 作为 好心肠 的 人 ， 关羽 做出 了 他 必定 做出 的 选择 ， 值得 后人 敬仰 。
曹操 是 《 三国演义 》 的 负面 主人公 ， 残忍 的 暴军 ， 只顾 自身 的 目的 ， 不顾 军队 和 老百姓 付出 的 血迹 。
不管 曹操 要 付出 多少 人民 的 生命 和 灵魂 、 耗费 多少 时空 和 跨越 多少 距离 ， 他 一定 要 取得 最终 的 胜利 。
对于 敌人 要 用以 敌人 的 方式 对待 。
因此 我 通过 描述 当时 关云 可能 有 的 心理 活动 来 表示 他 释放 曹操 的 原因 。
他们 好像 已经 打过 100 个 战役 似的 。
若 诸葛亮 估计 的 对而 曹操 带 着 军队 的 幸存者 到 华容 ， 那么 争斗 就 会 在 此地 结束 。
曹操 这么 一 说 关云 就 开始 怀疑 在 战斗 之前 这么 表示 尊敬 是否 合理 。
在 三班 学习 过程 中 他 学到 了 很多 知识 ， 每次 考试 得 了 九 十分 以上 的 成绩 ， 第二个 学期 他 升 了 一个班 。
他们 俩 在 同一个 班学 中文 。
那 时候 ， 认真 听课 的 小雪 姐姐 听到 这 句 话 ， 很 伤心 。
她 很 努力 ， 不过 她 学 汉语 还 不到 三年 ， 还是 很 难 跟上 以 汉语 为 母语 者 的 速度 。
可是 中国 所有 的 大学 是 在 八月 底 开学 。
所以 经理 就让 贵 公司 负责 那些 客人 。
在 客人 等 的 期间 ， 有 一位 客人 大声 地 喊 ： “ 舍 时候 才 可以 吃饭 ” 。
从 我 很小 的 时候 就 对 中国 文化 很感兴趣 。
我 很 喜欢 看 一部 中国 电影 ， 那 部 电影 是 关于 《 三国演义 》 的 。
学习 汉语 使 我 有 机会 了解 到 了 关于 中国武术 的 知识 。
说实话 在 高中 的 时候 我 最 喜欢 的 一门 课 就是 武术 课 。
武术 给 了 我 自信 和 健康 的 身体 。
出乎意料 的 是 我 得 了 第 一等奖 ， 那时 我 心里 像 喝 了 密码 一样 甜 。
最后 我 想 从 我 小 的 时候 到 高中 的 时候 是 我 最 幸福 的 时光 。
回去 时 ， 因为 喝醉 而 迷路 了 。
玉帝 知道 了 猴王 做 的 事情 ， 就 命令 率 天兵 追 他 。
其中 我 最为 烦恼 的 工作 ， 就是 擦 店 内 的 玻璃 。
我 本身 就是 个 留学 于 外地 的 女儿 ， 好不容易 回国 一 荡 也 同样 见 不到 彼此 ， 感觉 我们 在 天涯 之际 。
但 我 每次 都 会 坚定 地 说 ， 在 中国 留学 是 我 一生 无悔 的 选择 ！
如果 有人 还 问 我 ： “ 你 最 难忘 的 时期 是 哪 一段 ？ ”
那么 我会 毫不犹豫 地 回答 ， “ 是 2012 年 。 ”
高中 三年 的 努力 ， 我 终于 考取 了 韩国 的 一所 大学 。
我 报考 了 汉语 学院 。
汉语 那样 富有 魅力 ， 而 当时 兴起 的 “ 汉语热 ” 引起 了 对 中国 的 好奇心 。
虽然 中国 迅速 发展 ， 可 人们 对 中国 了解 只停 在 电视 、 媒体报道 上 。
很 遗憾 的 是 ， 关于 “ 中国 ” 的 报道 ， 韩国 电视 、 报纸 媒体报道 的 更多 关注 是 负面 内容 。
可 在 父母 的 支持 下来 北京 开始 留学 。
现在 ， 欣赏 北大 最美 风景 “ 一塌糊涂 ” （ 未名湖 、 博雅 塔 、 藏书 几百万 册 的 图书馆 ） 是 我 最 幸福 的 时刻 。
果然 中国 留学 是 个 不错 的 选择 。
我 一句 牢骚 也 没发 ， 就让 他 进来 了 。
从 那时 开始 的 行动 慢慢 变 奇怪 ， 事情 闹 大 了 ， 到 现在 还 不能 恢复 。
打架 的 时候 ， 我 没 控制 自己 ， 把 我 的 手机 向 他 扔 了 。
可能 这 是 我们 俩 兄妹 的 误会 开始 的 。
还有 兄妹 关系 破坏 ， 受伤 了 。
我 在 书上 看到 一句 ， 如果 一辈子 只 爱 别人 的话 ， 这 时间 也 会 很 短 。
没 获奖 杯 的 两个 表哥 们 心情 一直 不好 ， 对 我 和 表弟 闹 着 脾气 。
在 弟弟 手里 的 奖杯 ， 从 他 的 手上 掉下来 了 。
我 还 记得 那天 的 事情 。
我 以为 护照 放在 我 的 口袋 里 了 ， 但 我 以后 发现 护照 不 在 我 的 口袋 里 。
第二天 ， 去 办公室 告诉 老师 我 丢 了 护照 。
再 办 新 护照 是 件 很 麻烦 的 事情 。
每个 地方 的 事情 办完 后 ， 我 精力充沛 。
等到 四个 月 后 新 护照 终于 在 我 的 手里 了 。
以后 做 某件事 情 的 时候 要 更 仔细 地 做 。
那时 我 来 中国 刚 到 一年 的 时候 ， 当时 我 学 了 点 汉语 ， 差不多 可以 跟 中国 人 打交道 。
每次 做 事情 的 时候 我 都 不会 忘记 “ 每天 事情 ， 一定 要 很 认真 地 对待 ， 千万 不要 骄傲 ” 。
因为 我 年龄 （ 17 岁 ） 最小 ， 自然而然 地 受到 他们 的 影响 。
每天 都 是 娱乐 ， 对 17 、 18 岁 的 大学生 来说 ， 都 是 美好 的 生活 。
我 对 他们 感到遗憾 ， 但是 给 自己 一种 新 信心 ： 我 自己 的 生活 阶段 并 不是 太 完美 。
现在 想 ， 处于 青春期 的 我们 之间 发生冲突 是 理所当然 的 。
结果 自己 试 着 去 做 ， 烧 了 饭锅 ， 被 骂 了 一顿 。
听到 熟悉 的 声音 ， 我 立刻 回头 看 了 看 。
我 想 我 的 家人 ， 特别 是 从来 没来 过 北京 的 我 的 父亲 和 姐姐 ， 亲自 体会 了 很多 东西 。
尽管 家人 都 回国 了 ， 不 跟 我 在 一起 了 ， 但 我 心里 永存 着 他们 的 关心 、 支持 、 和 爱 。
他 一点儿 没有 什么 犯错误 就 站 着 ， 他 被 骂 的 原因 只是 他 是 个 亚洲 人 。
这 是 他 第一次 经历 种族歧视 ， 非常 难受 。
但是 现实 是 不 一样 的 ， 现在 世界 还 存在 着 种族歧视 。
谁 知道 他 通过 了 美国 军队 的 考试 呢 ？
圣泽 和 他 朋友 们 觉得 不能 忍受 ， 计划 暗暗 地 出去 。
他 在 准备 高考 的 时候 ， 跟 朋友 们 一起 住 ， 在 望京 租 了 一个 房间 。
虽然 很 危险 ， 但是 对 自由 的 欲望 比 受伤 的 危险 大 。
以后 他 和 他 的 朋友 以及 父母 都 找 老师 抱歉 了 。
这样 的 进展 也 是 一种 缓解 压力 的 方法 。
为了 考上 北大 努力学习 了 ， 真是 艰苦 的 时间 ， 但 我 克服 了 这 段时间 ， 结果 获得 了 灿烂 的 结果 。
这次 她们 选择 的 饭厅 是 在 北大 里 因 价格便宜 而出名 的 “ 学五 食堂 ” 。
当 同学 们 不知 要 吃 什么 ， 犹豫不决 的 时候 ， 她 先点 了 “ 土豆 烧肉 ” ， 随后 同学 们 也 开始 点 那个 饭菜 。
由于 时间 不够 ， 她们 四个 人 不 出声 ， 只 看着 饭碗 吃饭 。
她 没 看到 这么 帅 的 男人 ， 比 一般 的 演员 或者 名星 长得帅 ， 她 的 心脏 开始 跳动 。
听 了 司机 的 回答 之后 ， 她 的 脑海 里 出现 一个 词 “ 失望 ”
当时 她 第一次 吃 了 麻辣 香祸 ， 所以 觉得 味道 很 奇怪 。
她 虽然 当时 不 习惯 麻辣 香祸 ， 但是 随着 呆 在 中国 的 时间 长 ， 她 慢慢 习惯 了 中国 菜 ， 后来 她 最 喜欢 的 菜 变成 了 麻辣 香祸 。
到 了 北京 以后 ， 他 首先 去 了 长城 。
第一次 爬 的 长城 是 对 他 来说 很累 的 。
但 他 看到 了 长城 坚固 的 形象 和 漂亮 的 风景 。
这 是 她 第一次 去 外国 ， 第一次 坐飞机 ， 也 是 第一次 离开 父母 的 怀抱 。
3 月 3 日 ， 零点 ， 她 和 她 哥哥 的 朋友 在 蛋糕 上 点 蜡烛 。
对 那 对 兄妹 来说 ， 今天 应该 是 最 幸福 的 日子 。
那时 ， 外面 雪 下得 很大 ， 全地 都 是 白白的 雪 。
第一 学期 快要 结束 了 ， 我们 先 到 这儿 ， 到 外面 去 玩吧 ！
之后 ， 学生 们 在 冰 的 未名湖 上 开始 打雪仗 。
男同学 们 开始 欺负 女同学 们 。
对 她 来说 ， 那件事 是 在 预科班 学习 的 过程 中 ， 一件 难忘 的 事情 。
四个 人 在 同 一家 餐厅 吃 一顿饭 是 很 难得 的 。
他 说 ： 这么 难得 的 晚会 ， 如果 没有 酒 是 ， 真 有 同感 。
他们 吃饱 了酒 足 了 ， 兴高采烈 地 回家 了 。
当时 ， 她 的 学校 组织 了去 昆明 留学 的 活动 。
因为 在 自己 的 国家 ， 的确 是 缺乏 语言 环境 ， 所以 她 做出 了 这样 的 决定 。
但是 通过 漫长 的 时间 以及 各种各样 的 校内 活动 ， 她们 俩 的 关系 突然 变得 越来越 好 ， 日益 亲密 ， 从而 在 不知不觉 中 变成 了 好 朋友 。
久而久之 ， 他们 俩 的 关系 就 从 普通 的 好 朋友 中 脱离 出来 ， 最后 变成 了 她 的 知己 。
知己 是 要 一起 同 过 各种各样 的 事情 ， 有福同享 ， 有难同当 ； 才能 从 普通 的 朋友 中 脱离 出来 的 。
回家 的 路上 ， 她 跟 家人 一直 互相 谈话 。
心里 舍不得 ， 但 没 办法 延长 他们 的 时间 。
于是 虽然 为此 一天 准备 了 很久 ， 可 她 心 还是 在 “ 扑腾 、 扑腾 ” 的 很快 挑 。
3 点 到 了 会场 的 寿司 道场 ， 一百个 左右 的 椅子 跃入 了 她 眼帘 。
她 无意 中 开始 涩 涩 发抖 ， 此时 有人 轻轻地 抹 了 她 的 娇弱 的 肩膀 。
如果 今天 来 的 新生 潮 笑 你 的 主持 ， 如果 除了 我 以外 都 讥笑 你 ， 我 支持 你 ， 零 和 一是 不 一样 的 。
六点 ， 晚会 终于 开始 了 。
吃饭 的 时候 他们 约 好 下周 又 一起 去 滑雪场 。
她们 约定 7 点 半 在 华清嘉园 的 北门 见面 。
她们 赶忙 从 学校 出发 。
其实 我 很 孤独 ， 但 我 没有 办法 考上 本科 ， 我 应该 这样 努力学习 。
我 很着急 地 睁大眼睛 寻找 我 的 名字 ， 终于 在 角落里 发现 了 我 的 名字 ， 我 的 心里 很 激动 。
最近 他 经历 了 很 痛苦 的 事情 ， 就 和 他 的 女朋友 分手 了 。
他 和 他 的 女朋友 几年 前在 中国 第一次 见面 ， 后来 他们 见 了 几次 ， 日益 增加 了 亲密 感 。
恋爱 初 他们 每天 幸福 ， 一起 吃 、 一起 学 、 一起 玩 等 ， 所有 的 时间 他们 在 一起 。
过 了 一年 ， 他们 的 关系 还是 很 好 。
发生 了 什么 事情 ， 他 的 解决 方法 和 她 的 解决 方法 有点 差别 ， 就 从不 一样 的 角度 ， 渐渐 他们 吵架 ， 频率 越来越 高 。
原来 她 的 母亲 是 中国 人 ， 所以 从小 她 就 在 家里 跟 妈妈 用 汉语 说话 。
她 要 在 这儿 学 五个 月 ， 跟 她 来 还有 其他 16 个 同学 。
所以 他 常常 想 ， 放假 的 时候 肯定 去 外国 旅行 。
他 准备 了 照相机 ， 为了 把 漂亮 的 风景 带 回忆 。
第二天 ， 他 交 了 个 土耳其 朋友 ， 所以 他 和 他 的 朋友 被 邀请 到 土耳其 朋友家 做客 。
每天 练习 到 很 晚才 结束 。
但是 她们 的 前辈 经常 来 她们 的 练习 室 ， 给 他们 做 好吃 的 小吃 。
他 高中毕业 了 以后 ， 为了 高考 来到 北京 。
二零 十二年 他 考上 了 北京大学 的 中文系 。
不过 今年 他 来 中国 了 。
李老师 给 我 的 印象 很 深刻 。
于是 我 为了 继续 听 他 讲课 ， 每周 两次 到 遥远 的 望京 进行 辅导 。
但 老师 没有 收到 我 的 短信 ， 甚至 为 我 亲自 准备 了 好 多重 菜 和 炒饭 ！
那 按时 吃药 ， 睡 个 好 觉 ！
他 这样 关心 学生 的 面貌 让 我 深深地 感动 。
天 越来越 暖和 ， 我 对 李老师 的 想法 变得 越来越 浓厚 。
“ 这个 人 有 美丽 的 长相 写成 泰语 ， 语序 会 变成 “ 人 个 这 有 长相 美丽 ” 。
世界 上 的 语言 非常 地 多 ， 其中 最 被 广泛 使用 的 英语 就 有 地区 的 差异 。
这个 跟 汉语 完全 相反 的 。
羊驼 一般 栖息 于 海拔 四 千米 以上 的 高原 ， 以 高山 棘刺 植物 为 食 ， 喜好 群居 ， 性情 温驯 乖巧 ， 适合 圈羊 。
并 不依 山旁 水 的 秘鲁 土著居民 也 懂得 利用 这种 高原 独有 的 物质 来 适应 高寒 的 气候 。
由于 其 敦厚 的 长相 和 可爱 的 体态 ， 羊驼 受到 世界各地 的 人 的 喜爱 ， 同时 也 被 更多 的 人 所 知晓 ， 许多 国家 纷纷 引进 饲羊 。
利马 位于 秘鲁 西部 海岸 沙漠 带 的 中部 ， 因此 腹射 全国 。
利马 因 马 里克河 而 得名 。
这时 斯所建 的 大量 雄伟 壮丽 的 欧式建筑 、 城堡 成 了 利马 的 一大 亮点 。
像 《 泰 囧 》 等 电影 ， 大家 都 会 觉得 去 泰国 肯定 挺好玩 的 。
整年 不必 穿 羽绒服 ， 直 穿 t 恤 短裤 ， 十分 舒服 。
本府 华桥 人 居多 ， 假如 你 来自 广东 潮州 ， 在 本府 生活 就 不会 有 多 大 困难 。
朝鲜语 与 韩国语 的 区别 只 在于 口音 和 几百个 单词 ， 口音 不同 的 原因 在于 每个 地方 的 方言 ； 单词 不同 的 原因 在于 韩国语 存在 着 很多 外来语 。
泰语 是 富有 民族 文化 包含 在内 的 语言 。
最难 的 是 语法 的 问题 。
尤其 是 深层次 的 语法 。
下面 介绍 一下 。
日语 有 几个 特点 ， 其中 我 介绍 外来语 ， 敬语 、 语法 的 问题 。
不 这样的话 ， 就 成立 不了 ， 而且 是 不 明白 的 句子 了 。
日语 虽然 很 复杂 ， 但是 对 日本 人 来说 是 很 重要 的 语言 。
羊驼 是 美洲驼 属 动物 ， 已经 存在 约 六千余 年 ， 秘鲁 是 其 源地 之一 。
羊 驼毛 的 颜色 由 浅 至 深 分为 白色 、 浅褐色 、 灰色 、 浅棕色 、 棕色 、 深棕色 、 黑色 及 杂色 等 22 种 。
随着 科技 的 进一步 发展 ， 毛毯 、 座垫 、 抱 枕 等 用 羊 驼毛 制成 的 生活用品 及 各种 羊 驼毛 工艺品 应运而生 ， 日益 丰富 。
随着 经济 全球化 的 趋势 和 旅游业 的 兴起 ， 服务业 也 成 了 秘鲁 的 一大 产业 。
利马 是 个 非常 值得 一观 的 游览 城市 。
若 你 真来 ， 我 保证 你 肯定 会 吃香喝辣 ， 大手大脚 。
在 讨论 外语 和 母语 之间 的 影响 之前 ， 我们 先 来 了解 母语 和 外语 的 定义 。
母语 ， 即 一个 人 出生 之后 ， 最早 接触 、 学习 并 掌握 的 语言 。
有人 认为 ， 过分 注重 英语 的 学习 导致 学生 忽略 了 母语 ， 即 汉语 的 学习 ， 甚至 带来 负面影响 。
最近 ， 北京 推出 了 新 的 高考 政策 ： 语文 从 150 分 提高 到 180 分 ， 而 英语 却 从 150 分 降低 到 了 100 分 。
有人 说 到 ： 无论是 在 中国 还是 外国 发展 ， 了解 本国 的 文化 才 是 最 重要 的 ， 外语 不过 是 一种 增强 交流 的 工具 。
想要 真正 地 去 理解 一种 文化 ， 那么 就 必须 从 它们 语言 开始 。
这 不免 使 家长 甚至 一些 人士 担心 ， 考生 们 偏重于 学习 英语 是否 会 影响 汉语 的 学习 。
如果 取消 了 英语考试 甚至于 英语课 ， 孩子 们 的 汉语 一定 会 学好 吗 ？
他们 对于 外语 抱持 的 是 欢迎 的 态度 。
由于 地理位置 ， 韩国 的 首都 刚好 位于 首尔 。
这个 数字 等于 泰国 所有 人口 的 数字 。
泰语 的 词型 是 没有 时态 与 数量 的 变化 。
基本 语序 与 汉语 一样 。
另 一个 最 重要 的 语法 就是 连词 、 连词 的 作用 都 是 标志 着 一个 句子 的 话题 或 主题 ， 不是 在 汉语 中 的 三个 的 、 得意 的 地方 。
由于 羊 驼毛 的 价格比 羊 驼毛 低廉 且 具 优势 的 保暖性 ， 羊 驼毛 被 越来越 多 的 商家 选用 为 最新 原料 。
冬天 最低气温 为 18 摄氏度 左右 。
高考 的 改革 应 针对 学生 全面性 学习 方面 着手 。
学习外语 是 多 掌握 多 一种 技能 。
主要 科技 文献 是 以 英语 为 原始 语言 。
原本 以前 可 只求 及格 的 心态 ， 转变成 一定 要 得 高分 。
鲁迅 、 严复 、 梁名超 等 著名 文人 比 他们 深厚 的 英文 底子 翻译 了 西方 近现代 科学 文化 成就 到 中国 。
如今 的 人 学习 汉语 ， 能 说 得出 语法 上 的 主谓 宾 ， 却 很少 人 对于 汉语 这个 母语 有 较 深 的 认识 ， 其实 这 导致 了 学习 汉语 的 难度 。
有 对比 才 会 对 自己 的 母语 有 更深 的 认识 ， 学习 起来 会 更 容易 。
确实 汉语 对 韩国语 有 很大 的 影响 ， 但是 韩国语 是 韩国 人 独特 的 文字 。
一 四四 三年 李世 朝鲜 的 第四代 世宗 大王 亲自 创造 成功 朝鲜语 。
英语 在世界上 的 许多 国家 是 不可或缺 的 。
随着 韩国 在 世界舞台 上 的 地位 越来越 高 ， 越来越 多 的 人 开始 学 韩语 了 。
二 o 一二年 ， 韩语 是 英国 的 最 具 科学性 的 语言 。
这 美丽 的 语言 是 怎么 造成 的 呢 ？
因为 汉语 不好 学 ， 只有 地位 高 的 人才 能 用 汉语 。
韩国 人 对 自己 的 国家 有 了 自豪感 。
想 珍惜 祖国 ， 就要 继续 发展 咱们 美丽 的 “ han ## g ## ul ” 。
泰国 声母 （ 辅音 ） 根据 拼读 声调 规律 来 分 ， 可 分为 成中 辅音 、 高 辅音 和 低 辅音 三类 。
中国 的 东北三省 ， 美国 、 日本 、 前 苏联 的 中亚 各国 及 远东地区 也 有 分布 。
它 的 哲学 性 是 毋庸置疑 的 。
在 家里 发生 祭祀 、 生日 等 时候 就 把 年糕 做 了 分给 邻居们 一起 吃 。
年糕 在 韩国 是 一个 很 有福气 的 东西 。
年糕 是 韩国 儒教 性 祭示 上 重要 的 食品 。
在 一般 家 到 别的 地方 时 ， 就 会 定制 很多 红豆 年糕 ， 分给 那 区域 的 邻居们 。
把 它 做成 创意 美食 ， 受到 各国 人 的 欢迎 和 赞扬 。
两班 面具 是 韩国 最 著名 的 一个 面具 ， 而且 是 在 韩国 面具 历史 上 最 顶峰 的 位置 。
如果 ， 戴 这 套 面具 后 抬头 时 ， 是 一个 大笑 的 表情 ， 而 低下头 时 是 一个 合 上 嘴巴 像 生气 的 样子 。
眼睛 的 周围 和 两颊 有 细细地 皱纹 。
鼻子 非常 大 ， 给 人们 留下 了 深刻 的 印象 。
世界 上 许多 人 认为 最早 的 印刷术 是 在 西方 发展 的 。
你们 也 快来 尝一尝 吧 ， 肯定 不会 辜负 你 的 ！
先 把 水 烧开 后 ， 放入 10 个 海苔 ， 再 烧开 十分钟 。
从古至今 有 很多 的 说法 ， 虽然 很 难 确切 地 知道 人们 是从 什么 时候 开始 吃 的 拌饭 。
拌 饭 可能 会 出现 得 更早 。
它 独特 的 魅力 不仅 吸引 了 韩国 人 ， 还 渐渐 走向 了 全世界 人 的 饭桌 前 。
现代 女性 韩服 普通 包括 “ 赤 古里 ” （ 是 韩服 的 上衣 ， 由 五个 部分 组成 ， 分别 是 衣 、 襟 、 胸 、 动襟 、 袖 和 简袖 ） 和 高 腰 背心 裙 ； 男性 韩服 普通 包括 “ 赤 古里 ” 和 裤 。
表示 辅音 的 字母 是 照着 人 的 发声器 创造 的 。
“ 训民 正音 ” 的 优点 有 易学 性 和 普遍性 。
语言 学者 重视 “ 训民 正音 ” 的 优点 。
“ 训民 正音 ” 不仅 是 韩国 固有 的 文字 ， 也 是 国际 公用 文字 的 基础 。
饮酒 与 做 诗 习惯 就是 他们 生活 中 最大 的 乐趣 。
由于 韩中 两个 不同 国家 ， 传统 酒 的 种类 与 饮酒 文化 也 有所不同 。
希望 中国 同学 与 韩国 同学 之间 多次 接触 ， 更 深入 地 了解 对方 的 传统 文化 ！
由于 传统 韩服 因 穿戴 复杂 繁琐 ， 只有 在 特殊 的 日子 里 穿 。
蒙古 军 喝 的 酒 也 是 烧酒 的 一 种类 。
烧酒 的 名气 越来越 高 ， 甚至 有人 把 烧酒 的 人 称为 “ 烧酒 徒 ” 。
古代 烧酒 没 普遍 时期 ， 烧酒 是 用来 药 的 。
南方人 只 在 夏天 和 秋天 喝 烧酒 。
那时 喝 米酒 就 能 解决 口渴 的 感觉 ， 而且 带来 清爽 的 感觉 。
总而言之 ， 训民 正音 是 韩国 人 值得 高傲 的 文字 ， 也 是 韩国 代表 文化 财富 之一 。
狗肉 本性 就 有 热性 ， 于是 有 热病 的话 尽量避免 吃 狗肉 。
夏天 吃 猪肉 要 小心 ， 相反 狗肉 不会 让 肚子 坏 ， 然后 狗肉 的 狗油 也 比 猪肉 和 牛肉 好几倍 。
以后 泡菜 随着 韩国 的 气候 ， 季节 和 各个 家庭 的 生活 环境 或者 饮食习惯 多样化 了 。
价格 也 便宜 ， 一盒 人民币 十五块 左右 。
美国 歌手 麦克 儿 · 杰克逊 也 曾经 喜欢 吃 拌 饭 。
通过 中国 和 韩国 的 美食 交流 ， 希望 能够 了解 对方 。
大部分 韩国 人 在 日常生活 中 已 不再 穿 韩服 ， 只有 在 节日 或 举行 重大事件 时 才 穿 韩服 。
北部 地区 的 气候 中 ， 北部 气候 温度 达到 37 度 。
首尔 是 一座 有 过 悲惨 历史 的 城市 。
我们 生活 在世界上 ， 我们 应该 为 世界 做 一些 贡献 ， 给 世界 留下 一个 印象
光明 和 黑暗 是 人生 必然 的 事情 ， 我们 不能 一直 等待 光明 ， 而 害怕 黑暗 。
我们 应该 边 接 光明 ， 边 面对 黑暗 。
由于 我家 到 外婆家 比较 远 ， 不能 常常 见面 ， 但是 我 和 婆婆 的 关系 难怪 比 别人 的 更好 ， 是 为什么 呢 ？
外婆 去世 后 的 那 几天 ， 我 很 伤心 ， 十几天 之后 ， 我 再 回到 原来 的 生活 。
我 觉得 “ 去世 了 ” 是 最 伤心 的 事情 ， 不是 伤心 的 程度 有多深 ， 而是 不能 接受 跟 我 喜爱 的 人 永远 不能 再见面 的 事实 。
我 现在 还是 很 想念 她 ， 依然 能 感受 到 伤心 的 情绪 ， 但 我 相信 她 一直 活 在 我 的 心中 。
一天 ， 在 刚刚 结束 工商 管理课 去 别的 楼 的 路上 ， 妈妈 给 我 打电话 。
第二次 我 人生 中 第一次 变爱 的 记忆 让 我 感觉 到 高兴 。
我 在 韩国 生活 的 时候 ， 不 努力学习 ， 经常 去 网吧 玩 。
我 高中 二 的 时候 ， 一见钟情 了 一个 具有 倾国倾城 之 貌 的 同学 。
过 了 一会儿 ， 有 一个 学妹 说 ， 她 给 我 介绍 她 认识 的 朋友 的 学哥 。
2010 年初 ， 好莱坞 出现 了 一部 对 全世界 人 的 反响 很大 的 电影 ： 《 阿凡达 》 。
文明 的 冲突 之所以 都 是 悲剧 ， 是因为 双方 常用 暴力 来 解决 冲突 中 所 产生 的 矛盾 。
人类 都 有 自私 的 面貌 。
因为 ， 虽然 物质 文化 水平 通过 生产量 的 大小 有 可能 数据 测量 ， 但 社会 文化 等 无形 文化 难以 被 量化 所致 。
总之 ， 文化 上 只有 差异 ， 没有 差距 ， 而 这些 差异 必须 得 直接 接受 ， 不能 因 文化 的 不同 而 轻视 对方 的 文化 。
这样 的 观念 对 人类 文化 多样性 造成 了 最大 威胁 。
西方人 的 想法 中 有 自己 的 文化 比 印第安人 的 文化 优越 得 多 。
例如 ， 人际关系 上 ， 印第安人 的 文化 比 西方 的 先进 得 多 。
尽管 印第安人 为 小村 的 管理 而 设置 了 酋长 的 职位 ， 但是 酋长 的 角色 只是 主动 为 村民 服务 ， 他 绝对 不 利用 自己 的 职位 强迫 村民 做 这个 做 那个 ，
这样 的 印第安人 的 文化 仍然 是 当今 社会学家 的 重要 学习 课题 。
像 这样 因为 从来 没有 接触 过 外界 的 人 ， 有 这样 的 反应 可以 算作 是 理所当然 的 。
人 是 在 光明 与 黑暗 的 心理 斗争 中 每天 生活 在 人生 中 。
人 的 心中 光明 往往 代表 善 、 黑暗 代表 恶 。
这 也 是 人 在 心理 中 的 善心 ， 也 可以 说 心理 中 的 光明 部分 。
举例 说 ， 人们 的 善意 与 恶意 、 光明 与 黑暗 的 矛盾 就 没有 终结 了 。
阴阳 的 国案 中 ， 有 的 意思 是 白 是 “ 善 ” ， 黑 是 “ 恶 ” 或 “ 邪 ” 的 意思 。
在 我们 的 生活 当中 ， 没有 光明 与 黑暗 的 出现 。
我 想 如果 人们 凡是 热衷于 某 一件 事 ， 而且 对 它 产生 感兴趣 ， 那 这时 人们 就 会 不知不觉 地 产生 “ 喜爱 ” 之 情 。
这么 一个 性格 的 我 最 承受 不了 的 是 压力 。
曾经 我 读 一年 高三 ， 准备 从 考大学 的 时候 ， 经常 压力 陪伴着 我 的 生活 。
我 准备 考试 的 那 一年 ， 凡是 我 受到 什么 压力 ， 就 会 看电视 里 所 播放 的 足球比赛 。
后来 ， 我 所 考完 大学 后 ， 没有 像 以前 只是 看 足球比赛 ， 而是 我 参加 了 韩国 留学生 的 足球队 ， 亲身 感受 着 这 足球 的 “ 魅力 ” 。
对 我 来说 “ 喜爱 足球 ” 的 情绪 是 永远 离不开 的 ， 也 是 希望 以后 也 一直 度过 我 的 生活 。
凡是 人 都 希望 快乐 ， 都 愿意 产生 高兴 的 事 ， 开开心心 地 度过 每 一天 ， 这 是 人之常情 。
每当 爸爸 的 生日 时 ， 我 常常 在 北京 呆 着 ， 从来 没有 送给 他 礼物 什么 的 。
终于 到 了 爸爸 的 生日 这 一天 了 ， 我 和 弟弟 迅速 地 去 蛋糕店 里 买 了 一个 就 回来 ， 准备 让 爸爸 惊讶 。
我 的 孩子 们 长大 了 ， 今天 是 我 人生 中 屈指可数 的 一天 了 。
我 这 丑怪 的 性格 不止 于 看 ， 而是 亲自 去 体验 。
事情 发生 的 时候 ， 尸体 的 旁边 一直 响 着 刺耳 的 女子 哭声 ， 这 痛哭 使 我 的 心 更加 昆明 了 。
钟表 一直 在 打扰 我 的 睡眠 。
平时 听 不到 的 钟表 声 ， 突然 怎么 会 听 得 这么 清楚 呢 ?
我 毕竟 是 个 经验 者 ， 仍然 摆脱 不了 七上八下 的 心理 。
正 因为 这个 ， 我 没法 完全 脱离 紧张 。
打开 后 ， 北京大学 的 高考 就 开始 了 。
我 开始 动笔 之后 ， 一切 的 精神 都 集中 到 考卷 上 了 。
但 和 去年 不 一样 ， 我 付出 了 全部 的 努力 ， 即使 我 没能 入取 北大 ， 也 不会 感到 后悔 。
我 感到 害怕 的 事情 有 很多 ， 各种各样 。
如果 那个 情况 就是 之前 没有 经历 过 的 情况 ， 我们 就 未免 会 感到 “ 害怕 ” 。
人们 说 的 克服 “ 害怕 ” 的 方法 千方百计 。
为了 自己 克服 害怕 ， 应该 定 一个 目标 ， 以后 具有 着 不怕 失败 的 精神 而 付出 不懈 的 努力 。
工作 之前 之所以 特别 紧张 ， 是因为 这个 歌手 被誉为 韩国 最佳 歌手 之一 。
我 现在 才 20 岁 ， 想到 每个 人 的 平均 死亡 年龄 是 90 岁 的话 ， 我 连 人生 的 一半 都 没活 过 。
男人 往往 在 女人 面前 吹牛 、 自夸 。
不论是 什么样 的 害怕 ， 它 给 人体 带来 的 损害 是 挺大 的 。
从那时起 我 心里 总是 七上八下 的 安定 不 下来 。
当然 每个 人 的 性格 不 千篇一律 ， 引起 高兴 情绪 的 原因 也 不同 。
她 的 班上 一个 男同学 向 她 告白 了 ， 但是 她 对 他 没有 男女 的 感觉 。
别的 三个 室友 自习 一 结束 ， 就 迫不及待 地 赶回 宿舍 。
那天 大家 一起 聊天 到 很 晚 。
每当 我 看见 那天 拍 的 照片 时 ， 就 想 起来 那天 的 情况 和 高中 朋友 们 。
室友 往往 到 很 晚 时间 喝酒 ， 旁若无人 地 大哗 ， 让 我 睡不着 。
事情 始于 我 小学 三年级 的 时候 发生 了 。
那时 我 在 韩国 刚刚 上 了 小学 三年级 ， 小时候 因为 想 做 的 事情 特别 多 ， 每天 过 了 非常 丰富 的 一天 。
而且 我 在 韩国 正 过 着 美丽 的 日子 ， 有 很多 的 好 朋友 。
一 想 上学 ， 就 觉得 毛骨悚然 ， 每 一天 都 很 痛苦 。
我 有 一个 姐姐 ， 她 比 我 大 两岁 ， 从 小时候 一起 长大 。
我 想起 姐姐 的 时候 ， 立刻 感觉 到 “ 可恶 ” 。
她 故意 期望 欺负 我 ， 故意 对 我 说 气话 。
我们 姐妹 经常 因为 衣服 的 问题 吵架 。
我 对 她 生气 的 不是 她 不 借给 我 她 的 衣服 ， 而是 她 的 可恶 的 态度 。
如果 你 问 别人 在 最 辉煌 的 瞬间 感觉 怎么样 ？
那时 的 留学 生活 让 我 感到 很 幸福 。
回国 后 ， 我 常常 想起 那 时候 的 回忆 ， 所以 这个 学期 再 来 中国 。
所以 我 决定 来 北京 后 每天 都 热衷 学习 。
人们 一辈子 会 经历 很多 事情 。
我 以前 总是 觉得 我 很 倒霉 ， 所以 我 变成 了 想不开 的 人 。
对 我 来说 ， 到 现在 ， 我 觉得 最 高兴 的 事情 是 高考 合格 了 。
那时 ， 我 已下 了 破釜沉舟 的 决心 ， 不 完成 我 的 打算 ， 绝不 停止 。
高兴 这 情绪 是 ， 对 我 来说 ， 我 生活 的 原动力 ， 而且 给 我 力气 的 。
开始 登山 的 时候 ， 有点 害怕 ， 也 有 生气 的 情绪 。
那 是 我 第一次 看 松鼠 。
不论是 心态 还是 学习 状态 都 与 之前 大 一 、 大二 时 有 很大 改变 。
人 不 可能 永远 过 着 被 光明 掌握 的 生活 ， 黑暗 也 同样 不 可能 一直 存在 。
经历 过 黑暗 的 人 一定 会 走进 光明 的 道路 ， 过 着 黑暗 生活 的 人 ， 通过 自身 的 努力 之后 ， 务必 会 得到 光明 。
光明 和 黑暗 会 分别 带给 我们 不同 的 感受 ， 甚至 对 我们 产生 影响 。
高兴 的 情绪 是 个 万 病 有效 的 情绪 。
我 个人 认为 “ 害怕 ” 这个 情绪 的 原因 ， 包罗万象 而 不能 屈指可数 。
我们仨 七点 半 就 去 了 机场 ， 但 没想到 他们 的 飞机 误点 了 两个 小时 ， 我 那时 非常 悲伤 。
到 了 表演 的 时间 ， 我们 的 这种 不满 被 这 一次 表演 取消 了 。
我们 一直 喝 到 凌晨 五点 半 。
在 这 三天 的 工作 中 我 得到 了 这么 好 的 人 ， 不论是 男人 还是 女人 能力 都 是 最 重要 的 。
随着 时间 的 流逝 ， 我 越来越 喜欢 他 。
我 跟 他 一起 学习 的 时间 越 长 ， 我 的 成绩 就 越好 。
这样 ， 喜爱 的 情绪 有 力量 可以 让 积极 的 人生 恋爱 ， 还 可以 控制 ‘ 生气 ’ ， ‘ 辛苦 ’ 等 不好 的 情绪 。
从来 我 没收 到 那样 的 诚心 充满 的 饭盒 ， 同时 在外 地上 从 外国 朋友 那样 的 关心 ， 我 特别 感动 。
而且 很 感谢 她 ， 不 知道 怎么 报答 她 的 好处 。
每天 每天 边 哭 边 跟 父母 吵架 ， 但 也 没有 用 。
有 一次 ， 在 我 找 房子 的 时候 ， 我 被 一家 中介 公司 给 坑 了 。
其实 ， 我 知道 这些 钱 是 大家 千辛万苦 才 赚来 的 钱 ， 但 我 实在 是 忍不住 的 。
天气 也 随 人心 ， 一天 比 一天 灰 ， 花草 开始 衰落 了 ， 寒气 弥漫 在 京城 的 处处 。
四年 前 的 这个 时候 我 是 你 的 学生 ， 你 是 我们 班 的 主任 老师 。
长 得 完全 像 鸭 一样 的 班长 ？
他们 说 西班牙 最 美丽 的 三个 地方 是 马德里 、 巴塞罗那 和 格拉纳 达 。
那么 ， 我 告诉 你 ， 在 马德里 有 一个 有名 的 美术馆 ， 叫做 “ fe ## nne ## ton ## hm ## a ” ， 在 巴塞罗那 还有 一个 有名 的 美术馆 叫做 “ mu ## man ## ᄃ ## ᅣ ## ra ## do ” ， 你 去 看看 吧 。
那个 宾馆 给 每个 客人 很多 机会 学 西班牙 传统 的 舞蹈 ， 学 吉他 和 学 西班牙语 。
格拉纳 达 就是 欧洲 为 变化 和 穆斯林 融汇 而 设立 的 地方 ， 那儿 的 文化 受到 很多 穆斯林 的 影响 。
怪不得 那个 宾馆 为了 保存 自己 的 文化 ， 教 客人 西班牙 的 文化 。
你 快 一点儿 来 呢 ， 北京 真是 有意思 的 城市 之一 ！ 还有 中国 的 历史 和 文化 都 很 灿烂 ！
你 来 北京 的 时候 ， 可以 去 看 长城 、 故宫 和 颐和园 。
这些 地方 代表 了 中国 灿烂 的 文化 和 历史 。
我 第一次 去 这些 地方 时 ， 真 感动 ！ 朋友 ， 我们 一起 去 吧 ！
我 在 北京 的 第一次 吃 中国 菜 的 时候 ， 我 哭 了 。
另外 ， 你 来 北京 时 ， 一定 要 吃 北京烤鸭 ！
朋友 ， 我 很 想 你 ， 虽然 我 在 北京 但是 别忘记 我 。
一会儿 热 一会儿 冷 ， 而且 经常 下雨 。
仙人掌 的 外貌 特征 明显 ， 多数 仙人掌 的 肉 为 绿色 ， 上面 长满 刺 ， 根据 品种 不同 ， 长 在 仙人掌 上 的 刺 也 千差万别 ， 有软 有硬 ， 也 有直 的 ， 弯曲 的 ， 有如 叉子 般长 开 的 ， 也 有 如同 网状 将 躯干 包围住 的 。
仙人掌 在世界上 的 分部 广泛 ， 其中 以 北美洲 为首 ， 因此 仙人掌 也 被 墨西哥 定为 国花 ， 其 起源于 美洲 与 非洲 ， 后来 经过 航海 贸易 ， 传入 世界各地 ， 如今 在 中国 南方 及 东南亚 都 能 见到 仙人掌 的 踪影 。
不仅如此 ， 仙人掌 全 是 珍贵 的 药材 ， 其 果实 是 一种 珍贵 的 水果 ， 仙人掌 的 茎 具有 治疗 糖尿病 的 功能 ， 把 仙人掌 切开 后 的 肉 还 能 美容 。
乐园 在 二 00 一年 九月 四日 开幕 ， 最早 是 要 建设 一座 电影 摄影棚 类型 的 主题乐园 ， 类似 于 美国 佛罗里达 洲 的 华特 · 迪士尼 世界 度假 、 法国 的 巴黎 迪士尼 乐园 度假区 。
但 市场 评估 后 发现 日本 对于 电影 文化 还 不够 熟悉 ， 因此 把 主题 变为 “ 海洋 ” ， 这 是 全世界 迪士尼 乐园 第一次 出现 的 主题 。
美国 海滨 区 的 对面 就是 地中海 港湾 （ me ## di ## ter ） ， 它 是 以 南欧 的 海港 小镇 为 主题 ， 风景 十分 优美 。
这里 还有 观 海景 大饭店 （ ） ， 这 是 世界 唯一 的 在 迪士尼 主题乐园 内 的 饭店 。
火山 的 山麓 就是 “ 神秘岛 ” 区 ， 这里 是 以 一 八七 三年 南太平洋 的 一个 火山岛 为 主题 。
区域 内 有着 乐园 中 最 受欢迎 的 游乐 设施 之一 “ 地 心 探险 之 旅 ” 。
东京 迪士尼 海洋 与 东京 迪士尼 乐园 有所不同 ， 东京 迪士尼 海洋 内 设施 的 美术 技术 比 东京 迪士尼 乐园 高 ， 能够 享受 迪士尼 的 美术 技术 的 精华 ， 同时 也 可以 享受 日本 顶级 的 非常 好 的 服务 。
到 了 上 中学 的 时候 ， 因为 我 遇上 了 一位 耐心 又 充满热情 的 汉语 老师 — — 陈秋华 ， 所以 我 开始 对 学习 汉语 的 态度 有所 改变 ， 不再 觉得 是 一件 苦差事 ， 反而 逐渐 产生 了 兴趣 。
她 使 我 重新 看待 汉语 这 门 科目 ， 甚至 爱 上 了 她 。
毕竟 我 的 汉语 水平 和 能力 并 不是 特别 高 ， 所以 在 学习 汉语 的 过程 中 相当 辛苦 。
将来 有 意愿 在 中国 发展 事业 的 我 选择 来 中国 留学 ， 而 先前 所学 的 汉语 为 我 在 中国 生活 和 学习 的 日子 更加 容易 、 顺心 。
我 不敢相信 自己 会 有 那么 大 的 转变 ， 也 不敢相信 自己 那么 大 的 勇气 和 毅力 来 修读 中文 。
虽然 我 在 中国 已经 有 六年 的 时间 ， 可是 最 让 我 难忘 的 是 刚来 中国 时 初次 接触 过 的 汉语 。
不知 听写 得 了 多少 不及格 ， 不知 我 花 了 多少 时间 来记 和 写 汉字 ， 记是 记不住 。
我 认识 了 一个 教 汉字 课 的 老师 ， 她 帮 了 我 解决 我 最 烦恼 的 问题 。
我 当时 自己 的 汉语 水平 很 差 ， 勉强 会 读写 汉语拼音 ， 日常 会 话 也 不如意 。
在 留学生 的 语言 班里 全都 是 韩国 同学 ， 在 这里 的 同学 大家 几乎 都 不会 说 汉语 ， 所以 我们 之间 的 沟通 很 困难 。
我 的 汉语 进步 得 多 ， 虽然 还有 语言 的 障碍 、 但是 跟 老师 和 同学 们 能 交流 了 。
从 那个 时候 起 我们 班 ， 周末 时候 开始 上 h ## sk 课 。
但 还是 多亏 那时 的 痛苦 ， 我 进入 了 北京大学 。
入 北京 以后 已经 过 了 一年 半 的 时间 ， 我 的 汉语 水平 比 刚来 北京 时 进步 了 不少 ， 但 还 是不是 特别 好 ， 所以 以后 也 要 好好学习 才 行 。
我 小时候 ， 住 在 一只 鸟 ， 名字 叫 长山 鸟 。
他们 特别 热情 对 我 ， 因为 我 爸爸 是 老师 。
在 韩国 的 乡村 ， 老师 是 很 重要 的 职业 。
在 鸟巢 里 ， 不能 自由 卖 。
自行车 太小 ， 我 很大 。
我 的 身体 都 累坏 了 。
他们 都 想 救 我 ， 但是 水 很 深 。
那个 时候 ， 我 的 爸爸 接下来 对 我 说
但是 我 很 感动 ， 爸爸 的 逐日 扩大 。
因为 爸爸 和 妈妈 每天 很 忙 着 工作 ， 小时候 我 和 弟弟 整天 在 一起 ， 所以 童年 时 做 的 所有 的 事情 是 跟 他 一起 做 的 。
弟弟 和 我 喜欢 很 好气 得 做 新 的 事 ， 而且 很 有 活力 常常 跟 朋友 们 去 家外 玩 。
虽然 大部分 的 事情 是 一般 小孩子 做 的 那样 的 事 ， 但是 我 记得 我们 在 夏天 时 常常 去 找 小鸟 ， 比较 特别 而且 留 了 深刻 的 印象 。
弟弟 也 很 想 成功 ， 所以 我们 回家 找 合适 的 东西 带 小鸟 ， 然后 再 出去 观察 它们 的 动作 和 样子 。
我 一直 在 弟弟 的 身边 告诉 他 怎样 做 ， 他 跟 小鸟 的 动线 一起 走来走去 ， 可是 当然 的 ， 不会 成功 。
虽然 我们 常常 这样 ， 做 没有 意义 的 好多 东西 ， 可是 觉得很有 意思 ， 积累 了 童年 的 宝贵 经历 。
因为 有 在 一起 的 那段 美好时光 ， 我 很 爱 弟弟 。
在世界上 大部分 国家 都 有 自己 的 国花 ， 它 是 一个 国家 的 自然资源 ， 历史 传统 和 民族 审美 取向 的 象征 和 体现 。
为了 提高 民族 自豪感 ， 凝聚力 和 国际 影响力 ， 体现 民族 特点 和 审美 取向 ， 很多 国家 以 自己 国家 最 著名 的 花 作为 他们 国家 的 象征 ， 并 具有 一定 的 涵义 。
在 国花 的 特性 中 ， 我们 不难看出 各国 的 民族 特征 。
可以 说 木槿花 的 独特 品质 正 可以 反映 韩国 悠久 的 历史 。
这 就 充分 显示 出 韩国政府 在 国花 方面 的 普及 认知 是 不能 轻视 和 忽略 的 。
我 回想 我 童年 的 时候 ， 自己 觉得 可爱 得 自然而然 地 微笑 。
我 小时候 ， 我 的 个性 很 外向 ， 而且 喜欢 户外活动 ， 天天 在 外面 玩 ， 所以 我 的 脸 总是 黑 的 。
决定 跟 他们 一起 举办 一个 表演 是 为了 让 老师 和 同学 们 高兴 。
所以 我 跟 朋友 下课后 ， 经常 准备 表演 包含 唱歌 ， 跳舞 ， 找 表演 。
那 时候 ， 有 一个 很 流行 的 歌手 团体 ， 我们 担当 那个 歌手 的 每 一个 人 ， 甚至 打扮 得 像 她们 一样 ， 漂漂亮亮 的 。
大家 都 很 满意 我们 的 活动 。
现在 我 也 在 想 这些 事情 的 时候 ， 不敢相信 。
我 上 小学 、 中学 的 时候 我 对 狗 的 小心 ， 我 害怕 比 交通 便利 ， 所以 如果 我 走路 的 时候 碰到 一个 狗 、 我会 千方百计 各种各样 的 办法 绕路 、 我 到 和 这种 狗 不同 的 路 。
在 俄罗斯 海参崴 有 很多 和 狗 发生 的 事故 ， 比如说 二 〇 ## 〇 一年 青天 有 一只 大 狗 咬 死 小孩 ， 咬 他 的 脸 那么 重 ， 甚至 父母 很 难 认出 这个 小孩 ， 他 的 脸 变成 了 一块 肉 。
我 害怕 情绪 从不 意识 的 状态 转 到 无意识 的 状态 。
过 了 一段时间 我 长大 了 ， 我 想 抛弃 我 这个 不好 的 情绪 ， 不想 害怕 。
每个 人 都 有 自己 的 感情 ， 每逢 时间 ， 每 见 事情 都 会 产生 各种 情绪 。
比如 害怕 ， 生气 ， 厌 严 ， 伤心 ， 惊讶 ， 喜爱 ， 高兴 等等 ， 其中 ， 高兴 是 一种 能 表现 出 愉快 与 亲福 心理 状态 的 情绪 。
他 在 当兵 的 时候 出来 休假 ， 计划 跟 他 去 海边 玩 ， 不过 旺季 已经 过去 了 ， 到 了 每边 没有 几个 人 ， 屈指可数 。
我 直接 问 他 为什么 那么 高兴 。
难道 这么 小 的 事情 可以 让 他 高兴 吗 ？
在 困难 的 环境 下 每天 劳动 ， 身体 很 累 。
不论 大 的 事 还是 小 的 事 ， 都 可以 让 我们 高兴 ， 最 重要 的 是 怎么 想 。
我 个人 觉得 我们 的 情绪 来 决定 一个 人 的 性格 ， 甚至 决定 一个 人 的 人生 。
把 “ 伤心 ” 奉 为 圭泉 的 艺术 理念 。
特别 是 人 和 人 之间 的 距离 显然 给 我 很大 的 打击 。
每当 不论 男女老少 ， 我 曾经 喜欢 过 的 人 离别 时 都 会 住 得 如此 远 。
我 母亲 为了 增强 我 的 耐心 和 能力 ， 她 确实 用 了 千方百计 。
其中 ， 每当 周末 利用 青少年 社团 去 旅游 。
可 后来 慢慢 适应 下去 ， 认识 到 了 世界 上 有 包罗万象 。
每 周末 跟 陌生 的 同辈 朋友 一起 去 陌生 的 地方 旅游 是 可以 适应 的 。
可 到 现在 还是 不 习惯 的 事情 是 旅游 结束 的 那 时候 的 离别 。
我 从小 经历 过 很 多次 的 离别 ， 所以 和 人友 往 开始 时 ， 不 相信 对方 。
这 应该 是 不想 再 受伤 的 原因 吧 。
其中 我 跟 别人 比较 起来 有 一个 很 特别 的 一个 表现 情绪 的 特点 就是 “ 眼泪 ” 。
害怕 、 生气 、 高兴 、 伤心 等 都 会 流泪 ， 每当 流泪 的 意思 都 不 一样 ， 可 刺激 我 的 情绪 的 程度 大 ， 我 就 喜欢 流泪 。
虽然 学校 都 不 一样 ， 可 小时候 一起 长大 的 ， 所以 常常 见面 一起 玩 。
胸椎 剧烈地 起伏 着 ， 仿佛 一个 大 气球 要 爆炸 似的 ， 我 的 嘴巴 生气 地 咬 东 切齿 。
丰满 诱人 的 身子 从 背后 仅仅 抱起 了 那个 男生 。
跟 中国 朋友 一起 聊天儿 的 时候 ， 虽然 有点儿 难过 ， 但是 很 有意思 。
其实 这 也 难怪 ， 她 对 汉语 课本 的 内容 也 有 很大 的 关心 。
其实 有 北京 的 不好 的 样子 ， 比如 ， 污染 的 空气 、 有些 服务员 的 旁若无人 的 态度 ， 但是 这 样子 在 什么 国家 都 会 发现 ， 所以 对 我们 来说 ， 不是 大 的 问题 。
因为 创造 了 好 环境 ， 所以 每年 都 有 很多 留学生 来 北京 ， 我 的 朋友 也 希望 去 北京 留学 。
不过 ， 每个 人 对 什么样 的 事情 到底 可以 算是 成功 ， 什么 不 可以 算 ， 都 不 一样 。
说 成功 是 什么 我们 就 必须 说 成功 ， 成功 是不是 一个 只能 通过 努力 的 路线 达到 的 东西 ？
这个 情况 有 很多 。
运气 是 一个 很 广义 的 概念 ， 但是 总的来说 运气 就是 那些 我们 控制不了 但是 最后 还 会 影响 到 我们 是否 能 成功 。
听完 了 以后 ， 因为 那位 侦查员 特别 喜欢 那个 歌手 的 音乐 ， 他们 签合同 ， 后来 的 故事 就 不用说 了 。
不管怎么 说 都 是 一个 概念 ， 那个 歌手 一直 努力 但是 一直 没有 成功 ， 然后 突然 有 一天 一件 他 控制不了 的 跟 他 没有 关系 的 事情 发生 了 ， 侦查员 来 了 。
总的来说 努力 与 运气 都 是 成功 的 基本 条件 ， 都 是 不可 缺少 的 ， 他们 都 是 对 成功 一样 重要 的 现象 。
他 吓了一跳 ， 为 麻雀 非常 担心 ， 于是 到 竹林 去 找 麻雀 。
爷爷 说 自己 已经 老 了 ， 拿 不起 那么 大 的 箱子 ， 背着 小箱子 回家 。
于是 ， 奶奶 也 跑 到 竹林 去 ， 找到 麻雀 们 的 家 就 闯进去 ， 要求 它们 准备 礼物 。
回家 的 路上 ， 她 想 看看 这个 大箱子 里 到底 有 多少 财宝 ， 把 箱子 放在 路边 ， 慢慢 打开 了 。
在 刚果 ， 有 一条 很 有名 的 河 ， 是 刚果河 。
王永丽 是 个 美丽 又 有 魅力 的 姑娘 ， 她 有 大大的 眼睛 ， 浅 咖啡色 的 长 头发 ， 厚厚的 性感 有型 的 小 嘴巴 ， 她 的 身材 很 苗条 ， 长 得 标准 女性 高 。
但 世界 上 没有 什么 是 十全十美 的 ， 她 生出 很 贫穷 的 家 ， 她 爸爸妈妈 俩 是 捡 垃圾 的 ， 她 还有 两个 哥哥 和 一个 弟弟 ， 她 在 宾馆 做送 餐 人员 ， 有 一天 有 小 k 来 宾馆 住 ， 他 是从 上海 来 的 ， 他 爱 上 了 北京 姑娘 ， 她 也 觉得 是 一见钟情 ， 他们 开始 互相 爱慕 ， 但 由于 她 觉得 她 配不上 他 ， 她 就 辞 了 ， 他 找 不到 她 ， 他 用 各种 办法 ， 最后 找到 了 她 的 家庭 ， 她 知道 了 家庭 的 情况 ， 最后 他们 一见钟情 ， 王菲 娶 了 她 ， 幸运 的 是 新娘 ， 丈夫 也 不用 担心 ， 因此 才 去世 的 。
她 和 他 最后 在 一起 ， 过 了 3 年 他们 有 了 3 个 孩子 ， 老大 是 男 的 ， 老二 是 女 的 最小 也 是 女 的 ， 她们 过 得 很 愉快 ， 两个 家庭 ， 虽然 一个 是 有钱人 ， 一个 是 贫穷 人 ， 但 最后 在 一起 没 问题 ， 世界 上 总是 出现 这样 的 事 ， 她们 想 可能 是 天命 注定 吧 。
就 像 很多 后母 一样 ， 这位 妇人 很 讨厌 丈夫 的 女儿 ， 把 所有 的 活儿 都 让 她 做 ， 而 自己 的 女儿 却 像 公主 一样 伺候 着 。
她 命令 自己 的 丈夫 把 那个 女孩儿 拉 进 森林 里 扔 在 雪堆 里 。
小姑娘 在 雪堆 里 冻得 直发抖 ， 突然 感到 严寒 加重 ， 原来 是 雪 先生 来 了 。
后母 在 家里 觉得 时间 差不多 了 ， 让 丈夫 去 森林 去 把 自己 女儿 埋 了 。
妇人 的 女儿 在 雪 里 坐 着 时 ， 雪 先生 又 来 了 ， 雪 先生 问 她 冷不冷 ， 她 大叫 道 ： “ 冻死 我 了 ， 你 快点 走 ！ ” 雪 先生 很 生气 就 离开 了 。
妇人 在家 看 时间 差不多 了 ， 命 丈夫 去 接 女儿 回来 ， 她 到 门口 迎接 ， 接回来 的确 是 一具 尸体 ， 此时 后悔 已经 太晚 了 。
过 了 十几年 ， 弟弟 回到 这个 部落 要 看 哥哥 生活 怎么样 。
去 找 哥哥 时 ， 路上 碰到 了 一个 非常 漂亮 的 女子 ， 他 就 问 这个 女子 找到 了 他 的 哥哥 的 家 。
这时 ， 弟弟 刚刚 看到 过 的 漂亮 的 女子 走进 了 屋子 。
“ 没有 ， ” 哥哥 很 自豪 地 说 ， “ 她 就是 部道 的 小女儿 ， 是 我 当时 要 娶 的 那个 。 ”
哥哥 的 妻子 就 对 弟弟 说 ， “ 就是 我 当时 明白 了 ， 我 值得 这 十 头牛 。 ”
有 一个 寒冷 的 雪天 ， 老爷爷 出去 到 城镇 去 卖 木材 后 ， 回家 路中 ， 发现 有 东西 在 雪地 里 调动 ， “ 那 是 什么 呢 ？ ” 老爷爷 发现 在 雪地 里 有 一只 鹤 被困 在 圈套 里 了 。
老爷爷 觉得 那 只 鹤 很 可怜 ， “ 安静 点 ， 不要 动 ， 我 马上 来救 你 。 ”
当 老爷爷 帮助 鹤 脱身 后 ， 鹤 就 往向 山上 飞去 了 。
老爷爷 回到 家里 就 跟 奶奶 说道 了 那件事 ： “ 我 今天 做 了 件 好事 ， 我 救 了 被困 在 圈套 里 的 鹤 。 ”
一 说完 ， 门口 就 来 听见 了 敲门声 ， “ 是 谁 呢 ？ ” 老奶奶 把门 打开 ， 门口 里 站 着 一位 美丽 的 姑娘 ， 说道 ： “ 这么晚 了 打扰 真 不好意思 ， 我 是 到 这 村子 来 探望 朋友 的 ， 我 因为 外面 下 着 大雪 而 迷路 了 ， 请 您们 让 我 在 这里 借宿 一下 ， 可以 吗 ？
“ 今晚 特别 冷 ， 快进来 虽然 我们 贫穷 ， 但 没有 足够 被褥 ， 如果 不介意 的话 就 留下来 吧 ”
没有 小孩 的 两个 人 ， 都 把 她 看成 亲生女儿 对待 。
有 一天 晚上 ， 姑娘 说 了 “ 请 让 我 当 您们 的 女儿 ” 。 二人 很 开心 地 说 ： “ 好 ！ ” 。
有 一天 ， 姑娘 这么 说 ： “ 我 想 编织 美丽 的 布 ， 可以 买 些 线 回来 给 我 吗 ？ ” 老爷爷 就 把 线 给 买来 了 。 要 开始 编织 的 时候 ， 她 这么 说 了 ， “ 现在 开始 织布 了 ， 我 在 织布 的 时候 绝对 不能 看房 里面 ， 请 绝对 不要 看房 里面 。
“ 明白 了 ， 绝对 不 看 房里 了 ， 编织 出好 的 布来 吧 ！ ”
的确 是 他们 见 过 的 织物 中 最 美丽 了 。
女儿 说 了 “ 这 是 鹤 的 织物 ， 请 明天 拿到 城镇 去 卖 ， 然后 也 请 买 些 线 回来 给 我 。 ”
三天 过去 的 时候 老奶奶 对 老爷爷 说 ： “ 这么 好 的 织物 是 怎么 做 出来 的 ？ ” 稍微 看 一眼 。
“ 不 可以 这么 做 ， 你 已经 答应 了 绝不 看 房里 的 东西 ”
“ 老公 ， 有 只 鹤 在 织布 啊 ” 小声 地 说道 。
那 一夜 ， 女儿 拿 着 织物 从 房里 走 出来 ， “ 爸爸 、 妈妈 ， 我 决不会 忘记 你们 的 恩情 ， 我 是 那时 困 在 圈套 里 被 你 救 出来 的 鹤 ， 为了 报恩 来到 这 ， 可是 我 的 真份 被 识破 了 ， 所以 不能 再 留在 这里 了 ， 这 段 日子 ， 真的 感谢 你们 ， ” 说完 后 张开 双 后 变成 鹤 ， 向 天空 飞去 ， 回绕 在 屋顶 上 ， 往 山顶 上 飞 走 了 。
他 的 五官端正 ， 有 一头 褐色 的 头发 ， 长 得 高头大马 ， 很多 女生 都 被 他 的 外表 着迷 ， 他 的 家境 富裕 ， 父亲 是 国际 饮食 集团 的 总裁 ， 母亲 则 是 妇产科 医生 。
他 待人 诚恳 ， 性格 温和 谦逊 ， 到 哪儿 都 非常 受欢迎 。
她 的 性格 乖巧 ， 有 一头 乌黑 的 长发 ， 一双 明亮 的 大 眼睛 ， 简直 是 典型 的 邻家女孩 ， 她 和 他 相恋 已经 有 两年 了 。
他们 瞒 着 父母 和 亲戚 ， 私底下 偷偷 展开 了 这段 恋情 。
这 是 他们 经常 去 的 购物中心 ， 因为 离 他们 俩 的 住处 非常 远 ， 所以 被 熟人 看见 的 机率 也 就 不 高 。
过 了 几天 ， 一辆 救护车 和 警车 出现 在 她 的 住处 楼下 。
伟大 来自 于 平凡 ， 往往 一个 企业 每天 需要 做 的 事 ， 就是 每天 重复 着 所谓 平凡 的 小事 。
古今中外 ， 因为 重视 细节 成功 的 例子 屡见不鲜 。
我 是 2010 年 上 北京大学 中文系 的 韩国 留学生 ， 我 叫 洪世美 。
从 那天 开始 她 成为 我 的 偶像 。
可 我 决心 的 是 19 岁 冬天 有点 晚 了 ， 在 韩国 19 岁 冬天 要 准备 考上 大学 。
所以 我 一直 模仿 父母 ， 盲目 地 到 中国 来 了 。
所以 汉语 水平 是 呆 在 中国 的 时间 比较 起来 很 差 ， 而 休学 1 年 没用 汉语 ， 现在 写 的 、 说 的 等 全 方面 都 是 拌蒜 。
所以 阅读 与 写作 这 门 课 对 我 来说 是 非常 有用 的 ， 能够 再次 锻炼 。
爱迪生 发明 了 电灯泡 之后 ， 大家 都 说 他 有 天才 ， 可是 在 他 找到 了 适当 的 材料 之前 ， 他 花 了 多少 心思 去 考虑 材料 的 适用 度 。
未来 我 用 汉语 能力 ， 希望 有朝一日 能 为 中韩 的 联谊 文化 发展 做 些 工作 。
其实 说 是 4 年 ， 汉语 水平 没 那么 好 ， 是因为 我 一般 都 读 专门 学 汉语 的 外国 学校 ， 没有 跟 中国 朋友 交流 的 机会 ， 所以 口语 相当 差 ， 不用说 写文章 了 。
当然 日常生活 上 没有 特大 的 沟通 障碍 ， 但是 一旦 那笔 写 出来 文章 的话 ， 就 直接 露出 我 幼稚 的 写作水平 了 。
和 一般 中国 人 交流 时 ， 几乎 不会 遇到 很大 的 困难 。
当然 有 运气 ， 就 能 得到 “ 成功 ” ， 但 这样 做 会 拿到 成功 的 概率 很 低 。
如果 自己 觉得 不如 某人 的 时候 ， 自然 会 产生 竞争 的 心理 ， 那时 我们 会 比 平时 更 努力 。
古代汉语 一个 字 一个 字 都 勾引 我 到 文章 里面 ， 文章 给 我 文学 历史 知识 ， 那 知识 给 我 丰富 的 理解 中国 。
我家 有 四口 人 。
我 选择 外国语 高中 学校 的 原因 是 在 那个 学校 韩国 最 聪明 的 学生 都 来 了 ， 所以 学习 环境 很 好 ， 教育 的 质量 也 很 高 。
我 已经 通过 了 h ## sk ## 5 级 ， 准备 着 6 级 三个 多月 ， 所以 在 日常 情况 下 ， 我 能 用 汉语 比较 流畅 ， 可是 讨论 关于 专业知识 的话 我 就 遇到困难 。
结果 ， 我 觉得 “ 中国 专家 ” 不是 只能 说 汉语 ， 而是 能 说 汉语 的 基本上 ， 通过 了解 中国 政治 、 文化 、 经济 什么 的 。
我 的 不足 的 词汇量 和 语法 可以 改善 通过 自己 的 努力 ， 可是 对 正确 地 写 论文 ， 或者 文章 来说 ， 在 我 的 能力 下 ， 不能 改善 ， 所以 在 那个 部分 我 真的 需要 专家 老师 的 指导 和 修改 。
虽然 我 的 汉语 水平 还 没 达到 那么 高 的 水平 ， 可是 我会 认真 地 努力学习 ， 想要 达到 我 的 目的 。
从此 ， 我 的 心里 渐渐 发生 了 变化 ， 开始 努力学习 ， 通过 各种 测验 选好 了 更加 提高 汉语 水平 的 方法 ， 把 它 当成 我 的 专业 。
但 剩下 的 高考 或者 校内 优秀 成绩 的 方法 也 不能 放弃 ， 就 认真 地 抓住 了 这方面 的 学习 。
一说到 运气 ， 可能 会 有 很多 人 嘲笑 他 。
但是 我 觉得 运气 是 到达 成功 的 最后 一笔 。
那 是 我 报名 的 学校 中 最差 的 大学 ， 大部分 参加 面试 的 人 的 学校成绩 ， 汉语 考试成绩 都 比 我 差 ， 但 我 可 没有 骄傲 ， 很 认真 地 面试 了 。
面试 的 老师 也 对 我 亲密 友谊 ， 而且 对 我 直接 说 了 我 肯定 能 考上 这个 学校 ， 但 无缘无故 地被 淘汰 了 。
反而 ， 我 考上 的 大学 面试 中 想 ， 一个 问题 也 没 回答 ， 反而 考上 了 。
我们 在 很多 地方 都 听 过 ‘ 成功 是 由 99 % 的 努力 加上 1 % 的 运气 组成 的 ’ 。
我 的 国贼 是 韩国 人 ， 我 的 老家 是 首尔 。
我 学习 汉语 的 时候 最 感兴趣 的 是 汉语 有 历史 。
那 就是 看 更 多 的 电视节目 学 汉字 。
我 希望 在 这 堂 课 上 提高 我 的 写作水平 。
我 去 泰国 时 ， 我 去过 山族 村子 。
住 在 他们 村子 的 是 新 经历 。
泰国人 当 十六岁 时 ， 他们 结婚 了 ， 所以 我们 年龄 大 的 时候 他们 是 爷爷 和 奶奶 。
那个 消息 给 我 很大 的 冲击 。
我 去 蒙古 时 ， 我 去 了 乌兰巴托 。
我 最 难忘 的 事 是 夜晚 ， 因为 夜里 有 珊瑚 星河 。
我 在 蒙古 觉得 自然 的 广大 、 美丽 ， 还有 我 在 马上 感受 到 凉快 的 气氛 。
中国 是 楼 的 规模 和 韩国 的 不 一样 。
那儿 很 广大 ， 很 厉害 ， 我 在 江山 公园 看到 故宫 博物馆 感到 吃凉 。
但是 那个 梦想 改变 了 ， 现在 我 的 梦想 是 秘密 。
我 爱 的 方面 很少 ， 其实 我 只 相信 她 七年 。
从前 我 单相思 她 ， 如果 回国 时 的话 ， 我会 告诉 她 。
几个 青年 神仙 如 桌子 神仙 、 食物 神仙 等 都 忙 着 追 她 ， 可 天上 老大 女儿 哪 能 那么 容易 ？
而且 ， 女娲 根本 没 对 他们 感兴趣 。
女娲 哪 能 想到 过 一个 纯纯 扑 扑 扑 活 在 红尘 的 小伙子 会 打动 她 的 心 呢 ？
程郁 缩 得知 事情 的 真相 ， 一把 劲儿 叫 来 女儿 ， 痛骂一顿 ， 下 命令 把 林军 给 杀掉 。
父亲 ， 亲 您 原谅 我 的 过错 。
所以 我们 将来 要 成功 ， 我们 应该 发挥 马拉松 精神 。
可是 我们 绝对 不要 停顿下来 ， 而 应该 坚持下去 ， 因为 我们 很 年轻 、 很 有 机会 、 很 有 潜能 ， 只是 我们 还 没 自觉 认出 坚持 的 价值 来 而已 。
他 2011 年来 北京 的 那 一天 ， 正好 也 是 我 在 北大 的 第一天 上课 。
因此 我们 去上 地铁 了 ， 我们 一 上车 他 就 满脸 大汗淋漓
正好 那 时候 是 尖峰 时间 ， 所以 到处 都 充斥 着 在 跑 回家 的 人民 ， 我 自己 一生 只 坐 了 北京 的 地铁 ， （ 小时候 也 坐 了 伦敦 的 ， 但是 我 记不住 我 当时 是 什么 感觉 ） ， 所以 我 没法 拿 北京 的 地铁 和 别的 城市 的 来 比较 。
他 当时 觉得 特别 的 不 礼貌 ， 因为 在 我们 的 国家 不 可以 盯 着 别人 ， 但是 在 北京 好像 是 可以 的 ， 我 和 他 说 大家 可能 在 看 我们 ， 因为 他 有 很 红 的 头发 ， 我 有 头发 ， 所以 他们 不 习惯 而且 很 好奇 ， 所以 这 也 难怪 他们 。
他 说 在 他 印象 里古 北京 是 很 有 文化 的 ， 很 有 道德 的 一些 文人 和 诗人 ， 而且 那 时候 的 美女 一定 是 有 倾国倾城 的 。
他 走 之前 感谢 了 我 说 ， 在 我 热诚 地 招待 下 ， 他 有 了 宾至如归 的 感觉 ， 而且 虽然 他 不 喜欢 北京 的 很多 方面 ， 他 喜欢 的 让 他 觉得 他 可以 习惯 住 在 北京 。
大学生 考试 迟到 ， 这 也 表现 出 了 一种 大学生 不 太 有 责任感 的 人 ， 后果 往往 是 自负 的 ！
士兵 的 最大 目的 就是 作战 ， 人人 常常 说 军土 训练 十年 百年 都 是 为了 一场 战争 。
在 去年 我们 专业 有 一门 科目 叫做 现代汉语 课 ， 这 门 课 的 老师 非常 的 有 责任感 与 很 认真 地 对待 学生 们 ， 而且 这 门 课 的 老师 也 很 严格 ， 所以 学生 们 都 很 认真 地 听 老师 讲课 。
在 教室 门口 老师 跟 她 说 了 一些 话 ， 然后 这位 同学 就 低着头 很 失望 地 走出 教室 去 ， 她 这 学期 认真学习 这 门 课 的 目的地 就 全军覆灭 了 ， 我们 都 很 同情 她 ， 但是 我们 也 没 办法 ， 因为 这 是 学校 的 规定 ， 而且 我们 大学 没有 补考 ， 只有 重修 。
我们 知道 规则 是 用来 控制 不 遵守规则 的 人 ， 但是 有些 特殊 的 情况 时 ， 学校 应该 打开 更 宽容 的 胸怀 来 包容 学生 们 ， 这样 学生 们 会 更加 地 感觉 到 在校 里 生活 是 宾至如归 ！
在 理论 上 ， 生气 指 的 是 因 不合 心意 而 不 愉快 ， 但是 这个 定义 有点 模糊不清 ， 因为 我们 因为 不合 心意 也 可以 产生 各种 其他 的 情绪 ， 比如 伤心 、 失望 等 。
当然 每个 人 生气 的 时候 都 可以 自己 感觉 到 ， 但是 来 形容 这个 心态 并 不 简单 。
无论如何 ， 我们 生气 的 时候 的 表现 和 行为 ， 就 可以 把 我们 所 感觉 到 的 情绪 分为 三个 阶段 ， 也 就是 初级 ， 中级 和 高级 。
相对来说 ， 初级 指 的 是 过 了 段时间 后 就 没有 那个 生气 的 感觉 ， 中级 是 过 了 越 长 的 时间 ， 高级 是 过 了 很长 的 时间 后才 好 起来 。
后来 我 发现 全 飞机 一直 在 等 我 一个 人 ， 飞机 的 官员 就 愤怒 ， 和 我 说 不让 上 。
所以 我们 现在 一定 要 过 得 很 充实 ， 少 生气 ， 不能 避免 发怒 的 时候 就 去 听听 能够 让 自己 快乐 的 音乐 ， 去 玩 能够 让 自己 放松 的 运动 。
我 呢 ， 以前 认为 恋爱 是 个 不知不觉 地 令人 感到 快乐 的 幸福 。
在 初期 的 时候 相处 得 令人羡慕 。
然而 ， 过 了 一年 后 ， 他们 之间 的 关系 开始 有 变化 。
每当 下课时 ， 她 都 会 到 我家 一起 做 功课 。
但 后来 ， 当 我 和 她 在 一块 的 时候 ， 感觉 好像 一个 人 在 沙漠 里 一样 冷漠 。
当 我 提 她 几个 问题 的 时候 ， 有时 她 会 认真 回答 ； 有时 她 会 默默无语 ； 有时 她 会 赶 我 走 。
为了 安心 地 走 ， 他 还 勉强 我 ， 把 我们 俩 拆开 … …
不论是 跟 她 走 ， 哀求 她 父母 ， 凡是 让 地 回到 我 身边 的 主意 ， 不管 好坏 ， 我 都 会 做 。
这事 也 影响 到 了 她 的 “ 想 呆 在 这 ” 的 念头 。
但当 我 得到 了 她 的 爱和 信赖 ， 我 却 没有 好好 珍惜 。
我 相信 事终 会 否极泰来 的 ， 这 只是 我 的 第一次 恋爱 ， 我 相信 第二次 一定 会 比 第一次 好得多 。
很多 人 不 相信 我 没 受过 汉语 基础教育 ， 但是 我 真的 进 北大 预科 后才 真正 开始 学 汉语 ， 因此 最 基本 的 拼音 、 汉字 、 语法 等 我 都 没学 过 。
直到 我 能够 在 课堂 上 正常 发言 ， 还 需要 两周 的 时间 。
当 时候 ， 我 开始 学会 写 一二三四 这样 简单 的 字 。
除了 每天 在 课 上 学习 的 汉字 外 ， 还 会 看 一些 有 拼音 的 小儿 书 。
我 是 一名 泰国 留学生 ， 我 从 小学 一年级 开始 学 中文 ， 是 在 泰国 的 学校 学来 的 一 点点滴滴 的 最 简单 的 口头语 、 数字 、 水果 等 。
从 这 之前 我 也 学 过 汉语拼音 ， 是 很 优秀 的 翻译家 ， 思想家 。
她 很 爱 我 ， 我 小时候 当 婴儿 时 ， 她 还 养 过 我 一段时间 ， 因为 我 爱哭 ， 我 妈 受不了 ， 妈妈 要 把 我 舍掉 ， 幸运 有 她 。
所以 我 长大 后 ， 我 妈 讲 了 这些 故事 ， 我 才 知道 她 和 他 。
黄 老师 她 出版 了 很多 教 泰国 人学 中文 的 书籍 ， 教 外国人 学 泰语 的 书 也 有 各种各样 的 作品 。
最后 取得 第二名 ， 去 广州 免费 学习 两个 星期 是 礼物 。
回 泰国 老师 还 让 我 一个 人 在 台上 表演 给 大家 ， 全 学生 和 老师 看 ， 我 很 荣幸 ， 感谢 各位 老师 慈悲 。
我 大三 时 再 参加 汉语 桥 演讲比赛 ， 最后 取得 第二名 ， 这 一次 比 大 一时 更好 得 多 了 。
现在 我 还是 坚持 每天 有 时间 就 静下心来 去 聆听 各种 旋律 带给 我 的 心灵 上 的 放松 、 学习 上 的 帮助 。
在 食堂 ， 医院 ， 银行 ， 车站 ， 地铁站 ， 超市 等 需要 排队 等候 的 场合 ， 我们 常见 插队 现象 不是 那么 意外 的 事 。
我 从 火车 上 一 下来 ， 面对 寒冷 的 空气 ， 我 感觉 到 我 的确 到 哈尔滨 了 。
从此以后 ， 我们 一家人 去过 上海 ， 苏州 ， 杭州 ， 桂林 等 地方 ， 但是 哈尔滨 是 我们 第一次 一家人 一起 旅游 的 城市 ， 因此 哈尔滨 是 我 的 心里 永远 不能 忘记 的 城市 。
我 记得 ， 对 童年 的 我 来讲 ， 比 和 动物 玩 更 有趣 的 事情 是 我 爷爷 的 这种 在 城市 里 受不了 的 教育 。
我 小时候 在 英国 生活 ， 在 英国 有 很多 养成 足球 运动员 的 俱乐部 。
那天 ， 我 回到 家 跟 妈妈 说 ： “ 妈妈 ， 我 想 上 英语 培训班 。 ” 她 对 我 说 ： “ 好 ， 明天 我 带 去 吧 。
但 那 时候 我 的 年龄 小 ， 语言 吸收能力 比较 好 ， 我 的 英语水平 很快 就 提高 了 。
从 那 时候 起 我 跟 我 的 朋友 们 自由 地 沟通 ， 跟 朋友 们 和 教练 的 关系 也 发展 了 。
在 北京 这块 大 土地 上 繁忙 无暇 的 我 ， 多少 想 回到 那 片 小片 土地 ， 陶冶情操 ， 发现 真谛 。
比如说 ， 如果 学校 里 的 世宗 大王 的 铜 相 翻开 自己 手里 的 书 ， 那么 有 一天 我们 学校 里 的 学生会 死亡 。
学校 里 的 草场 上 还有 一点 人 来 运动 。
我 突然 觉得 我 的 背 很 清爽 ， 手 在 发抖 。
有 一天 傍晚 ， 奶奶 做 晚饭 时 ， 发现 厨房 里 盐 剩 得 不 能够 做 汤 。
直到 懂事 了 之后 才 知道 ， 那些 人 以 廉价 （ 最贵 的 也 就是 三块 钱 左右 ） 出售 快要 死掉 的 小鸡 ， 骗取 小孩子 的 钱 。
冬天 的 时候 ， 夏天 的 时候 玩 的 水 ， 因为 天气 太冷 了 ， 我们 就 在 那 滑冰 ， 玩雪 。
那 一年 发生 的 世界足球 杯 让 我 感觉 到 了 韩 民族 的 精神 。
历史性 事件 发生 的 那 闷热 的 七月 我 只是 个 爱 笑 爱玩 的 小男孩 。
和 朋友 一起 去 玩儿 电脑 也 是 在 我 初中 时 才 普遍 起来 的 。
一 开始 ， 我们 队 占 了 优势 ， 我 幼稚地 逗 弟弟 说 ： “ 不好意思 ， 今天 我们 也 赢 了 。
我 爸 深深地 说 过 人生 就 像 这 座 山 ， 中途 会 有 很多 坎坷 ， 都 要 克服 那些 困难 ， 才能 到 高峰 和 喜悦 。
我 从 小时候 就 很 喜欢 打扮 。
这样 的 颜色 我 从 小时候 到 现在 都 很 喜欢 。
可是 ， 到 现在 回到 这 故事 ， 虽然 受伤 的 记忆 太痛 ， 但是 觉得 好笑 而且 很 可爱 。
其中 有件事 很 快乐 ， 有件事 很 悲伤 ， 但是 其中 最多 的 是 有意思 的 事 。
现在 我 已经 二十多岁 了 ， 但是 我 还 记得 很 清楚 。
我 希望 再 一次 有机 会见 奶奶 的 微笑 ， 我 真 想 她 。
他 早上 醒来 ， 手 到处 摸 ， 寻找 眼镜 ， 居然 没有 找到 ， 看来 ， 今天 只有 生活 糊涂 之中 了 。
我们 玩 得 很 开心 。
虽然 到 现在 我 还有 伤口 ， 但 觉得 那件事 是 我 童年 有趣 的 事 。
在 各种各样 的 运动 中 我们 最 喜欢 的 是 足球 。
而且 老师 让 我 当成 我们 班 的 足球队 长 ， 我 感觉 很 开心 。
所以 胜利 四次 的 比赛 的话 ， 我们 可以 当 第一名 。
上半场 我 踢 得 真 不好 ， 而且 相对 队 进球 了 一个 。
在 门口 我 就 发现 日本 的 动物园 和 韩国 的 动物园 有 什么 差别 。
因为 我 姐姐 长 得 像 老虎 ， 所以 我 在 有 老虎 的 地方 的 前面 看 了 很久 。
这 是因为 我 第一次 看到 那么 广大 的 足球比赛 。
他 喜欢 用 唱歌 和 跳舞 教 我们 ， 我们 也 很 喜欢 跟 他 一起 唱歌跳舞 。
在 忙碌 的 学业 生活 中 我 累 时 ， 他们 还 可以 加油 。
今年 我 有 很多 趣事 ， 比如说 ， 我 有 机会 在 北京大学 能 上 中文系 的 课 ， 还有 前 几天 ， 我 找到 我 的 新 女朋友 。
虽然 他们 很 忘 了 ， 但是 为了 实现 儿子 的 心 ， 他们 来看 我 太 感动 了 。
在 我们 生活 当中 ， 有 很多 规定 ， 其中 有 很多 是 在 法规 上 不 存在 的 ， 比如 “ 在 公共场合 要 排队 ” 。
可是 目前 在 食堂 、 医院 、 银行 、 车站 等 需要 排队 的 场合 ， 插队 现象 屡见不鲜 ， 那么 到底 人们 为什么 如此 做 “ 插队 ” 呢 ？
也许 有 的 人 认为 插队 是 一个 小 事情 ， 但 “ 插队 现象 ” 不 只是 一个 或者 两个 人 的 小事 ， 而是 社会 的 很多 问题 结合 起来 ， 并 引起 的 现象 ， 我 通过 理解 问题 的 原因 解决 了 这样 的 问题 。
所以 老人 插队 的 时候 ， 年轻人 不好意思 跟 他 说 “ 别 插队 ” ， 结果 ， 老 人们 插队 的 现象 增加 了 。
我 觉得 解决 插队 的 问题 ， 应该 共同努力 。
年轻人 也 要 有 勇气 对 老 人们 说 ， 以后 不再 插队 吧 。
多亏 了 那个 公益广告 ， 中国 人 的 市民意识 提高 了 。
但是 别人 先 来 了 ， 当然 在 后边 排队 。
人类 是 高等动物 ， 都 通过 教育 可以 改变 。
日本 ， 韩国 也 没学 过 插队 现象 是 不好 的 事 的话 ， 他们 也 没有 市民意识 。
如果 急救车 和 警车 在 路上 的 后面 表示 处于 危急 的 情况 ， 前面 的 车 闪闪 的 事情 也 能 发生 。
再 如 有 的 人 排 了 很久 队 ， 然后 发现 有 的 人 插队 ， 这 也 让 人 生气 。
插队 可以 觉得 是 个人 的 问题 ， 但是 这样 小小的 事情 决定 了 一个 国家 的 印象 。
甚至 他们 收到 了 救护 品 ， 他们 排队 排得 很 好 。
所以 插队 发生 的 原因 就 在于 从小 的 教育 中 对 排队 意识 的 培养 。
我 觉得 无论如何 ， 人们 插队 以前 先 要 提醒 自己 ， 别人 也 有 自己 的 特殊 情况 ， 他们 的 时间 和 努力 是 像 自己 的 ， 也 是 宝贵 的 。
从 社会 的 角度 来看 ， 政府 要 努力 把 文明 水平 提高 。
此时 的 花果山 被 围困 地 水泄不通 ， 悟空 与 之 展开 混战 ， 直到 日落西山 。
李天王 重新 对 战略 布局 进行 了 整顿 。
于是 玉帝 采纳 了 许 旌阳 真人 的 主意 ， 封 孙悟空 去 管理 桃园 。
齐天大圣 诞闹够 了 便 回去 花果山 继续 玩乐 。
几个 仙女 来 桃 桃 圆 摘 桃 时 ， 告诉 了 孙悟空 王母 要 做 桃桃 盛会 。
因为 孙悟空 吃 过 的 仙果 和 金丹 让 孙悟空 变得 无懈可击 。
经过 一整天 的 战斗 ， 被 天兵 抓住 的 只有 虎 ， 豹 等 动物 。
张爱玲 《 倾城 之恋 》 的 主人公 男女之间 的 感情 ， 许多 学者 对 这个 问题 进行 了 不同 的 解读 。
张爱玲 在 1912 年 发表 的 中篇小说 《 倾城 之恋 》 ， 许多 文学家 对 它 发表 了 评论 。
张爱玲 没有 正面 描写 这个 相亲 与 跳舞 的 场景 ， 通过 回来 后 的 家 人们 的话 来 代替 这些 。
我 认为 这种 看法 也 有 一定 的 道理 。
迷失 了 作为 中国 人 的 自我 的 范柳原 来说 ， 在 香港 能 见到 的 洋派 女人 不能 给予 他 足够 的 民族 认同 。
白流苏 并 不是 一个 善于 吸引 异性 的 女人 ， 但 范柳原 被 她 吸引住 了 ， 在 一定 程度 上 是 与 “ 中国 味 ” 有关 的 。
张爱玲 把 爱情 剧 最 典型 的 求爱 场面 写 得 如此 紧张 。
因为 这些 ， 江流 苏 再 到 香港 以后 他们 的 关系 发展 很快 。
现实 的 人们 对 自己 最爱 的 情人 也 有 不 喜欢 之 处 ， 也许 缺点 比 优点 更 多 。
他 的 生活 变得 简单 平实 。
而 正 因为 这个 ， 这 篇 小说 才 得到 广泛 的 欢迎 。
除外 ， 这 篇 沦为 还 指出 通过 贾宝玉 的 思想 ， 可以 看出 作者 的 早期 民主主义 思想体系 。
她 代表 的 不仅仅 是 白流苏 个人 ， 也 反应 了 当时 那个 封建 没落 的 时代 里 传统 女性 凄凉 的 人生 命运 和 传统观念 。
上天 将 这个 风流潇洒 并 放荡 不堪 的 范柳原 送到 她 的 身边 。
仔细 从 小说 中 揣摩 张爱玲 对 白流苏 的 任务 塑造 便 可 知道 答案 。
由此 展开 了 两个 截然不同 性格 却 又 有 几分 相像 的 脾性 之间 关于 爱情 的 “ 战争 ” 。
但 在 他 的 心里 ， 对于 女性 极其 尊重 。
张爱玲 是 中国 现代 著名 的 作家 ， 作者 原名 叫 张爱玲 。
其 故事 发生 在 香港 。
这场 战乱 使 成千上万 的 人 牺牲 ， 成千上万 的 人 痛苦 ， 在 经济 方面 也 受到 了 一定 的 灾难 。
性格 叛逆 、 男人 解放 和 初 民主 义 思想 ， 在 贾宝玉 这 一个 人物 、 身上 都 有所 体现 。
贾宝玉 是 中国 文学史 上 一个 十分 独特 、 充满 矛盾 、 河 复杂性 的 艺术 典型 的 中国 文学家 。
然而 真实 生活 当中 的 她 正好 是 与 镜子 倒影 当中 光鲜 靓丽 的 她 成为 一个 明确 的 对比 。
她 选择 了 “ 向 死而生 ” 。
一般 战争 会 给 人 带来 灾难 、 痛苦 、 使 人 流离失所 、 死亡 。
在 这部 小说 中 却 相反 ， 战争 给 流苏 和 柳原 带来 了 幸福 。
贾宝玉 是 一个 性格 丰富 、 复杂 、 有些 矛盾 的 人 。
贾宝玉 没有 一般 男人 可以 做 的 事情 。
比起 女孩子 来 ， 男孩子 都 有 更 多 的 独立 倾向 ， 但 伴随 着 种种 独立 而来的是 孤独 。
为了 刺激 经济 的 高速 发展 ， 榨取 更多 的 剩余价值 ， 以 维护 这个 高速 运 的 资本主义 机器 ， 资本家 不断 采取 增加 劳动 时间 和 劳动强度 的 办法 来 残酷 地 剥削 工人 。
我 去年 五 · 一节 就 没有 出去 旅游 ， 就 在 家里 打扫卫生 。
但 我 想 应该 也 会 有人 不 喜欢 放假 。
每天 上课 ， 虽然 不是 什么 大 的 劳动 ， 但是 也 要 用 头脑 的 劳动 。
齐天大圣 ， 从 酒 中 醒过来 的 时候 ， 大会 已经 变得 乱七八糟 了 。
在 我们 的 生活 当中 最 亲密 的 单词 也 有 这样 的 差异 。
馒头 来源于 《 三国演义 》 。
而且 海上 贸易 重视 國際 祭祀 的 特点 也 加强 了 那样 的 说法 。
不仅 食物 上面 的 单词 ， 这样 的 差异 有 的 时候 会 引起 两国关系 的 恶化
之所以 “ 端午节 ” 这个 词 来自 于 春秋战国 时期 的 爱国 诗人 屈原 的 故事 ， 但是 现在 的 两国 端午节 的 内容 是 不同 的 。
当然 在 中国 也 提出 了 意见 。
第一声 “ 哎 ” 就是 感叹词 。
韩语 的 声调 没 受 任何 影响 。
因为 我 认识 一个 词 但 常常 说错 声调 就 别人 听不懂 。
一般 韩国 留学生 的 声调 问题 是 相同 的 。
道路 两边 有 很大 的 树 整齐 地 排列 着 。
其中 最 漂亮 的 是 盛开 的 朵 鲜花 。
这里 是 南山 地区 最 古老 的 佛像 之一 。
我们 也 在 夹杂 的 人流 中 、 前来 参拜 了 。
浏览 庆州 石 都 也 就 等于 在 探索 古代 灿烂 文化 的 遗迹 、 知道 了 新罗 王朝 时代 当时 的 文化 。
下午 7 点 ， 我 和 哥哥 依依不舍 地 踏上 了 归途 。
中国 人 习惯 用 木 筷子 来 吃饭 ， 而 韩国 人则 喜欢 用 铁制 的 筷子 。
中国 的 勺子 一般 大多数 是 汤勺 。
要 用 它 吃 像 炒饭 一样 的 用 筷子 很 难 去 吃 的 饭时 ， 中国 人会 用 手拿着 碗 去 吃 。
韩国 人 吃饭 时 拿 着 碗 吃饭 是 一种 不 文明 的 礼节 。
对于 吃饭 时 要 讲 的 礼节 来说 ， 中国 人 吃饭 最 年长 的 人 要 坐在 正对着 门 的 位置 。
因为 那个 位置 最 能 到 每位 来宾 ， 视野 最好 。
年轻人 会 主动 地 把 位子 让给 年长 的 人 。
我 非常 荣幸 在 这部 电视节目 介绍 代表 我国 送给 中国 礼物 。
珍岛 位于 韩国 的 南部 。
有 一个 人 买 了 一条 已 成长 完 的 珍岛 犬 。
它 走 的 距离 是 开车 得 走 三个 小时 的 非常 长 的 距离 。
根据 多种 原因 ， 珍岛 犬 在 1919 年 被 韩国政府 制定 了 天然 纪念物 ， 国家 开始 保护 珍岛 犬 了 。
现在 大家 都 了解 我 为什么 珍岛 犬 送到 中国 了 吗 ？
珍岛 犬 猎 一些 比 它 大 的 动物 时 ， 虽然 自己 身体 小 、 力量 不大 也 拼命 地 咬 对方 、 永不 放弃 。
总而言之 ， 我 希望 不管 韩国 人 或 中国 人 都 能 学到 珍岛 犬 的 精神 ， 而且 要 学 它 的 忠诚 精神 ， 忠诚 祖国 ， 爱护 祖国 。
要是 我 代表 韩国 送 中国 礼物 的 是 韩国 传统 混合 料理 与 混合 甜点 。
这些 就是 在 中国 有名 的 我 国家 演员 亲自 做 的 。
我 在 中国 见 中国 朋友 ， 听 中国大学 的 课 ， 去 看 中国 的 各个 地方 。
我们 一生 当中 ， 可以 见面 许多 邻居 ， 但是 不能 对 他 都 有 深刻 的 印象 。
我 从来 没见 过 好多 邻居 中 有 一位 奶奶 给 我 留下 了 难忘 的 记忆 。
我 是 小学生 的 时候 ， 我 是 个 非常 淘气 的 鬼 ， 喜欢 开玩笑 。
最后 我们 听到 了 那位 奶奶 发脾气 ， 对 我们 脸红脖子粗 的 吼叫 。
第二天 ， 我们 跟 平时 一样 都 集合 在 一起 ， 我 先 建议 今天 我们 又 去 我 的 邻居家 玩 电铃 跑步 的 游戏 。
我 被 她 整治 了 一个 小时 ， 那 时候 我 是 快 出哭 的 样子 。
我 看起来 他们 都 日子 过 得 非常 穷苦 ， 而且 平时 的 样子 挺 不起眼儿 的 。
我 以为 我 要是 开始 把 蜡烛 借给 他们 的话 ， 那 以后 他们 就 每天 找 我 要 借 什么 东西 了 。
那个 穷 小男孩 听见 我 说 的话 ， 忽然 笑 了 。
那 一天 以后 ， 我 常常 拿 着 小吃 的 东西 去 他们 家 一边 吃 ， 一边 聊天 。
读 莎士比亚 的 作品 使 人 感悟到 人生 的 辛酸 ， 读 鲁迅 的 文章 使 人 明白 社会 的 黑暗 。
要 保护 自己 国家 文化 的 意识 ， 要不是 读 这些 书 的 人会 更加 减少 。
不知不觉 二年级 的 第一个 学期 就要 结束 了 。
我 在 这 六个月 的 时间 里 学 过 了 很多 东西 ， 还 通过 这 段时间 让 我 自己 进一步 地 发展 。
因此 最后 自己 总结 下来 了 解决 这 问题 的 方法 。
翻倒 的 水 不能 再 把 装 在 瓶子 里 了 。
最后 ， 我 非常感谢 这 段时间 ！
可是 那 时候 她 已经 到 挡不住 怀疑 别人 的 念头 了 。
这个 作品 的 中心 内容 是 女生 是 一种 常 感到 孤独 的 动物 ， 没有 得到 异性 的 爱情 的话 ， 没有 浇水 的 玫瑰 一样 会 变得 枯萎 。
白流苏 的 社会 还是 以 男人 为主 的 。
古代 是 以 力量 为 分 阶层 的 社会 。
由此 范柳原 把 女生 看成 “ 脚底 下 的 泥 ” 。
但是 张爱玲 在 这种 幻想 小说 当中 添加 了 批判 社会 和 自己 贴实 的 故事 给 读者 展开 了 又 美丽 又 让 我们 领悟 人生 的 美妙 的 世界 。
《 倾城 之恋 》 是 张爱玲 的 短篇小说 之一 。
由于 尴尬 的 身份 ， 他 的 童年 可以 说 充满 “ 羞辱 、 疑惑 和 强烈 的 罪恶感 ” 。
我 高中毕业 之后 来到 北京 ， 遇到 了 无数 的 困惑 ， 但是 小时候 的 我 ， 却 很 自然 地 接受 了 并 适应 了 中国
由于 母亲 工作 的 关系 ， 我 在 小学 三年级 的 时候 住 过 北京 。
虽然 我 不会 说 汉语 ， 连 同学 们 的 名字 都 不 清楚 ， 但是 每天 一起 跑来跑去 ， 现在 想 起来 ， 我 和 大家 之间 成立 了 一种 非 语言 的 沟通 。
坐在 母亲 骑 的 自行车 的 后边 走过 的 路 、 爬 过 的 纪念碑 、 学 过 的 “ 鹅 ， 鹅 ， 鹅 … … ” 的 歌 ， 我 一下子 都 想 起来 了 。
我 选择 了到 北京 留学 ， 才能 想起 那些 快乐 的 、 幸福 的 记忆 来 ， 是 一件 非常 幸福 的 事情 。
轻声 走 过去 ， 半 蹲下来 仔细 看看 哪里 有 动静 ， 如果 看到 了 蚂蚁 在 爬动 ， 也 要 按兵不动 ， 等 有 十足把握 了 ， 再 伸手 上前 遮住 那 只 蚂蚁 。
我 从 幼儿园 一年级 到 出生 三年级 就 在 一所 温爱 的 学校 ， 强民 学校 离 我 的 家 有 两 公斤 。
我 记得 我 的 妈妈 送 我 到 学校 ， 当时 我 是 幼儿园 三年级 ， 我 很 爱哭 ， 不想 去 学校 ， 到 下课时 ， 妈妈 来接 我 ， 我 却 哭 了 ， 因为 我 不想 回家 。
我 小学 三年级 最深 的 印象 是 我 跟 男同学 吵架 ， 我 忘 了 他 做 错 了 什么 ， 让 我 那么 生气 到 用 脚踢 他 两三次 ， 他 差一点 就要 打 我 了 ， 但是 没有 。
他 是 小学 五年级 的 学弟 ， 我们 怎么 恋爱 成 男女朋友 我 也 忘 了 是 怎么 回事儿 ， 反正 我 记得 他 是 爱 运动 的 男孩 ， 他 踢足球 很 厉害 ， 打乒乓球 也 不错 。
有 一次 他 吃 的 冰淇淋 被 我 的 朋友 送给 我 ， 我 不 知道 是 他 的 ， 我 吃 了 一口 ， 然后 朋友 告诉 我 是 他 的 ， 所以 我 就 很 害羞 。
我 是 全班 就 ai 的 女孩 到 体育课 ， 我 带 全班 跑步 ， 其实 不 叫 “ 带 ” ， 反正 我 在 最 前面 。
我 在 上课 ， 小学 五年级 就是 下课 休息时间 ， 他 和 他 的 朋友 总 看 我们 上 体育课 ， 使 我 有点累 。
每周五 我家 附近 有 寺庙 ， 寺庙 举行 夜市 ， 所以 每周五 下课后 就要 买 东西 ， 跟 朋友 们 走走 。
我 连续 当 拉拉 拉 对 四年 和 其它 跳舞 唱歌 的 活动 是 我 印象 中 最 有趣 的 事情 。
小时候 妈妈 教 过 我 一首 罗大佑 唱 的 名为 《 童年 》 的 歌 ， 当时 只 觉得 这 首 曲子 很 好听 ， 朗朗上口 ， 但 发现自己 越 长大 越 开始 明白 歌词 的 意义 。
也 有 我 自己 答出来 的 时候 ， 那 自豪感 不 打 一处 来 啊 ！
听 妈妈 跟 我 讲 ， 在 我 很小 的 时候 有 一次 坐在 爸爸 的 肚子 上玩 的 时候 ， 爸爸 深吸 了 一口气 ， 结果 把 我 给 吓哭 了 。
大家 已经 紧张 起来 了 ， 时间 快 到 晚上 了 ， 小朋友 的 父母 已经 开始 叫 他 回家 了 。
算是 那次 的 经历 是 一种 教训 。
小孩子 是 创造 玩具 的 天才 ， 从 什么 都 没有 的 地方 做出 有趣 的 东西 。
小孩子 之间 也 有 一种 流行 。
老师 批评 了 我们 ， 后来 大家 都 不会 在 教室 里 做 了 。
这 泥土 团块 又 黑 又 圆 又 滑 又 光 ， 很 美丽 ， 后来 这 泥土 团块 变为 班里 的 宝贵财富 。
或者 也 可以 说 童年 时候 无论 什么 无趣 的 东西 都 可以 做成 有趣 的 东西 。
在 我 大学 的 那 一年 ， 母亲 还 特地 花钱 买票 带我去 看 美国 剧团 上演 的 儿童剧 《 冰上 芝麻街 》 。
我 总会 在 那儿 卖 一些 零食 填饱 肚子 。
而 这 也 是 我 在 当时 最大 的 快乐 来 源泉 之一 。
有 一种 动物 叫做 蜂子 ， 这种 动物 非常 勤劳 ， 也 非常 互相 之间 合作 。
在 社会 当中 能 有 几个 真心 永远 不变 的 对 你 有福同享 ， 有难同当 的 好 朋友 ， 只 到 天荒地老 ， 你 还是 在 他 心中 永远 不变 的 好 朋友 。
我 觉得 友谊 之间 最 宝贵 的 东西 是 贵在 心意 上 。
在 泰国 我 有 一个 非常 要 好 的 朋友 。
他 今年 25 岁 ， 刚 从 泰国 曼谷 商业 大学毕业 。
我 在 2005 年 的 时候 认识 他 的 ， 我们 是 在 万 佛 慈恩寺 中学 认识 的 ， 我 刚 认识 他 的 时候 是 初一 ， 那时 他 已经 是 高 二 的 学长 了 。
中国 是 世界 上 人口 最多 的 国家 ， 北京 里 的 人 也 非常 多 ， 特别 是 经济 文化 中心 。
地铁 里 的 人 也 非常 多 ， 中国 人 说话 的 时候 也 很 大声 的 说话 ， 好像 装作 旁若无人 一样 地 大声 说话 。
到 我 来 了 北大 以后 才 发现 北大 建筑 也 现代化 了 。
这 几部 电视剧 和 小说 都 很 吸引 我 ， 但 唯一 我 最 不感兴趣 的 就是 《 三国演义 》 。
通过 罗贯中 在 这 两个 回目 高超 的 语言艺术 处理 ， 作者 从 不同 角度 揭示 了 诸葛亮 的 性格特点 ， 使 其 人物形象 更为 丰富 和 饱满 。
无论 对 三国 时代 了解 与否 ， 一旦 看 了 这部 电影 的 人 都 赞美 不止 、 十分 欣赏 。
我 通过 比较 《 三国志 演义 》 中 的 两回 ， 分析 一下 罗贯中 如何 刻画 诸葛亮 这个 人物 ， 这 两者之间 存在 什么样 的 区别 。
首先 ， 作家 借助 其他 人物 的 语言 以及 他们 所处 的 环境 ， 表达 了 诸葛亮 才华横溢 、 料事如神 的 面貌 。
诸葛亮 的 形象 被 别人 的 对话 、 评价 而 塑造 ， 这 导致 他 渗透 在 故事情节 里 。
这样 的 情结 里 ， 罗贯中 起到 了 两者 对比 的 作用 。
由此可见 ， 诸葛亮 引导 故事情节
这些 句子 强烈 反映 出 诸葛亮 在 建国 立业 谨慎 持重 ， 并 具有 无比 的 使命感 。
从此以后 每次 吃豆腐 的 时候 我 都 有 一样 的 感觉 。
而且 从 我 的 角度 来看 最后 几百年 豆腐 才 由 日本 传入 西方 。
凝固 以后 它 就 变成 豆腐 。
中国 有 很多 各种各样 的 豆腐 ， 比如说 ： 毛 豆腐 、 酿 豆腐 、 豆花 、 麻婆豆腐 、 干 豆腐 、 豆腐皮 和 冻豆腐 ， 而且 很 有名 的 臭豆腐 。
我 小时候 不 像 同龄 朋友 们 一样 偏食 ， 一般 孩子 们 不 爱 吃 的 蔬菜 和 水果 我 都 胡吃 。
我 妈妈 也 平时 做菜 爱多 放 洋葱 。
我 来 中国 留学 后 也 被 洋葱 欺负 了 。
一 开始 中国 菜 就 很 不 习惯
随着 科学 的 发展 ， 人们 从 贫困 的 环境 中 可以 摆脱 出来 ， 现在 享受 着 充足 的 食物 。
我 妈妈 说 我 小 的 时候 ， 我 妈妈 勉强 吃豆腐 ， 所以 现在 才能 吃 。
结果 那 一天 没 吃 午饭 。
而且 连续 喝水 为了 减少 辣 的 痛 ， 所以 很 吃饱 。
随着 世界 上 的 发展 水平 的 提高 ， 人们 生活 得 越来越 富裕 和 丰富 。
其中 好几个 富人 再也 不 讲究 基本 的 衣食 住 ， 为此 他们 开始 寻找 又 奇特 又 贵 的 食物 。
为了 得到 那样 的 食物 ， 无奈 危害 自然生态 系统 ， 而 能 制造 社会 内 的 抵触情绪 。
所以 我 不 喜欢 食用 它们 是因为 我 不 习惯 ， 而 不是 这些 东西 本身 的 原因 。
为此 ， 人们 制造 了 适合 自己 口味 的 喜好 食物 。
我 特别 不 喜欢 这种 人造 的 味道 的 汉堡包 ， 所以 我 只 吃 过 几次 。
不过 老人 杀 狗 的 时候 ， 杀 别的 动物 不 一样 。
因此 我 的 亲密 的 朋友 ， 跟 我 见面 的 时候 ， 大多 去 西方 食堂 还是 手 切面 食堂 等等 。
但是 以前 的 不好 的 回忆 让 我 对 举棋 抱有 不定 的 态度 。
其实 现在 也 讨厌 辣 的 菜 ， 可是 比 上次 的 留学 能 吃 。
而且 这次 留学 可能 是 最后 一次 。
因此 我 可以 来到 中国 学习 ， 甚至 我 在 生活 方面 都 没有 困难 。
以往 任何 时候 都 更 重视 想象力 ， 所谓 “ 创新 时代 ” 。
中国 是 发展中国家 ， 有 很多 地方 建 一些 高楼大厦 、 公寓 等等 … … 因此 打工 时 发生 的 噪音 给 我们 的 耳朵 很大 的 刺激 。
《 失恋 33 天 》 的 两个 主角 都 是 城市 白领 ， 在 枯草 的 生活 中 寻找 着 浪漫 。
调查 显示 ： 三成 受访者 学习 又 做作业 ， 他们 多数 表示 出 了 留学生 也 用功 学习 。
只有 5 % 的 受访者 表示 做 工作 ， 如 英语 辅导 ， 这 类人 的 国家 是 加拿大 ， 比例 最小 。
《 海豚 湾 》 是 于 2009 年 由 路易 · 皮斯霍 新 导演 拍摄 的 纪录片 。
但当 他 心爱 的 海豚 自杀 以后 ， 里克 深深地 认识 到 海豚 需要 的 是 大海 而 不是 人们 为 它 创建 的 狭隘 的 环境 。
在 韩国 有 句 老话 ： “ 世上 没有 人 因为 他 害怕 昆虫 ， 不能 做到 发酵 酱 的 ！ ” 这样 ， 新 变化 可能 有大 副作用 ， 但是 我们 要 积极 接受 变化 ， 而且 开导 世界 。
这 就是 人生 ， 盖茨 比 的 人生 当中 爱情 超越 了 世俗 带给 他 的 无穷的 魅力 。
我 刚 开始 住 在 中关 新园 的 时候 ， 前边 和 旁边 没有 人 居住 。
结果 吵架 了 ， 双方 都 感到 很 费劲 。
本人 来 北京 马上 就要 两年 多 了 ， 北京 的 生活 比较 舒服 ， 但 外国人 对 中国 的 印象 却 有些 问题 。
还 例如 本人 上 个 学期 亲身 骑 电动车 去 上课 的 时候 ， 一辆 汽车 突然 向 我 飞驰而来 ， 当时 我 未及 避开 那 汽车 就 装上 了 ， 但是 那车 的 驾驶者 看到 我 是 外国人 ， 这 发生 的 情况 反而 都 询问 我 责任 ， 并且 他 逆向行驶 ， 我 正 给 中国 朋友 打电话 时 ， 他 驾车 仓皇 逃走 了 。
对 外国人 来说 ， 这些 问题 来 会 判断 中国 人民 的 文化素质 非常 差 ， 其实 本人 知道 那些 人 只是 少数 而已 ， 但 我 担心 站 时 留在 北京 的 外国人 会 戴 着 有色眼镜 来看 中国 人 。
有 的 人 说 社交 网络 是 ‘ 潘多拉 的 盒子 ’ 如果 ， 不 好好 利用 社交 网络 的话 会 面临 很多 问题 和 麻烦 。
我 当时 大吃一惊 ， 我们 都 是从 各地 来 的 中国 留学生 同样 身份 的 留学生 ， 哪里 会 有 仅限于 韩国 留学生 穿 的 衣服 呢 ？
全世界 卡通片 排行榜 中 的 第 15 位 居民 中 的 第 2 名 。
皮克斯 动画 工作室 的 代表 也 说 过 el ## fi ## e 是 一部 完美无缺 的 卡通片 。
我 也 知道 每天 打扫 宿舍楼 是 非常 辛苦 的 ， 但 如果 因为 管理 的 疏忽 ， 而 给住 宿舍楼 的 学生 带来 不便 与 不 快乐 的 我 ， 我们 哪 有 必要 交 那么 多 钱 呢 ？
我 是 一 名贵 公司 的 老 顾客 ， 我 想 经常 故意 地 告诉您 前 几天 发生 的 事情 。
但是 在 很 开心 地 吃 中 ， 突然 嘴里 感到 奇怪 ， 咬 时 感到 有 一个 小 硬 的 东西 ， 咬 不了 ， 所以 我 吐出 一看 ， 就 发现 那 硬 的 东西 是 小 的 塑料片 。
其实 ， 如果 他 说 “ 对不起 ” 这 一句 话 就 不会 让 我 情怀 不 宁 。
我 认为 贵 公司 是 比较 大 的 企业 ， 应当 需要 具备 与 名副其实 的 服务 环境 。
我 已经 看过 本 电影 十几遍 ， 但是 如果 有空 ， 我会 再 看 一次 。
问题 从 占 菜 的 时候 ， 就 出现 了 。
作为 贵店 的 一名 顾客 ， 我 希望 改善 贵店 的 环境 。
最后 我 想 说 一句 ： “ 对待 好 顾客 比用 自来水 节省 的 钱 更 要紧 。 ”
调查 分析 人员 认为 ： 留学生 感觉 应该 出去 ， 但是 ， 调查 中 ， 上网 的 比例 达到 25 % ， 这个 数字 不 太 少 。
电动车 是 很 受 学生 欢迎 的 交通工具 。
所以 应该 多 使用 别的 交通工具 。
各种 个人 互相 找 朋友 ， 介绍 自己 的 朋友 ， 为了 让 自己 的 人际关系 广阔 而 人们 参加 社交 网络 。
真 ， 用 武力 来 压迫 老百姓 的 示威 的 突尼斯 独裁政权 被 用 社交 网络 传播 自国 的 情况 的 人民 打败 了 。
还有 ， 若 用 智能手机 使用 社交 网络 的话 ， 时间 和 场所 不能 被 人们 认为 是 交流 的 障碍 。
但是 社交 网络 的 坏处 也 存在 ， 而且 比较严重 。
第二 是 信息 的 可靠性 低 ， 社会 网络 是 所有人 可以 上 信息 和 传播 信息 ， 我们 不可 判断 那 信息 是 对 的 或 错 的 ， 第三 是 恶用 社会 网络 的 公司 ， 他们 只 看 钱 ， 用 在 商业 上 。
家长 只是 负责 给 学生 报 各种 补习班 ， 放学 后 ， 孩子 不 回家 ， 直接 去 各种 补习班 学习 ， 小学生 的 时候 就 9 点钟 回家 ， # 随着 年龄 的 增长 ， 回家 的 时间 更 晚 。
所以 ， 韩国 的 孩子 和 父母 基本上 没有 沟通 ， 甚至 会 好长时间 见 不到 工作 辛苦 的 爸爸 。
每天 监督 孩子 完成 学校 的 作业 并且 还 多 布置 家庭作业 ， 以 提高 孩子 的 成绩 。
他 的 恶梦 正是 关于 三百万 灾民 的 缩影 … …
有 一个 女人 在 推荐 说 她 想 去 自杀 , 她 推 特上 的 朋友 们 之中 有 几个 在 留言 区 问 她 发生 了 什么 事 ， 但 也 有 一部分 人 把 她 的话 当成 玩具 。
社交 网络 # ? # 我们 容易 就 可以 建立 、 断绝 朋友 关系 ， 有些 社交 网络 保障 匿名性 。
这 是 为了 减少 国民 的 吸烟率 ， 以 防止 人民 的 被动 吸烟 的 目的 制定 的 法律 。
宿舍 的 环境 很 好 ， 从 宿舍 到 学校 也 挺 近 ， 宿舍 也 很 干净 ， 但是 费用 时 很贵 。
宿舍 的 一个月 费用 是 三千元 钱 ， 对 留学生 来说 ， 三千元 钱 是 很贵 的 。
中国 的 国民 体育 应该 与 竞技 体育 共同 发展 ， 使 国家 选手 在 国际 比赛 上 获得 金牌 的 同时 ， 人民 也 能 将 运动 化为 生活 的 一部分 。
加拿大 多数 的 运动 场所 仍 在 公共场所 ， 使用者 无需 缴费 。
目前 ， 随着 现代 的 生活节奏 发展 ， 人们 需要 的 就是 最快 的 联系方式 ； 随着 科学 的 发展 ， 联系方式 也 日益 增多 。
所以 我们 会 说 社交 网络 已经 是 我们 现代人 生活 中 的 一部分 ， 而且 从 社交 网络 那里 现代 人们 会 得到 更多 的 东西 。
最后 ， 使用 社交 网络 的话 ， 会 使 你 的 人生 更 快乐 ， 更 有意思 ， 而且 对 比较 有 年纪 的 人 来说 ， 通过 社交 网络 ， 因为 跟 年轻人 交流 他们 也 会 变 年轻 而且 幽默 ， 跟 年轻人 容易 地 交流 。
我 是 一名 来自 韩国 的 留学生 ， 想 向 中国 的 信号灯 系统 提 一个 建议 ， 希望 为了 解决 中国 的 交通 问题 ， 您 对 信号灯 问题 的 重视 。
我 来 中国 不久 ， 发现 很少 人 遵守 交通规则 ， 车 、 人 等 都 闯红灯 过 马路 。
当时 ， 我 心里 充满 了 恐惧 ， 同时 对 中国 非常 失望 。
到 21 世纪 ， 网络 普遍 被 使用 ， 一般 没有 不 使用 网络 。
我们 所 认识 的 社交 网络 有 facebook 、 推 特 、 qq 等等 ， 现在 全世界 各国 人 用 这 社交 网络 来 交流 发言 自己 想 说 的 。
网络 的 普及 带来 了 社会 网络 的 普及 ， 每次 用 社交 网络 的 人 越来越 多 ， 如果 创造 有名 的 社交 网络 ， 那 可以 挣 好多钱 ， 比如 facebook 的 创造 人 马克 · 扎克 伯格 。
无论 你 在 哪里 ， 我们 都 可以 联系 ， 由于 这样 的 好处 ， 很多 人 迷上 了 社交 网络 。
跟 陌生人 交流 、 跟 朋友 交流 是 无必 说 的 。
这样 的 个人信息 是 很 重要 的 ， 但 社会 网络 公司 为了 歉 钱 ， 卖 给 我们 的 个人信息 ， 主要 卖 给 广告公司 ， 他们 参考 我们 的 个人信息 来 做广告 。
有人 通过 社交 网络 来说 自己 是 那样 的 人 、 喜欢 什么 歌 、 自己 对 某 方面 有 什么样 的 观点 等等 。
可以 拿出 你 的 手机 ， 打开 微信 后 瞬间 了解 所有 朋友 都 在 做 什么 ： 正在 哪里 吃饭 、 情绪 如 、 失恋 和 交往 情况 、 买 了 啥 、 等等 细节 。
我 个人 亲眼 见 过 社交 网络 给 我们 男女 浪漫 方面 带来 的 不便 有 了 社交 网络 以后 ， 很多 男人 和 女人 变得 非常 懒 ， 以及 慢慢 失去 自己 的 社会性 ， 和 社会 交流经验 。
虽然 ， it 系统 操作 很 难 ， 但是 ， iphone 系统 的 软件 大部分 都 是 免费 的 ， 而且 比 贵 公司 的 软件 好 用 多 了 。
我 个人 觉得 这 就是 开辟 创造 世界 的 第一步 。
并且 ， 有些 驱动 存储 也 相当 大 ， 下载 的 时候 要 等 很 长时间 。
搞 电脑 的 人 来说 这 时间 太 浪费 了 。
我 向 贵 公司 提出 警告 ， 就 这 一回 ， 回不为 例 。
我 希望 贵 公司 更 关注 电脑 的 安全性 。
这部 电影 的 背景 是 21 世纪 ， 在 电影 里 为了 解决 越来越 恶化 的 地球 温暖 化 ， 天上 放 了 一些 化学物质 ， # 竟 ## 然 那个 化学物质 引导 了 地球 冰河期 。
当然 也 没有 人 的 尊严 。
我 觉得 这 列 火车 像 很少 的 富人 # 统 # 治 大多数 的 人民 ， 为了 富人 的 利益 好多 ， 没有 实力 的 人们 承受 # 痛 # 苦 。
还有 每 列车 房 表示 各个 的 社会 阶段 ， 越 往前走 越 好 的 环境 ， 条件 。
看着 这部 电影 就 想起 这个 观点 。
对 我 来说 现在 的 社会 是 不 太 理想 ， 这部 电影 给 我们 想 什么样 的 社会 是 美好 ， 理想 ， 还有 环境 的 问题 ， 现在 除了 地球 温暖 化 以外 ， 很多 环境 问题 ， 但 并 没有 解决 。
我 认为 工业 工厂 是 污染环境 的 最 主要 原因 ， 因此 在 工厂 周围 需要 宽阔 的 空气 ， 并且 我们 能够 管理 好好 的 森林 。
而且 ， 现在 市民 的 文化 水平 越来越 高 ， 也 有 很多 外国游客 。
北京大学 没有 采取任何 措施 来 推动 新 教育 的 发展 。
当然 上述 措施 不 全面 ， 但 我 希望 能 引发 辩论 与 反思 ， 让 未来 与 您 进行 对话 。
此时 都 会 发现 人们 不 遵守 交通规则 ， 导致 交通 混乱 ， 甚至 交通事故 。
这 不算 是 大 问题 ， 大 问题 就是 人们 不 遵守规则 。
1. 在 拥挤 时间 ， 为了 让 人们 遵守 交通规则 ， 派 至少 两个 警察 或者 交通 管理者 。
显然 ， 如果 人们 意识 到 路上 有人 管理 交通 ， 他们 会 遵守 规律 得 多 。
最后 ， 可怜 的 相恩 失去 了 妈妈 ， 边 哭 着 边 在 妈妈 的 手中 写道 ： “ 我 非常 幸福 能够 成为 你 的 女儿 ， 也 感谢 你 能够 做 的 漂亮 妈妈 ， 经历 了 “ 离别 ” ， 变得 格外 成熟 的 妈妈 把 骨粉 撒 在 自己 最 喜欢 的 芳草 田 上 。
倘若 跟 朋友 约会 时 ， 没 带 手机 ， 一定 会 发疯 的 。
有人 假装 好人 ， 受不了 学习 压力 的 小男孩 和 小女孩 ， 听 此 骗人 的 巧舌如舌 ， 就 被 骗 ， 犯人 对 他们 作祟 骂 行为 ， 拍 他们 的 照片 后 ， 把 照片 卖出去 ； 若 没有 社交 网 ， 小 男女 不会 接触 坏人 ， 若 没有 接触 坏人 ， 不会 被 骗 ， 若 没有 被 骗 的话 ， 不会 发生 诸多 令人 伤心 的 事件 … …
但 不 正确 的 使用 反而 孕育 了 危险 的 机会 。
现在 我 写 这 封信 ， 是 为了 向 你们 反映 在 探访 的 过程 中 遇到 的 困难 ， 愿 你们 能够 重视 我 提出 的 问题 ， 并 接纳 我 的 建议 ， 以便 建立 更 舒适 的 医院 环境 。
最后 要 反映 的 问题 是 关于 医疗费 的 问题 ： 外国人 因 没有 保险 而要 交 的 医疗费 是 很高 的 ， 故会 有 交费 延期 的 情况 。
但是 在 利用 你们 店 的 服务 时 就 发现 了 很多 不足 ， 我 想 给 您 提出 几个 意见 ， 希望 您 对 我 的 意见 引起 重视 ， 改善 店 内 饮食 环境 和 服务态度 。
为了 来 休息 的 顾客 和 为了 来 就餐 的 人间 不会 发生 互相 影响 ， 希望 你们 店 采取措施 加以 管理 。
服务态度 方面 出现 的 问题 比较严重 也 正是 因为 此 我 打算 提笔 给 您 写信 。
我 知道 每天 都 有 不同 的 客人 进来 让 你们 感到 辛苦 ， 但 希望 你们 把 这些 客人 服务 得 离开 店门 时 都 是 同一个 笑脸 ， 还 想 再 来 。
希望 能够 引起 北京 空气污染 的 重视 。
其中 ， 我 还是 不 习惯 北京 的 空气污染 ， 北京 的 空气 无论是 春夏秋冬 都 严重 。
比如 ， 一个 在 法国 的 大学生 ， 在 上学 的 公交车 上 ， 可以 与 在 墨西哥 的 公司 职员 在 社交 网上 自由自在 地 讨论 欧美 国际贸易 ， 这 就是 最新 it 技术 以及 社交 网络 普及 在 全球 的 力量 ， 从 这 可以 看出 ， 社交 网络 能 带给 每个 人 积极 的 影响 。
第一 ， 建立 了 广阔 的 人际关系 ， 以前 通过 互联网 形成 的 虚拟 社交圈 只是 双边 的 交流 ， 那时 没有 在 全球 范围 内 普及 。
甚至 灭亡 了 一个 国家 ， 比如 突尼期尼主化 事件 。 突尼斯 的 市民 们 通过 sns 很快 就 形成 了 舆论 。 除了 突尼斯 独裁政权
社交 网络 是 为 世界 各国 人 设立 的 一种 新 工具 ， 但 世界 人口 4 分 之 1 的 人 使用 的 社交 网络 造成 了 严重 的 社会 问题 。
社交 网络 可以 说 是 个 “ 双刃剑 ” ， 它 能 不能 当成 新 世代 的 交流 手段 是 看 我们 怎么 做 的 ， 我们 要 看 社交 网络 的 好 方面 ， 利用 它 本来 提供 的 自己 的 功能 ， 不要 弄 得 过分 。
随着 技术 的 发展 ， 社会 出现 了 新 的 现象 ， 就是 某个 人 在 网络 上写 自己 的 日记 ， 今天 自己 的 情绪 等等 。
甚至 把 自己 的 照片 上传 在 网络 上 ， 这样的话 ， 不但 表现 在 自己 的 情况 而且 表现 出 自己 的 情绪 ， 然后 无论 认识 的 人 或 不 认识 的 人 都 可以 一起 交流 、 分享 ， 目前 这样 的 现象 我们 叫 社交 网络 。
第一 ， 隐私 侵犯 ， 社交 网络 的 特点 之一 是 可以 跟 别的 人 一起 分享 自己 的 消息 ， 但 ， 重要 的 是 不 知道 的 时候 可以 把 自己 的 隐私 消息 被 侵犯 ， 在 韩国 有 一个 有名 的 男歌手 ， 他 在 自己 的 社交 网络 上 是非 公开 地上 了 一张 照片 ， 照片 就是 跟 女演员 只 穿着 内衣 拍 的 照片 ， 由于 社交 网络 上 的 差错 ， 那个 照片 公开 着 登上 公开 ， 以后 他们 的 粉丝 对 他们 失望 了 ， 就是 跟 女演员 只 穿着 内衣 拍 的 照片 ， 不能 下 他们 不 受欢迎 。
其实 ， 我们 在 这样 繁华 的 现代 社会 里 经常 能 碰到 这种 事情 。
加拿大 是 人人 所知 的 一个 堂堂 堂 的 世界 强国 ， 但是 使 人 感到 差异 的 是 它们 只是 一块 金牌 的 国家 。
也许 注重 “ 金牌 ” 的 奥运 强国 中国 或 韩国 ， 这些 人 的 娱乐活动 是 晚上 喝酒 ， 熬夜 玩游戏 ， 这种 对 身体健康 有害 的 ， 反而 加拿大人 享受 的 是 “ 绿色 游戏 ” 。
第三 ， 奥运 精神 并 不是 指 疯狂 的 金牌 。
我 认为 这个 是 应该 的 ， 为了 跟 别的 人 一起 联系 ， 社交 网络 就是 最 方便 的 ， 而且 比较 便宜 — — 例如 ， 人们 给 别人 打 个 电话 的 情况 比 以前 少 一点 ， 因为 有时候 ， 这样 的 联系方式 比较 贵 一点 。
社交 网络 不 但是 免费 的 ， 而且 比 写信 方便 。
我 个人 认为 这样 的 现象 不太好 ， 因为 一直 在 家里 拿 着 手机 跟 别人 聊天儿 很 长时间 的话 ， 他 在 现实生活 中 跟 别人 聊天儿 的 时候 ， 会 觉得 不 舒服 。
我 认为 社交 网络 有 很多 的 好处 ， 也 有 很多 的 坏处 ， 我 相信 适当 使用 社交 网络 ， 才能 在 社会 上 成为 给 人们 帮助 。
爱因斯坦 说 ： “ 我 担心 有 一天 科技 充斥 人间 时 ， 世界 将 只 生下 笨蛋 的 一代 ” ， 所以 我们 一定 要 主义 。
2004 年 ， facebook 在 美国 诞生 后 ， 随之 社交 网站 热潮 席卷 全球 。
虽然 中国 不能 上 facebook ， 但是 这样 的 情况 下 中国 自己 也 上网 和微博 了 ， 日本 也 建立 了 自己 国家 的 社交 网站 。
这种 在线 聊天 、 博客 撰写 、 网络游戏 等 多种 网络 社交 工具 造成 了 一体 新型 虚拟社区 形态 ， 对 现实 社交 结构 造成 了 巨大 冲击 。
社交 网站 是 有 共同 的 爱好 或者 有 共同 的 目的 的 人 聚集 起来 ， 为 人际交往 提供 很大 的 便利 ， 开创 了 现实 社会 之外 的 全新 社交 方式 。
但是 ， 虚拟 的 社会交往 不能 替代 现实 社交 ， 这种 互相 阻隔 的 交往 方式 不能 成为 人际交往 的 主流 ， 否则 ， 过度 依赖 社交 网站 ， 会 降低 人们 社会交往 的 能力 。
进入 21 世纪 ， 网络 的 发达 日新月异 。
我 一直 不 明白 为什么 不仅 一两个 年轻人 做 这么 幼稚 的 事儿 ， 这件 事情 证明 社会 上 确实 存在 着 一些 不懂事 的 人 ， 对 他们 来说 特别 需要 有人 来 教 他们 应该 怎么 利用 社交 网络 。
小说 情节 的 高潮 是 老三 去世 之前 ， 二人 安静 地 躺 在 一间 以 护士 那 借来 的 房间 里 ， 制造 了令 静秋 和 老三 终生 难忘 的 回忆 。
我 现在 在 苹果公司 当 副经理 。
前 两年 的 今天 ， 我 被 您 公司 聘用 了 。
实不相瞒 ， 当时 的 我 对 电脑软件 很 不 了解 ， 而且 总是 笨手笨脚 ， 什么 任务 都 办 得 特差 ， 让 我 觉得 自己 是 个 饭桶 ， 特别 没有 用 的 人 。
他 和 我 是 同龄 的 ， 并且 是 同乡 的 ， 他 的 工作 经验 算是 不 大 丰富 ， 但 我 最 欣赏 的 是 他 不是 一个 轻易 放弃 的 人 。
这 句 话 至今 仍 刻骨铭心 ， 这 句 话 使 我 改变 了 想法 ； 这 句 话 给 我 加 了 油 ； 这 句 话 令 我 勇敢 地 往前走 。
《 双旗镇 刀客 》 是 导演 何平 1990 年 拍摄 的 武侠片 ， 影片 风格 独树一帜 ， 与 此前 和 此后 的 武侠片 都 有 很大 差别 ， 风格 上 具有 浓厚 的 古龙 小说 味道 。
他 父亲 死 前 说 要 他 去 双旗镇 找 “ 好 妹 ” 娶媳妇 ， 刚 开始 妻子 和 好妹 都 看不起 他 ， 但 通过 常期 相处 ， 觉得 他 很 善良 ， 刀法 也 不错 ， 于是 在 好 妹 父亲 肚子 的 安排 下 他们 成亲 了 。
有 一天 在 双旗 镇来 了 几个 流氓 ， 那个 流氓 要 强奸 好 妹 ， 在 强奸 时 ， 突然 孩子 看到 马上 跟 那 流氓 打死 。
这件 事 惹恼 了 流氓 兄弟 一刀 仙 ， 三天 之内 会 来 报仇 的 。
孩子 想起 沙里 飞 ， 在 来 双旗镇 的 途中 认识 的 ， 于是 求 沙里 飞去 帮 他 的 忙 。
那天 要 跟 一刀 仙 动手 ， 沙里 飞 故意 让 他们 动手 好 了 ， 再 出现 ， 真 不靠 普 。
孩子 才 几岁 就 可以 娶媳妇 了 ， 还 很 坚强 ， 会 刀法 。
当时 小孩 们 就 没有 上课 ， 因为 他 那个 双旗镇 ， 他们 只好 帮 爸妈 干活 ， 听 爸妈 的话 。
在 那个 镇里 有 很少 的 水 ， 因为 在 沙漠 里 生活 ， 可以 看出 他们 的 脸蛋 上 都 有点 黑 呼呼 的 。
这 片子 还有 一种 武侠 电影史 上 的 独特性 ， 我 觉得 就是 主角 是 孩子 ， 而 大部分 武侠 电影 的 主角 是 成人 。
这 也 是 一种 比较 独特 的 方式 ， 让 看 片 的 人 知道 小孩 也 比得上 大 男人 ， 要 靠 小时候 就 开始 苦练 ， 这 片子 还 教 我 做 什么 不用 怕 ， 从 最后 片子 的 部分 ， 孩子 真的 很 怕 ， 眼睛 又 哭 ， 手 又 发抖 。
孩子 是 有点 缺乏 信心 的 孩子 ， 从 片中 可以 看出 这点 就是 他 为了 确定 好 妹妹 是不是 他 要取 的 媳妇 ， 有 一个 地方 可以 证明 就是 她 的 屁股 上 会 有 肿 ， 所以 他 偷看 她 洗澡 ， 但 也 没 成功 ， 还 被 妻子 打 了 。
时 移世 移 ， 在 女人 越来越 有 能力 和 男人 竞争 的 时代 ， 男人 是否 也 该 做出 一些 改变 ， 也 试 着 处理 家务 ， 照顾 孩子 ？
当 我 正在 为了 准备 生日 晚会 而 七上八下 时 ， 有 一个 人 给 我 打电话 ， 说 要 请 我 午餐 为 礼物 ， 我 兴高采烈 。
为什么 说 比萨 做法 不大好 呢 ? 其实 ， 问题 的 就 在于 使用 的 原料 是否 有 问题 呢 ？
她 说 ： “ 不 只是 必胜客 ， 比萨 都 会 使用 过剩 与 罐头 里 的 食物 来 作为 原料 。 ”
因此 ， 人们 把 比萨 列 在 “ 垃圾 食品 的 黑名单 ” 上 ， 说明 它 不利于 身体健康 。
第一 ， “ 加塞儿 ” 本身 的 这种 现象 是 缺乏 素质 的 体现 。
大家 都 有 文化 ， 有 修养 的 家庭 来到 这里 。
本来 北京 人 就 很多 了 ， 再 加上 外地人 ， 外国人 更 增加 了 ， 所以 插队 现象 在 地铁站 是 屡见不鲜 的 。
泰国 曼谷 虽然 也 是 泰国 的 首都 ， 但是 很少 有 这样 的 现象 ， 原因 可能 是因为 泰国 的 人口 没有 中国 这么 多 。
任何 事情 都 讲究 个 先来后到 ， 如果 大家 都 在 用 自己 的 宝贵时间 来 遵守规则 ， 为什么 有些 人 就 做 不到 ？
如果 在 车站 有 几个 人 在 排队 ， 但 一旦 车 来 ， 在 排队 的 几倍 人 插队 坐车 。
所以 我 刚 来到 北京 时 被 别人 插队 ， 不成 坐车 的 事情 多 得 数不清 ， 感到 气愤 的 好 几次 。
到底 为什么 他们 常常 不 排队 ， 做 插队 呢 ？
另外 我 个人 认为 大部分 的 中国 人 的 性格 都 着急 ， 像 有着 强迫观念 般的 被 别人 插队 之前 自己 先 做 插队 。
我 认为 人民 的 性格特点 也 是 可以 说 一个 文化 ， 单独 我 想 说 没有 规律 的 “ 赶紧 ” 是 最 远离 于 “ 赶紧 ” 的 行为 ， 便 更 混乱 的 行为 ！
更何况 拥有 5000 多年 历史 的 她 ， 对于 这种 插队 现象 或许 已 是 根深蒂固 、 司空见惯 的 事情 了 。
看 完 之后 我 感到 这部 电影 很 有意思 。
如果 我 没有 看到 这部 电影 ， 我 肯定 会 感到 很 后悔 。
在 《 独立 日 》 作品 中 ， 充分 地 表现 出 英雄主义 的 是 美国 总统 亲身 上 飞机 率领 他 的 部队 向 外星人 飞盘 扑 过去 的 场景 ， 我 感到 了 他 对 自己 国家 的 责任感 以及 他 强烈 地 追求 独立 的 迫切 感 。
在 美国 的 指导 下 世界 各国 准备 交战 的 场景 ， 就 容易 看透 美国 想 做 “ 世界 警察 ” 的 美国 文化 特征 。
虽然 这部 电影 不 影响 那么 精彩 和 华丽 ， 但是 我 认为 这部 电影 包含 着 中国 独特 的 历史 。
对 我 来说 比书 理解 得 更 容易 ， 读书 的 时候 ， 因 语言 的 问题 在 主人公 的 感情 上 有些 不懂 的 ， 但 看 电影 的 时候 我 可以 看到 他们 脸上 的 表情 而 更 容易 了解 到 那些 事情 。
这 不仅 极大 的 电影 的 紧张感 ， 而且 使 观众 不知不觉 之间 沉醉在 电影 中 。
而且 就算 他们 有幸 没有 被 火 燃烧 ， 还是 由于 隧道 里面 的 空气 很 差 ， 不能 呼吸 ， 导致 窒息 。
在 这部 影片 中 ， 每 一个 人 都 有着 自己 独特 的 故事 和 人格 特点 ， 但是 ， 这些 人物 的 背后 ， 透露 出 一个 主题 ： 不怕困难 ， 尽己所能 ， 团结一致 ， 拼搏 奋斗 ， 哪怕 是 粉身碎骨 浑 不怕 。
除此之外 ， 还 勇敢 不怕死 ， 带领 士兵 们 与 外星人 交战 ， 让 人 感到 他 是 一位 很 有 正面 的 总统 形象 。
更让人 感到 幸福 的 是 ， 在 回到 地球 后 ， 大卫 和 史蒂文 俩 人 摆 着 酷酷 的 姿态 ， 慢慢 的 走 在 沙漠 上 抽 雪茄 ， 还有 他们 的 爱人 的 拥抱 。
可 就是 这 一个 看起来 很 不正经 的 老人 ， 内心深处 是 一个 爱国 之 心 。
他 的 制作 电影 虽然 一部 又 一部 都 是 关于 我们 世界 的 灾难 ， 但 热爱 收看 灾难片 的 观众 却 不 觉得 腻味 ， 反而 盼望着 欣赏 到 艾默里 奇 这 类似 的 新 作品 。
人们 熟悉 的 地球 变成 了 地狱 一般 ， 强烈 的 地震 ， 巨大 的 火山 就 发生 在 面前 。
在 轮船 上为 人们 演唱 的 一对 黑白 的 老年人 ， 能 表示 了 老朋友 生死相伴 ， 不离 不弃 的 友情 。
在 面临 着 生死 的 时候 有 一个 朋友 陪伴 ， 这 可是 一种 幸福 啊 ！ 那种 幸福 是 很 难用 语言表达 出来 。
那时 的 她 家里 只有 妈妈 一个 人 ， 生活 也 不 富裕 ， 就是 一个 孤零零 的 小孩 。
故事 结束 后 ， 我们 可以 发现 ， 女主角 的 名字 叫 什么 来 着 ， 电影 中 只 提到 她 是 江 小姐 ， 这点 观众 会 感到 更 悲伤 。
我们 小时候 都 有 过 暗恋 的 经历 。
从 现代人 的 观点 来看 ， 希区柯克 电影 的 清洁 显得 陈旧 。
其一 ， 男 主人公 斯考蒂 的 朋友 加文 请求 斯考蒂 侦探 要 想 精神 错乱 而 憔悴 的 自己 妻子 玛德琳 之 行踪 。
《 迷魂 记 》 这部 电影 的 精彩 之处 就 在于 它 把 几个 看似 毫不相干 的 要素 结合 在 一起 ， 让 我们 为 生与死 惊心动魄 的 同时 ， 一样 为 主人公 之间 的 情感 纠葛 神伤 。
我 看 完 这部 电影 后 ， 感到 这部 电影 引人入胜 ， 是 值得 被 称为 当代 最佳 电影 之一 。
我 尤其 为 《 独立 日 》 卓越 的 视觉效果 而 鼓掌 。
因此 这种 电影 能 用 相对 少 的 费用 来 实行 真实 的 效果 。
此 电影 就 利用 了 这 简单 的 主题 成为 了 名作 ， 原因 就是 在 主人公 菲利普 传奇 般的 故事 上 ， 他 所 创造 的 伟大 业绩 把 这么 简单 的 主题 升华 成 了 一个 名作 。
如果 他 没有 朋友 的 帮助 ， 这 梦想 只能 成为 一个 空虚 的 人 。
菲利普 的 朋友 们 也 为了 帮助 菲利普 在 暗暗 的 楼里 一动不动 地 呆 了 四个 多 小时 。
《 影武者 》 这部 电影 是 描述 人物 的 心理 状态 的 变化 描述 得 太精彩 的 电影 。
这部 电影 的 最大 的 特点 就 是从 ‘ 影武者 ’ 这 非常 独特 的 身份 来 的 魅力 ， 因为 是 这 独特 的 身份 ， 在 主人公 的 心里 面 产生 了 心理 上 的 复杂 的 矛盾 。
黑泽明 描写 这样 的 人们 的 心理 状态 的 大师 ， 他 为了 表现 这样 的 心理 上 的 矛盾 ， 用 长镜头 和 ‘ 酷 ’ 来 表演 。
这 电影 的 主要 内容 就是 主人公 的 心理 状态 的 变化 ， 在 另外 的 看法 上 这样 的 主人公 的 心理 状态 也 可以 说 对 武田信 玄 的 态度 的 变化 。
本来 主人公 不 太 喜欢 武田信 玄 ， 因为 主人公 认为 武田信玄 是 一个 ‘ 恶人 ’ ， 但是 面对 武田信 玄 的 尊敬 心 越来越 强 ， 不过 改变 已经 在 自己 的 身上 的 习惯 是 很 难 的 课程 。
武田信 廉 就是 电影 里面 唯一 理解 这样 的 困难 的 人物 ， 所以 他 一直 在 主人公 的 周围 帮助 主人公 的 助力 着 。
我 个人 认为 这样 的 将 两个 人 比较 的 就是 在 这部 电影 里面 最 有 魅力 的 部分 ， 也 是 最 有意思 的 。
去年 是 2012 年 ， 特点 是 现在 几乎 到 了 玛雅人 预言 世界末日 的 2012 年 的 尽头 。
这部 电影 讲述 的 是 一种 可能性 ， 地球 会 不会 在 2012 年 迎来 它 的 终点 。
电影 《 2012 》 是 根据 古玛雅 人 的 世界末日 预言 ， 大师级 导演 罗兰 • 艾默里 奇 拍摄 的 一部 关于 全球 毁灭 灾难片 的 电影 。
这部 电影 使用 的 多次 的 特技 摄影 和 影片 的 题材 使 我 感到 视觉 震撼 、 心理 震撼 。
但是 ， 作为 像 木兰 这样 性格 活泼 、 开朗 的 女孩儿 当 被 什么 三从四德 束缚 住 的 时候 ， 我们 还 能 看到 真正 的 木兰 吗 ？
我 个人 觉得 ， 这部 电影 的 优点 就是 很 善于 描写 人物 的 心理 变化 。
影片 自己 而 有趣 地 描写 了信 廉 这个 人物 转变 的 整个 过程 。
但是 ， 通过 波普 先生 父亲 的 遗产 拉近 了 孩子 和 前妻 的 关系 ， 懂得 了 家庭 的 温暖 ， 意识 到 作为 父亲 ， 该 如何 去 做 一个 好 父亲 ， 好 丈夫 。
看 了 这部 电影 之后 ， 深深感到 了 一种 命运 哲学 ： 死亡 和 生命 之间 并 不是 对此 对立 的 ， 而是 一种 延续 ， 一种 爱 的 延伸 和 希望 的 延续 ， 从而 展现出 影响 人性 关怀 的 人文 主题 。
通过 使 我 眼泪 流出 的 这个 故事 ， 导演 可能 告诉 我们 父子 之间 的 真实 感情交流 ， 也 是 生者 与 死者 的 交流 。
通过 写作 ， 不但 能 回忆 自己 的 人生 ， 而且 能 准备 未来 。
这部 电影 是从 两个 老人 突然 发病 后 住院 的 情况 开始 的 。
两个 老人 的 性格 完全 相反 ， 但是 他们 的 共同点 就是 他们 对 自己 的 人生 有 后悔 。
而 mo ## r ## go ## n ## ala ## man 表演 的 节目 虽然 在 年轻 时 有 了 人生 的 目标 ， 可是 为了 家庭 和 子女 的 教育 都 放弃 了 自己 的 目标 。
他们 从 他们 出院 开始 被 他们 一个 一个 实现 了 。
没有勇气 的 人生 ， 就 连 人生 的 一小部分 也 不能 组成 。
最后 ， b ## hm ## et ## ter 给 我 留下 了 这样 的 教训 ， 我们 要 勇敢 地 与 他人 享受 自己 的 人生 ， 从此 我们 人生 的 幸福 会 增加 两倍 。
在 南霸天 的 家里 偶然 遇到 一位 华侨 巨商 洪 常青 ， 她 作为 礼品 转移 到 了 洪 常青 的 手中 。
还是 先 看 张艺谋 的 《 活着 》 以后 再 看 余华 的 《 活着 》 会 更好 。
一般 的 故事 总是 让 好 学生 跟坏 学生 在 一起 的 ， 而 这部 电影 就是 。
那天 之后 他们 俩 成为 了 好 朋友 ， 后来 他们 的 关系 发展 到 谈恋爱 。
但 很 不幸 地 是 ， 上天 给 它 的 绳子 是 腐朽 的 ， 因此 老虎 还 没到 天上 ， 就 死 了 。
然而 ， 我 认识 了 一句 话 ： “ 一百个 话 不胜 于 一次 拥抱 。
他 的 那 小小的 房间 改变 成 天堂 般的 人物 ， 我 也 能 做到 吗 ？
他 在 我 身边 的 时间 已 很 长 ， 我 在 他 的 身边 学到 了 很多 东西 ， 又 从 他 的 身边 我 感受 到 了 人生 的 “ 愉快 ” ， 我 感谢 给 他 。
“ 这样 的 生活 哪 有 意义 呢 ？ ” 他 默默地 喊 了 一声 ， 他 洗完 澡 再次 设定 了为 明天 的 闹钟 。
真正 的 大学生 不能 像 他们 那样 追求 便利 。
当时 他 的 脑子里 一片空白 ， 一 想 放弃 一切 。
泰国 西部 地区 的 森林 总 有着 一些 传说 ， 因为 这里 的 老虎 出没 ， 不少 猎人 会 到 这 非法 狩猎 。
某日 ， 五名 来自 不同 国家 的 猎人 来到 这里 ， 他们 雇佣 一名 当地 山民 作为 导游 ， 意气风发 地 进入 山林 中 。
猎 人们 和 农民 恐惧 地 看到 两名 警方 露出 了 虎牙 ， 脸上 浮现 了 虎纹 … …
他 才 知道 ， 原来 ， 宿舍 里 的 电是 要 花钱 充电 的 ！
这 是 让 我 忘不了 的 一天 。
哥哥 是 很 贪婪 的 ， 而 弟弟 很 善良 。
弟弟 有 很多 孩子 ， 生话 很 困难 ， 就 去 请 哥哥 帮助 他 食物 。
在 弟弟 的 帮助 下 恢复 以后 ， 燕子 回家 了 。
商人 听到 后 慌张 了 ， 所以 对 他 说 ： “ 那 只 为 你 打折 吧 ！ ” 小 李 大声 笑 后 一个 也 不 买 回家 。
他 妈妈 真正 地 包裹 好 后 ， 在 星期一 送 了 包裹 说 大概 两三天 就 到 。
到 星期四 ， 他 开始 有 一点 担心 ， 所以 他 给 中国 邮局 打 了 电话 。
到 了 下午 他 开始 有点 生气 。
他 安慰 了 自己 ， 觉得 这么 辛苦 的 时间 一定 让 收到 包裹 的 瞬间 更 高兴 。
在 星期六 早上 ， 他 去 散步 的 路上 遇到 了 一位 邮递员 。
还是 沈 瞎子 本来 就 很穷 ， 更 不 容易 一个 人养 孩子 。
当时 ， 他们 俩 才 知道 了 昨天晚上 他们 互相 带 了 稻谷 ， 而且 他们 才 知道 了 为什么 稻谷 没有 减少 。
再 确定 两个 人 的 友爱 ， 以后 兄弟俩 更 珍贵 地 互相 幸福 地 生活 。
很久以前 ， 在 某 深山 上住 着 一对 善良 的 兄妹 和 妈妈 。
后来 ， 每次 风吹 过 山茱蚪 林 的 时候 ， 仍然 听 得到 近似 的 喊声 。
因为 他 总是 觉得 他 的 电动车 对 他 来说 太小 。
可是 比较 大 的 电动 的 价格比 他 觉得 的 更 贵 。
西院 伽蓝 是 世界 上 最 古老 的 木构 建筑群 。
作为 多 地震 国家 ， 在 古代 建造 高塔 又 要 做到 防震 抗风 极为 不易 。
充足 的 木材 资 及 中国 古代 木构 建筑 的 封建 结构 本身 起到 的 抗震 抗风 的 作用 ， 是 日本 古代 建筑 及 结构 和 装修 上 ， 始终 使用 木结构 的 原因 之一 。
很久以前 的 人们 就 已经 知道 使用 微积分 的 原理 了 ， 浮于 地面 的 柱子 则 由于 共 震 ， 也 将力 对 身体 的 破坏 将 到 最低 。
日式 土豆 炖牛肉 这 是 日本 最 常见 的 特别 有名 的 家庭 料理 ， 一般 每个 主妇 都 会 做 。
今天 ， 我 来 介绍 一下 我 最 喜欢 吃 的 日本料理 ， 也 是 世界 上 很 有名 的 日本 火锅 之一 。
关东地区 和 关西地区 ， 它 的 味道 和 做法 不 完全 一样 。
牛内微 热 后 ， 把 白糖 和 盐 撒 在 牛肉 上 ， 把 酱油 和 料理 酒 浇 在 牛肉 上 。
如果 刚刚 煮 完 的 肉 马上 放进 口里 ， 口里 会 受伤 。
最好 把 牛肉 跟 蝌蚪 丝 分开 放在 锅 里 ， 避免 牛肉 变硬 。
大殿 里 有 一座 阿弥陀佛 ， 佛像 是 木制 的 ， 涂 了 漆 ， 铺 了 金 ， 还 被 金色 环绕着 。
在 日本 今天 流通 的 10 圆 硬币 和 10000 圆 纸币 背后 也 写 着 平等 院 凤凰 堂 。
力图 加强 柱子 的 上面 ， 造上 门框 上 的 装饰 用 质木 ， 叫 “ 长 押 ” 。
由于 顾 滤到 中国 学生 和 留学生 在 中文 基础 和 学习 能力 方面 存在 差异 ， 中文系 分别 为 留学生 和 中国 学生 设定 了 两个 不同 的 班级 。
刚 来到 这里 住宿 ， 我 觉得 这里 的 环境 很 好 。
因此 ， 安全 对 每个 人 来说 都 是 第一件 要紧 的 事 。
一旦 被 抢劫 的话 ， 难道 不 就 完蛋 了 吗 ？
安全 确实 是 一件 要紧 的 事 ， 我 希望 您 尽快 把 问题 解决 ， 为了 大家 的 利益 。
过 了 几年 ， 他 的 工作 环境 和 经济 状况 稳定 之后 ， 我们 一家人 也 都 来到 了 中国 。
但是 在 我 自己 的 努力 和 老师 们 、 朋友 们 的 帮助 下 ， 现在 在生活中 与 人用 汉语 交流 并 不 困难 。
我 刚 到 中国 ， 开始 学习 汉语 ， 是 跟 一位 朝鲜族 老师 学习 的 。
只有 我 和 其他 几个 同学 是 外国 学生 ， 全都 是 中国 学生 。
因此 我 在 这 所 学校 读书 时 ， 经常 跟 中国 学生 交流 沟通 ， 使 我 的 汉语 水平 提高 了 很多 。
从 我 学习 汉语 的 经历 中 ， 我 觉得 学习 汉语 要 主动 去 跟 中国 朋友 交流 沟通 。
上学 、 逛街 、 看电视 等 ， 生活 中 来自 做 的 一切 事情 都 是 在 学习 汉语 的 过程 中 延长 的 。
与 中国 同学 们 生活 在 一起 ， 对 学习 汉语 很 有 帮助 。
此后 ， 新 的 世界 展现 了 在 我 的 眼前 。
天天 向 我 问 东方 神起 ， 神话 等 的 韩国 明星 。
与 男同学 们 刚 开始 交往 的 时候 ， 没 必要 很多 对话 。
但 唯一 的 缺点 是 做 提靠 感觉 ， 因此 ， 可以 答对 ， 但 不会 讲 理由 。
现在 ， 服 了 两年 的 兵役 后 复学 了 没多久 ， 感觉 、 感觉 、 发音 和 写作能力 等 整个 汉语 水平 不如 上 高中 的 其中 。
在 北京 的 飞机 上 ， 我 很 紧张 ， 但 我 有 了 目标 所以 很快 就 平定 了 我 的 心情 。
不过 我 当上 了 班长 ， 在 学校 过 得 很 愉快 。
到 北京 后 ， 我 在 学校 宿舍 里 整理 好 我 带来 的 东西 。
我 读到 这个 材料 就 想起 了 这 篇 短文 。
我家 有 五口 人 。
我们 家 几口 人 都 不 一样 。
这 不是 爸爸 感到 的 味道 错 的 ， 也 不是 妈妈 感到 的 味道 错 ， 这 是 相对 的 。
可是 大部分 的 全世界 人 都 喜欢 牛肉 。
所以 印度人 对 全世界 人 没有 说服 不要 吃 牛肉 。
在 文章 里 说 在 小岛 居民 的 生活 十分 原始 ， 不 穿衣服 。
这 现象 是 相对 的 ， 不能 说 谁错 的 。
后来 被 发现 时 人们 非常 惊讶 与 小岛 上 居民 生活 的 原因 。
那时 我 正在 写 论文 ， 在 网上 看过 一段话 。
看 完 这段话 我 领悟到 我 的 错误 。
人 ， 从此 开始 一直 到 死亡 ， 用 各种各样 的 衣料 把 自己 包 起来 。
通过 人类 的 进化 ， 而且 随着 进化 的 智力 的 发展 ， 人类 得到 了 进化 ， 渐渐 地 具备 了 走向 文明 之路 的 力量 。
而且 进一步 ， 我们 也 会 能够 推测 未来 人类文明 的 面貌 。
人 和 人 之间 会 出现 坚硬 的 墙 ， 会 出现 很多 障碍 。
只有 掌握 好 沟通 的 技巧 ， 我们 才 能够 更好 地 在 这个 社会 好好 地 活下去 。
把 这 把 钥匙 轻轻地 插入 锁扣 ， 一 扭 ， 铁锁 就 能够 开 。
只有 我们 打开 心灵 的 窗口 ， 与 他人 沟通 ， 我们 才 能够 走进 他人 的 世界 里 。
我们 应该 理解 别人 ， 才能 放开 心结 ， 人生 更加 美丽 。
只有 心里 有 一个 “ 理解 ” 之 心 ， 才能 有 接受 和 我 不同 的 勇气 。
在 我们 所 居住 的 世界 里 是 多么 丰富多彩 。
因为 世界 的 多元化 ， 不 时会 引起 人们 的 兴趣 。
当 我们 发现 在 太平洋 上 有 一座 小岛 以后 ， 因为 上面 居住 着 与世隔绝 的 一群 人 ， 他们 过 着 很 原始 的 生活 ， 不 穿衣服 ， 只用 树叶 遮盖 身体 ， 这 使得 我们 都 惊讶 。
从 这 一个 材料 里 的 短短 文字 ， 让 我 领悟到 一种 道理 。
在 任何 情况 下 ， 我们 不 应该 以 自己 的 所作所为 为 为主 ， 然后 用 自己 规定 的 原则 去 判断 别人 的 行为 。
在 我们 所 经历 的 东西 里 没有 什么 永远 可以 用 “ 对 ” 来 概括 的 ， 也 没有 什么 永远 可以 用 “ 错 ” 来 概括 的 。
如今 ， 在 海尔 科技 管理 的 那 把 “ 闻名 遐想 ” 的 大 铁锤 ， 向 人们 诉说着 质量 与 品牌 的 故事 。
因为 大自然 是 家 ， 所以 他们 爱 这个 家 。
喜欢 自己 的 是 人 的 本能 ， 那样的话 不会 说错 了 。
日常生活 中 也 比较 容易 看到 因为 是 两者之间 的 不同 而 发生 的 问题 。
从古至今 社会 上 文化 的 不同 ， 就 发生 文化 · 民族 · 国家 之间 的 矛盾 。
年龄 差距 大 的 问题 导致 社会秩序 的 混乱 。
其实 在 现实 中 很 难 找到 具体 的 方法 ， 因为 这 问题 跟 人 的 本性 有关 的 问题 。
现在 不同 的 文化 之间 的 矛盾 比刚 开始 世界化 时代 的 矛盾 缓和 多 了 。
通过 科学技术 的 发展 ， 人际关系 的 方法 越来越 多样 ， 越来越 容易 ， 互相 了解 的 机会 越来越 多 。
所以 解决 这个 问题 不是 一年 两年 后 就 能 解决 的 问题 。
我 认为 在 这样 的 情况 下 ， 世界 上 所有 的 人 对待 异域 文化 的 时候 ， 都 应当 具有 一种 态度 。
因此 ， 以 自国 文化 的 价值 标准 来 批评 别的 文化 是 不合理 的 ， 而且 是 应当 抛弃 的 一种 痴想 。
无论如何 ， “ 文化 相对主义 ” 这种 观念 是 现代人 应当 具有 的 观念 。
根据 这样 的 现象 ， 不禁 让 我 自问 ： 中国 的 传统 文化 为什么 会 遭到 冷落 ？
人们 看 土著人 原始 ， 土著人 看 外人 也 很 奇怪 。
我们 要 了解 彼此 的 想法 ， 如果 跟 自己 不同 的话 ， 别以为 奇怪 ， 就要 接受 对方 的 价值观 与 想法 。
我 有 的 时候 跟 朋友 之间 发生冲突 的 时候 ， 我 总是 觉得 我 的 行为 没有 错误 ， 是 完美无缺 的 ， 而且 朋友 做到 的 事情 都 对不起 我 。
我 很 固执 ， 遇到 什么 事情 都 会 怪 朋友 。
所有 的 错误 都 是 别人 犯 的 ， 我 觉得 跟 我 没有 什么 关系 。
父母 总是 唠叨 我们 ， 因为 我们 说 的 很多 。
但是 对 我们 来说 ， 父母 的话 都 是 当成 不想 听 的 唠叨 。
他们 的 生活 ， 我们 不 应该 以 我们 的 标准 来 评论 他们 。
我们 没有 通过 其他 文明 比较 研究 、 验证 的 过程 ， 错误 地 把 我们 的 文明 当成 历史 上 现存 的 最 发达 的 文明 。
以 自己 的 文明 社会 标准 ， 从而 排斥 其他 文明 。
土著 社会 只是 一个 另外 社会 ， 原始人 对 世界 的 经验 有 自身 的 完整 体系 。
我 知道 我 为了 我 自己 在 中国 的 生活 更 舒服 ， 要 学好 汉语 。
过 了 一年 ， 当 我 毕业 那 所 小学 时 ， 没有 一个 中国 同学 嘲笑 我 ， 我们 都 成为 了 好 朋友 。
在 我 九岁 时 第一次 来到 中国 ， 当初 对于 汉语 可以 说 是 一窍不通 。
寿光 方言 当 了 我 跟 同学 们 之间 的 桥 ， 因此 我 越来越 被 方言 所 吸引 。
之前 没 读懂 而 死记硬背 的 古文 ， 现在 来讲 ， 不仅 懂得 容易 背诵 ， 也 能 感受 到 文章 里 的 趣味 。
虽然 我 在 中国 北京 ， 可是 我 没有 觉得 我 在 中国 文化圈 里面 ， 而是 我 在 多 文化圈 里面 生活 的 。
他们 不时 我家 门前 问 我 去 教会 ， 有时候 不管 我 去不去 教会 ， 都 要 带我去 自己 所去 的 教会 。
我 已经 说 过 现在 我 在 多 文化圈 里面 生活 ， 我 喜欢 我 所 接触 的 文化 ， 觉得 很 新颖 。
我 希望 这个 文化 都 要 发展 ， 发展 到极点 ， 文化 的 花 开辟 ， 散发出 隐隐然 的 香味儿 。
对 异国他乡 的 留学生 ， 不仅 是 学习 一门 外语 ， 而是 学习 外国 的 文化 以及 他们 的 人生观 。
可是 我 每次 回 想起 这些 事情 时 ， 就 不知不觉 地 充满 着 一种 幸福感 。
那时 我 才 高一 ， 分 到 高一 七班 ， 在 班里 唯一 一个 我 是 韩国 学生 。
我 一 开始 几天 不 能够 完全 融入 到 他们 身上 ， 但 一天 一天 过去 不仅 我 的 汉语 水平 提高 了 ， 还 得到 了 这些 无比 珍贵 的 朋友 们 。
从 那 时候 起 我 对 汉语 慢慢 地 失去 了 兴趣 。
第二天 早上 ， 我 决定 从 小小的 部分 开始 学习 ， 以 提高 我 的 汉语 水平 。
这样 ， 我 的 宿舍 被 几十张 黄色 的 卡 都 贴满 了 。
我 相信 自己 一定 能够 在 黑暗 中 走 出来 ， 热情 地 学习 ， 努力奋斗 ， 才 能够 柳暗花明又一村 。
学习 汉语 的 经历 以后 在 我 的 人生路 途中 一定 能够 坚实 地 垫底 作用 。
