冬阴功 是 泰国 最 有名 的 菜 之一 ， 它 虽然 不 是 很 豪华 ， 但 它 的 味 确实 让 人 上瘾 ， 做法 也 不 难 ， 不复杂 。
首先 ， 我们 得 准备 : 大 虾六 到 九 只 、 盐 一 茶匙 、 搾 好 的 柠檬汁 三 汤匙 、 泰国 柠檬 叶三叶 、 柠檬 香草 一 根 、 鱼酱 两 汤匙 、 辣椒 6 粒 ， 纯净 水 4量杯 、 香菜 半量杯 和 草菇 10 个 。
这样 ， 你 就 会 尝到 泰国人 死 的 爱 味道 。
另外 ， 冬 阴功 对 外国人 的 喜爱 不断 地 增加 了 。
这 部 电影 不仅 在 国内 ， 在 国外 也 很 有名 。
不管 是 真正 的 冬阴功 还是 电影 里 的 “ 冬阴功 ” ， 都 是 在 人们 的 心 里 刻骨 铭心 。
随着 中国 的 经济 的 突飞 ， 建造 工业 与日俱增 。
虽然 工业 的 发展 和 城市 规模 的 扩大 ， 对 经济 发展 有 积极 作用 ， 但是 同时 也 对 环境 问题 日益 严重 造成 了 空气 污染 问题 。
空气 污染 也 没 有助于 人生 的 身体 建康 。
由此 可 见 ， 首先 我们 要 了解 一些 关于 空气 污染 对 我们 人生 有 什么 危害 的 话题 ， 知道 了 这些 常识 以后 对 我们 人类 会 有 积极 作用 。 以及 要 学会 怎样 应对 和 治理 空气 污染 的 问题 。
任何 事情 都 是 ， 众所周知 越 建立 工业 越 对 经济 方面 有所 发展 。
在 我 看来 ， 曼 古 空气 污染 的 问题 与日俱增 。
每 天 会 有 不少 的 毒气体 泄漏 从 工厂 里 发 出来 。
在 工厂 里 的 工作 人员 为了 工作 ， 每 天 吸 了 不少 的 毒气体 ， 经过 了 一 年 多 的 时间 ， 连 工作 人员 也 得 了 严重 的 病 。 更 不用 说 住 在 这 家 工厂 近 的 家庭 。
沙尘暴 也 是 空气 污染 之一 。
不 官 是 从 口 、 眼 、 鼻子 进来 这样 会 伤害 身体 的 建康 。
这样 做 会 避免 受 沙尘暴 。
最后 ， 还 要 关主 一些 关于 天气 预报 的 新闻 。
中国 、 悠久 的 历史 、 灿烂 的 文化 ， 真 是 在 历史 上 最 难忘 的 国家 。
对 生 名 来 说 空气 污染 是 很 危害 的 问题 ， 对 身体 不 好 。
抽烟 对 身体 非常 不 好 ， 对 身体 太 危害 。
在 中国 ， 不 官 是 谁 都 抽烟 。
但是 医生 说 ， 他 的 身体 跟 抽烟 的 人 完全 一样 ， 好像 抽烟 抽 得 六十 年 一样 。
证 治 方面 的 空气 污染 也 很 不 好 。
现在 人们 认为 中国 ， 持 别 是 北京 ， 没有 “ 自然 ” 的 感觉 。
例如 ， 天气 非常 好 的 时候 比 天气 非常 不 好 的 时候 完全 不 一样 。 天气 好 时 大部分 的 人 也 会 高兴 。
工业 发展 是 好 东西 ， 但是 好 的 东西 也 有 很 好 的 东西 。
工业 发展 把 中国 当 个 很 强 的 国家 。
北京 的 空气 太 污染 了 ， 在 北京 的 人 一定 要 注意 ， 别 抽烟 。
大家 希望 能 裕富 的 生活 。
我 认为 空气 污染 是 跟 我们 的 生活 密切 问题 ， 所以 一定 要 最 优先 解决 ， 优 其 是 像 北京 那样 的 大 城市 。
林冲一路 来到 李小二 的 店 里 ， 选 了 一 张 比较 隐避 的 桌子 ， 坐 了 下来 。
现代 社会 的 就业 难 太 厉害 了 。
因为 读书 就业 的 时间 越 少 了 。
但是 这 种 想法 太 近视 眼 ， 而 有 很 大 的 错误 。
一般 人 觉得 只 有 流利 的 英语 实力 、 好多 征 件 、 丰富 的 活动 经历 什么 的 人 才 能 找到 好 工作 。
如果 读 各种各样 的 书 ， 能 培养 各种各样 的 能力 ， 变得 更 创新 而 思考 的 深度 更 长 。 那 多么 公司 会 需要 录用 他 。
大学 是 让 学生们们 能 作为 一 名 好 成人 ， 好 的 社会 的 一 部分 。
不管 对 就业 有 没 有 直接 的 利益 ， 学生们 都 要 认真 学习 。
当然 现在 的 情况 下 ， 在 大学 学生们 只 读书 是 很 难 的 事情 。 准备 找 工作 也 重要 极 了 。
近来 就业 难 是 一 个 社会 问题 。 大学 毕业生 也 不 有 。
所以 一些 人 都 说 ， : 读书 一点 用处 都 没有 。
他们 的 主张 里 最 大 的 错误 在 这里 。
学习 是 得到 智慧 ， 不 是 就业 。
社会 越来越 专业化 、 灵通化 。
照 此 趋势 类推 ， 将来 更 多 的 人 的 机器 掠夺 了 。
现代 的 科学 技术 发展 已经 能 代 人 在 这 种 作业 。
以 找到 这些 稳定 的 工作 ， 我们 有 读书 的 有 必要 。
读 一 本 书 让 你 可以 看 另外 的 角度 ， 而且 获得 宝贝 的 知识 。
读 了 很多 书 让 我们 明理 ， 并且 可 会 有 逻辑 思维 。
面试 非常 重要 。
你 读书 的话 ， 你 可以 成功 。
现在 有 很多 大学 ， 大部分 人 几乎 上 大学 。
这样 的 事情 让 政府 感到 了 负担 。
找 工作 的 人 比 工司 更 多 了 。
我 的 家 附近 有 很多 考式 补习班 。
如果 结果 好 的话 ， 没 关系 。 不 可 好 的话 ， 浪费 时间 。
高中生 比 有名 的 大学 更 喜欢 技术 大学 。
因为 这 个 问题 ， 所以 最近 有 头疼 。
大学 的 功能 不 是 这样 的 学 。 就 是 学 的 。
我 非常 荣幸 能 选修 这 门 课程 ， 这 个 班级 。
这 学期 学 了 多 种 形式 的 文章 ， 从 日常 书信 、 专用 书信 、 便条 、 字据 、 说明文 和 总结 等 。
从 写 日常 书信 和 专用 书信 的 课 中 ， 我 毕到 了 如何 在 不同 场合 使用 不同 语言 的 方式 。
我 学到 了 如 更 简练 ， 更 书面 地 表达 自己 的 意见 。
我 学到 了 对 自己 过去 进行 歹思 并 鼓起 勇气 的 方法 。
阅读 与 写作 是 华 留学生 必修 的 一 门 课 ， 有 它 ， 让 我们 的 留学 生活 更 充实 ， 更 完美 。
因为 几乎 的 人们 没 感受 到 污染 对 自己 的 直接 的 影响 。
空气 虽然 不 可 视 的 物质 ， 但是 生活 中 是 不 可 缺少 的 特质 。
尊 守 一 个 一 个 自己 制定 的 小 活动 。
近代 木柴 被 认为 是 重要 的 资原 、 能 原 ， 因此 被 用 得 越来越 多 。
每 年 用 的 树木 比 植 的 树木 更 多 。
树 越 多 就 能 恢复 污染 空气 的 速度 越 快 。
列车 、 汽车 、 飞机 等 人类 科技 发展 的 结果 也 重大 的 问题 。
1 . 少 骑 汽车 : 2.多 用 公共 施设 ， 如 有 地铁 、 公共 汽车 等 ; 3 . 多 走步 多 骑 自行车 。
导 到 空气 污染 的 要素 是 汽车 的 尾气 。
总 不 学会 了 很多 知识 ， 而且 发现 对 自己 合适 、 有效 的 学习 方法 。
这些 问题 其实 是 不 该 范 的 ， 写 文章 再 需要 细心 ， 重视 细节 。
总的来说 ， 这 个 学期 的 学习 情况 较 满意 。
中国 近 几十 年 来 的 发展 带 出来 了 很多 大 问题 ， 最 大 的 可以 说 是 环境 上 的 几 样 ， 特别 取得 关注 的 是 空气 污染 。
空气 污染 的 问题 已 变成 一 个 世界 上 共 存在 的 问题 。
我们 应该 怎么 去 治理 来 保护 自己 ？ 知 到 空气 污染 是 什么 。
空气 污染 对 晋同 公民 有 一定 的 危害 了 。
大使 管所 查到 的 都 可以 上网 ， 或者 下 应用 去 自己 看 。
如果 全 世界 多 注意 ， 可能 有 一 天 我们 就 不 用 出门 害怕 空气 污染 。
其 结果 全 世界 的 环境 问题 越过 严重 。
空气 污染 受害 的 不 是 空气 ， 而 是 我们 人类 受害 。
我们 吸受 污染 的 空气 ， 会 致癌 。
可以 把 污染 的 空气 变成 为 清晰 的 空气 子 。
工厂 的 排放 使致 了 雾霾 ， 所以 政府 主动 地 控制 工厂 的 排放量 。
空气 污染 的 危害性 不 用 再说 的 ， 应该 没 个人 都 知道 。
为什么 我 这么 说 呢 ？ 因为 全 世界 的 人们 都 生活 在 地球 上 ， 要是 地球 是 因为 环境 污染 的 所以 受到 很 大 的 冲击 的话 ， 就 影响 到 在 地球 上 生活 的 人 。
但是 不 能 因为 因此 停滞不前 或 退 。
人为 了 生存 不管是 干静 的 空气 ， 的 空气 都 要 呼吸 。
空气 污染 会 给 人们 的 生活 质量 和 过 幸福 的 生活 的 权力 。
空气 污染 不但 带来 建康 的 问题 ， 就 会 带来 物质 上 的 问题 。
车 的 尾气 是 空气 污染 的 罪名 元首 。
林冲 觉得 困 ， 很 累 ， 想 吃 东西 ， 喝点酒 。
我 就 在 此 了解 了 你 这 罪魁祸手 ， 平平 风气
林冲想 把 这些 头 回京 ， 府 里 见 太 尉时 给 了 他 。
有 一 天 晚上 他 下 了 决定 向 富丽 堂皇 的 宫殿 里 走 ， 偷偷 地 进入 宫内 。
我 的 人生 怎么 残 呢 ?
林冲因 富安 、 陆谦 和 差拨 三 个 人 无法 容忍 的 背叛 行为 ， 仿佛 是 他们 三 个 在 背后 捅 了 他 一 刀 一样 ， 一 想起 山 神庙 的 事 气 得 直达 牙关 。
官吏 腐败 ， 尤其 有 几 个 贪官 污吏 老是 枪 夺 人民 的 财产 ， 百姓 生活 更加 贫穷 。
我 转学 的 时候 ， 感到 很 痛苦 ， 转学 以为 着 失去 我 在 学校 的 一切 美丽 时光 。
刚 到 康桥 中学 时 ， 我 眼前 的 情景 是 韩国 留学生 的 上课 拒绝 了 。
有 一 天 ， 他们 终于 让 善良 的 女 老师 哭 跑出 教室 。
虽然 我 是 无能 的 ， 而且 喜欢 玩 电脑 的 笨猪 ， 但是 眼前 的 场景 是 不 可 容纳 的 ， 也 是 不 可 允许 的 。
然后 跑出 教室 安慰 那 位 女 老师 以及 所有 的 情况 告诉 了 班主任 老师 。
我 考上 北大 之后 ， 遇然 听到 欺负 我 那些 留学生 的 近况 。
可 他 的 表情 是 从来 没 看 过 的 。
我 把 弟弟 醒 过来 后 ， 就 一起 开始 找 答案 。
从此 以后 ， 我 再 不 撒荒 、 抄 答案 等等 行为 。
那 天 ， 我们 要 做 比 原来 两 倍 作业 。
高中时 我们 穿 朴素 端正 的 校服 ， 不 需 华丽 的 装饰 那时 我们 只 报 一 个 书包 就 能 幸福 了 。
我 高中 生活 的 滋味 曼延 我 全身 ， 意 犹 末 尽 ， 就 沁 人心脾 。
有 为 之 没 走进 唱片 行 了 ？ 有 为 之 没 感受 到 当初 的 那 种 悸动 呢 ？
从 我 个人 而 言 ， 在 一 个 城市 ， 文物 和 城市 发展 这 两 个 都 非常 的 重要 。
日本 的 京都 奈良 、 历史 虽然 比 不 上 西安 、 但是 从 建都 以来 的 重要 文物 几乎 全部 都 保护 到 了 现在 。
城市 历史 文化 保护 关系 到 城市 的 文化 品位 、 知名度 ， 总合 竞争力 ， 是 一 个 重要 的 课题 。
但是 ， 互联网 对 我们 有利 和 弊 我们 如何 使用 。
不 知道 的 知识 我们 能 赶快 能 找到 。
我 的 父亲 是 染色 技术 研究所 的 职员 。
她 已经 毕业 了 ， 专业 是 视觉 设计 。
学 外语 是 很 难 的 事情 ， 尚且 汉语 有 许多 汉字 也 有 古代 使用 的 汉字 。
时间 过 的 很 快 ， 我 已经 变成 了 三 年级 了 。
有 可能 ， 因为 我 的 生活 很 忙 ， 所以 感觉 时间 过 得 快 。
学习 汉语 的 很多 外国 学生 在 写 汉语 时 ， 伤 了 不少 脑筋 。
阳光 灿烂 的 今天 我 走进 了 清华 大学 的 校园 。
它们 的 美 逐渐 使 我 所 被 迷住 。
如果 我 遇到 困难 ， 他们 会 帮助 我 、 关照 我 。
从 那天 开始 ， 我们 每 天 都 在 北语 咖啡厅 一起 看 电视剧 。
我 推荐 你 每 天 看 一二节 的 电视剧 ， 对 学 韩语 的 口语 ， 听力 肯定 有 大 进步 ！
我 一 个 人 在 云南 旅行 当中 ， 和 你 认识 的 是 很 幸福 的 。
我 一 个 人 看 明 胜 古迹 的 时候 ， 你 先 对 我 说话 ， 而且 你 就 介绍 和 你 亲密 的 朋友 。
我 绝对 不 能 忘记 和 你 在 一起 的 时间 了 。 我 真 的 感谢 你 。
八月 末 ， 你 会 和 你 的 男朋友 邀请 你 的 婚礼 。
我 跟 老师 联系 就 已经 6 年 多 了 。
这 是 我 第一 次 给 你 写 的 信 ， 所以 我 不 知道 怎么 开始 的 。
国庆 时间 ， 我 多 看 北京 的 名所 ， 多 吃 北京 的 名菜 。
你 还 记得 是 我们 第一 次 见面 ？
但是 现在 我 的 汉语 水平 进步 了 跟 你 聊天 是 没 问题 的 。
我 现在 跟 以前 一样 不 那么 忧郁 ， 反而 现在 性格 很 开朗 不得了 。
最近 我 开始 在 第一 学期 ， 很 努力 学习 。
这里 的 学习 比 青岛 更 紧张 ， 但是 我 能 觉 不 到 我 的 汉语 逐渐 地 提高 。
有时候 ， 备课 和 讲课 能 让 我 累 。
但是 一 个 月 之后 我 在 见 过 你 ， 我 看到 你 进步 的 样子 。
半 年 后 ， 我们 只 用 韩语 能 交流 ， 真 让 我 大吃一惊 。
你 告诉 我 只要 不 放弃 ， 我们 的 人生 中 没有 失败 。
我 在 北大学 的 第一 年 我 吃 了 不少 苦 。
我 每 天 都 要 预习 和 复习 ， 努力 完成 老师 的 任务 。
我 和 家人 都 一起 在 关岛 ， 过 了 很 幸福 的 时间 。
从 那天 开始 ， 我 一直 在 做 作业 忙 着 。
最近 天气 越来越 冷 了 ， 注意 感冒 ！
不 在 我 的 丹东 像 没 鱼 的 鸭绿江 一样 呢 ？
老师 讲课 时 ， 那 既 独特 又 美妙 的 声音 我 忘不了 。
我 起床 的 很 难 ， 总是 睡觉 。
我 以前 上 高中 的 时候 ， 我 一 句 话 也 说 不 出 话 来 。
你 选 了 我 ， 心理 很 受 感动 。
我 交通 事故 了 。
我 听说 最近 韩国 来 台风 的 消息 ， 你 家 哪儿 好 吧 ？
现在 几乎 每 天 的 空气 污染 指数 都 很 高 ， 天上 蒙 着 厚厚 的 烟雾 ， 再 加上 偶耳 刮 大风 的 时候 随 之 一 起 刮 的 沙尘 ， 对 身体 的 压力 还是 很 大 啊 。
或许 你们 看 过 在 奥运会 上 默默 地 跑马拉松 吗 ？
光明 不 能 拿 钱 买 的 ， 就 不 能 容易 求取 的 。
大多数 人 ， 一旦 在 黑暗 下 都 不 知道 自己 怎么 面对 这些 困难 。
其次 需要 对 黑暗 的 思考 方法 了 。
有 经历 摆脱 黑暗 的 人 ， 可以 面对 更 难 更 深 的 黑暗 ， 在 这 个 时候 才 能 得到 自信感 和 勇气 。
慢慢 的 走 黑暗 中 走 出来 ， 需要 决心 和 桓心 ， 还 需要 通气 。
这 是 在 新 石器 时代 ， 人类 开始 害怕 黑暗 ， 所以 需要 光明 为了 避免 恐惧 的 心理 。
光明 与 许是贤 王 的 统治 ， 也许 是 无 战争 和平 。
代表 黑暗 的 形态 也 有 很多 : 疾病 、 天灾 、 战争 ， 竞争 激烈 的 现代 社会 带来 的 压力 ， 环境 污染 等 。
既 使 它们 存在 过 ， 但 很 少 一 种 状况 却 持续 很 长 时间 。
有 个 疾病 就 有 药疗 ， 死亡 就 有 生命 。
一 个 小孩 在 阳光明 眉 的 大白天 感到 平安 和 舒服感 ， 但 一旦 放到 漆黑 的 房间 里 或 在 晚上 让 她 自己 呆 在 外面 ， 孩子 就 开始 哇哇 大哭 。
她 说话 非常 有 幽默 讨人 喜欢 ， 所以 她 在 许多 节目 上当 了 主持 。
他 每 天 过 得 寒冷 和 困苦 的 日子 。
有 一 天 ， 一 个 大学生 玩 着 滑板 ， 在 她 眼前 过去 。
他 请 他 的 朋友 借 了 钱 ， 不过 他们 都 拒绝 了 。
看到 光明 与 黑暗 ， 我 不得不 想起 我 的 高三 时期 。
她 的 人生 就 在 那 黑暗 世界 里 ， 就 永远 都 找 不 到 光明 一样 的 时候 ， 导师 安妮 帮助 了 她 走出 黑暗 世界 。
他 的 家庭 也 没 那么 富裕 ， 当 他 长大 以后 以 打工 在 车库 里 生活 。
人生 就 是 过山车 ， 又 高 又 低 ， 又 光明 又 黑 。
回想 那 一些 人生 的 一 部分 ， 我 才 能 明白 人生 里 存在 的 光明 与 黑暗 是 必须 得 存在 的 要素 。
虽然 在 这 新 世界 我 不 知道 ， 不 熟悉 ， 但是 有 我 的 父母 ， 就 能 战胜 未来 。
是 这 两 次 的 经历 ， 多数 次 的 光明 与 黑暗 影响 了 我 的 人生 。
我 小 的 时候 很 想 养 狗 。
我 班 里 有 很 漂亮 的 女 同学 ， 我 一 见 钟情学 。
所以 一 段 时期 ， 一 天 就 吃 一 吨 饭 ， 睡 得 不 好 。
妈 也 第一 次 打 我 的 ， 我 也 是 第一 次 被 妈打 的 。
解放 后 会 发生 6·25 战争 ， 因此 这些 给 韩国 带来 的 打击 很 大 。
现在 到 韩国 的 光明 时期 的 原因 是 ， 通过 黑暗 的 时代 充满 着 如同 劲草 般 刚强不屈 的 胜心 。
在 成长 的 过程 中 不 摔跤 是 不 可能 的 ， 但 会 有 恐惧 ， 如果 再 过 这 件 会 得到 光明 。
最近 有 很多 有 被 偷 东西 的 事情 。 所以 以免 发生 同样 的 事情 ， 请 学生们 注意 。
这 个 宿舍 的 隔声 不 好 ， 在 晚上 时 ， 别 说 大声
请 勿 晚上 9点 以后 有 大 声音 。
请 勿 要 培养 宠物 。
严禁 宿舍楼 内 抽烟 的 。
请 勿 在 楼道 吵嚷 。
有 麻烦 的 事 ， 去 管理处 。
为了 更 好 的 住宿 环境 ， 请 学生们 准守 几 个 内容 。
韩国 战争 结束 后 的 韩国 是 一 片 黑暗 的 国家 ， 哪 也 没有 吃 的 、 穿 的 。
但 有 许多 年 韩国 得到 世界 贸易 的 中心 。
考试 不 极 各 了 这么 办 ？
面临 困境 的 时候 我们 常常 很 容易 地 抛弃 克服 那些 困境 的 机会 ， 那 可能 是 因为 我们 没有 勇气 ， 人生 中 没有 遇到 过 那么 大 的 困境 。
这 段 话 给 我们 有 道理 的 ， 虽然 现在 黑暗 ， 但 等 着 、 忍 着 ， 光明 还 会 到来 的 。
无论 现在 怎么样 ， 我们 努力 下去 ， 光明 是 不 到 远 的 。
一般 人 想 光明 是 好 的 ， 就 把 好事 比喻 在 光明 ， 就 有 “ 光明 磊落 ” 这 种 成语 。
虽然 这 种 想法 是 人类 之后 一直 保存 下来 的 ， 但是 我 想 如果 没有 黑暗 的话 ， 我们 就 看 不 到 光明 的 辉光 。
因为 我们 在 夜里 休息 ， 早上 可以 更 用力 、 专心 自己 要 做 的 工作 。
世界 历史 上 成就 的 伟大 的 业绩 都 是 追求 光明 而 得以 实现 的 。
对 现代 科学 的 发展 引起 了 巨大 的 影响 。
他 开始 找 如此 感到 黑喑 的 理由 ， 但 找 不 着 理由 。
从此 之后 ， 他 退休 了 公司 开始 在 社会 服务 团体 里 参加 活动 。
虽然 这 两 则 的 性格 很 相同 ， 但是 这 两 则 不 能 同时 存在 事 上 。
互联网 对 我们 的 生活 很 重要 的 陪分 。
但是 ， 上网 也 也 有 些 不 好 的 点 。
我们 迎来 了 最 了 和美 的 中秋 佳节 。
途中 又 很 不幸 ， 恰逢 班机 延误 。
但 也 充满 了 每 个 学生 的 心意 和 温暖 。
此 次 活动 的 主要 目的 是 拉进 师生 之间 的 关系 。
听完 他 母亲 说 他 是 副经历 。
本 公司 为 远方 地区 的 难民 捐出 了 一 大 笔 款 。
我 希望 将来 会 好像 贵 公司 为 别人 做出 贡献 。
手机 是 三星 品牌 、 后面 贴 着 许多 小型 动物 的 贴子 。
直 到 二十 世纪 末 ， 印尼 政府 《 精确 拼音 》 的 发布 才 有所 改变 。
如 在 美国 与 英国 ， 尽管 在 拼写 上 的 差别 都 很 小 。
英语 是 一 种 不折不扣 的 语言
大多数 程序 是 用 英语语偏 的 。
培育 了 中华 民族 成长 的 汉语 ， 称 中文 、 华语 、 国语 、 中 国语 等 其他 名称 。
可 变 得 很 有趣 。
其中 对 数字 能力 的 影响 。
与 一些 亚洲 国家 产生 了 较 大 的 距离 。
中 美 两 国 的 数学 存在 着 差异 。
从 第四 类 混 种语 可 见到 日本人 比 交 喜欢 四 个 假名 的 字 。
它 吸收 了 各 个 国家 的 文化 。 非常 复杂 ， 所以 学 起来 比较 难 。
但是 因为 ， 这么 模糊 又 复杂 ， 所以 学习 起来 很 有趣 。
这时 表达 心 还 在 七上八下 。
大多数 程序 是 用 英语语偏 的 。
不慎 将 手机 遗失 在 草平 里 了 。
实际上 两 者 是 存在 着 差异 的 。 就 好比 英式 英语 和 美式 英语 。
对于 打发 周末 时间 没有 具体 的 安排 了 。
怎么 花 时间 吗 ？
留学 的 城市 是 北京 、 大连 、 杭州 和 徐州 总4 个 地方 。
晚上 还 有 作业 或者 跟 朋友们 一起 睡晚觉 。
为了 补充 精神 、 练习 汉语 。
在 留学 中 需要 很多 钱 ， 有 人 难得 开支 另外 的 费用 。
她 在 周末 不 学习 就 不 能 追 汉语 课 ， 因为 她 觉得 课 很 难 。
留学 的 主要 目的 就 是 对 外国 的 文化 习惯 学习 那 个 国家 的 文化 。
让 留学生 的 留学 经历 更 有 获得 。
只有 性格 和 体力 这 调查 有点 瓜葛 。
他们 为了 健康 投资 了 自己 的 身体 。
就 在 学习 英语 或者 专业 方面 的 。
最少 比例 是 去 宗教 活动 ， 跟 朋友们 见面 。
我们 有 七 个 音乐队 72 天 。
您 给予 的 我 是 一 个 很 好 的 机会 。
因此 ， 上周 应该 交好 的 文件 。
可以 非常 容易 交流 自己 的 同学 。
但是 难于 与 别 的 同学 或 老师们 。
这 个 问卷 调查 的 目的 询问 北大 留学生 的 周末 生活 。
因此 我 不 能 担任 辅助 人员 。
老师们 找 汉语 优秀 的 学生 。
造成 了 电脑 爆发 的 事故 。
您 作为 北大 第一 社团 《 爱心社 》 的 负责任 老师 不少 帮助 周围 的 小孩 。
点评 我们 在 汉语 中 有 所 存在 的 问题 并 提出 了 宝贵 。
从 昨日 达到 四十 度 。
我们 还 需要 用 PPT 和 几 篇 视频 来 表演 吧 。
我们 活动 都 是 必要 电脑 的 活动 。
昨日 晚上 就 有 故障 了 。
共 有 一 个 仁兄 。
历史 、 语系 、 文法 、 词汇 、 很多 地方 都 没有 很 明确 的 规矩 思 。
它 吸收 了 各 个 国家 的 文化 。
此 是 iPhone4 ， 穿 着 粉色 手机壳 。
用完 我 将 会 准于 十一月 十六日 及时 送还 。
“ 周末 留学生 和 谁 过 ， 怎么 过 ？ 问题 进行 了 问卷 调查 。
33.3% 的 人 会 在 家息休 。
第一点 韩语 是 从 爱民 的 心开始 发展 得 来 的 宝物 。
希腊语 慢慢 地变 了 。
期盼 已 久 的 第十一 届 “ 北京 摇滚 音乐会 ” 定于 11月 16日 7点半 在 北京 具乐部 举行 。
共计 有 二十一 个 人 来 准备 舞台 设计 。
这 场 比 塞 是 中文系 一 年 一 次 地 举办 的 活动 。
因此 尚 贵 公司 申请 了 十五 台 电脑 ， 一 个 路由器 和 一 个 网线 出借 。
颜色 是 黑色 的 ， 极其 小 的 屏幕 。
让 我 签订 了 个 贵 公司 。
而且 通过 体育 活动 、 预防 环 季 期间 的 疾病 。
整 个 人 都 付出 了 很多 时间 和 努力 准备 。
我 司 将 改善 各 方面 的 缺点 了 。
为了 提高 留学生 说 汉语 的 水平 ， 举行 了 一 场 很 大 的 比赛 。
为了 留学生 能 加强 、 提高 演讲 汉语 的 水平 。
2013 年 最后 一 夜 的 欢悦 气氛 。
巴士 将 于 晚会 当天 下午 六点 在 北大 理科 教学 楼 前面 出发 。
本 次 讨论会 的 计划 是 为 贾平凹 的 《 高老庄 》 。
举办 了 一 场 名 为 “ 教学相长 ” 的 师生 交流 活动 。 由 中文 系 中国 学生 与 留学生 联合 举办 。
有 一 天 ， 宋 老师 发给 我们 抄写 一些 繁体字 ， 之所以 国庆节 时间 太 长 了 。
在 放假 期间 中 ， 我 看到 那些 抄本 ， 突然 想起 : “ 虽然 我 抄写 一千 字 ， 但是 老师 却 要 看 100 名 同学 的 几万 个 字 。 哎 ， 我们 应该 反省 自己 。 ”
那 舜 间 ， 我 感到 很 惭愧 。
我 不 想 反叛 宋 老师 的 期待 。
当然 宋 老师 以外 ， 北大 的 老师们 都 很 历 害 的 。
所以 ， 我 觉得 她 很 负责 、 很 严格 。
对 工作 这样 热衷 ， 对于 学生 这样 热心 是 值得 我们 敬佩 的 。
老师 的 这样 一 个 人生观 ， 人格 也 是 值得 我们 去 学习 的 好 老师 的 。
这 就 是 我 的 写作 课 老师 ， 大学生 以来 我 最 喜欢 的 老师 。
当时 的 我 汉语 不 够 流畅 ， 唯一 最 好 的 就 是 数学 了 ， 做 的 几 本 上 都 对 。
从 那 以后 我 能够 轻松 地 融入 班级 。
希望 有朝一日 能 去 看看 并 拥抱 那 位 矮小 而 高大 ， 文雅 而 活泼 ， 严俊 而 慈祥 的 老师 ！
老师们 都 知道 我 是 什么 都 听 不 懂 的 “ 韩国人 ” ， 可能 是 可怜 又 可能 不 关 我 ， 都 没 叫 我 。
他 的 声音 很 开郎 而且 是 幽默 。
有 一 天 她 布置 作业 ， 是 读 鲁迅 的 小说 以后 写 二篇读后感 。
进来 以后 把 办公室 扫视 了 一 篇 ， 办公室 的 最 底 角 上 他 在 批改 作业 ， 老师 抬头 看 着 我 ， 旦旦 地 说 是 什么 事儿 。
我 怯怯地 说 了 我 的 情况 ， 说话 说 得 不 太 流利 ， 可是 他 耐心 地 怜 听 我 的话 。
到 了 顺序 ， 他 给 我 作业 。
QT 就 是 基督教 在 凌晨 祈祷 的 行为 ， 老师 把 这 型式 借 过来 用 成 商谈 时间 。
我 和 其他 朋友们 会 站 在 他 的 边 说话 ， 老师 会 给 他 个 结决 放法 。
我们 都 觉得 很 害羞 ， 不 知道 往 那儿 躲 ， 但是 有 一 种 不知不觉 的 幸福感 饱满 了 我 的 心 。
他 每 天 准备 一 个 名句 给 我们 听 ， 然后 解析 给 我们 ， 最后 选出 五 个 人 说出 自己 的 感想 。
金钟九 的 老师 对 我 的 影响 极 大 ， 到 现在 我 还是 回国 的话 去 找 他 。
6 个 月 ， 不 短 ， 但是 学 一 门 语言 很 短 。
我 希望 ， 我 以后 和 我 最 尊警 的 老师 “ 活 到 老 ， 学到 老 ” 。
那 天 是 刚 开学 ， 来到 新 的 学校 ， 见到 新 的 老师 和 同学 ， 心 中 不 犹 生出 一 丝 恐惧 。
她 说 她 可 不 能 宽待 留学生 。
在 课堂 上 ， 她 讲课 热情 ， 不驯于 学校 内 任何 一 位 年轻 老师 。
她 真 得 对待 我 的 中国 学生 一样 、 太平 等 了 。
我 对 她 的 第一 印象 是 温柔 和蔼 。
每 个 星期二 ， 老师 让 我们 布置 作业 。
我 在 教室 里 期待 着 期待 新 的 老师 。
我 一 大 很 吃惊 ， 因为 我 以为 他 很 年轻 。
我 以前 跟 本 没有 对 中国 古 汉语 的 知识 。
这 个 学期 也 是 上 宋 老师 的 课 ， 我 希望 学到 的 东西 更 多 。 希望 我 的 水平 更 提高 。
北京 的 发展 很 快 ， 所以 10 年 前 来 北京 的 朋友 再 来 北京 时 ， 从 北京 首都 机场 的 规模 和 现代式 的 设计 而 感叹 。
在 好 大学 附近 和 朋友们 学习 ， 感觉 大家 的 学习 都 很 热情 ， 老师 也 教课 更 热情 ， 能 增进 学习 的 校果 。
我 看到 北京人 很 爽快 。
看 了 周 违 ， 我们 就 会 发现 已经 不少 人 在 天漠 ( 离 北京 最近 的 沙漠 ) 栽种 树木 ， 少 用 汽车 。
我 过去 有 偏见 对 中国 的 。
第一 个 理由 让 我 的 朋友 会 喜欢 北京 是 因为 北京 非常 大 ， 有 很多 旅游 胜地 。
我 来 北京 将近 两 个 月 了 ， 但 我 还 不 下 看 北京 的 旅游 胜地 。
还 有 这 是 我 的 第二 次 访问 北京 ， 既 是 同样 的 地方 ， 每 次 各 别 。
但是 在 北京 ， 因为 故宫 太 大 了 ， 一 天 就 不 能 看 。
我 的 朋友 喜欢 去 看 热闹 ， 所以 我 信 我 的 朋友 很 受惊 对 北京 的 规模 。
所以 要是 她 来 北京 ， 我 说 大话 能 不 希望 回国 。
我 不 能 出去 外边 一 个 星期 ， 我 不 能 看到 碧澄 的 蓝天 ， 都 黄色 。
我 信 我 的 朋们 有 看 这 不 好 光景 ， 她 大失所望 。
我们 的 家人 都 在 中国 ， 得 赶紧 回国 看看 爷爷 ， 这时 会 是 最后 看 爷爷 生前 的 。
零晨 1点 才 能 到 。
她 不 回答 ， 马上 变成 那 赤练 蛇 缠 死 他 的 段誉 ， 吓到 了 横冲直撞 。
那 赤青 蛇 它 爱上 了 段 誉 ， 谁 都 不 能 亲进 他 。
所以 段誉 一直 没有 妻子 和亲 朋友们 。
但 路人 却 只有 增 不 减 也就是说 本地人 都 不 出门 ， 或 去 其他 地方 ， 在 北京 大多数 是 游客 。
那 是 一 张 青春 亮丽 的 脸庞 ， 堆满不屑 和 调侃 的 笑意 吧 。
众人 也 跟 着 转移 视线 ， 纷纷 盯 着 这 两 个 不 知 死活 的 一 部 一 女 。
以后 ， 不仅仅 在 工作 上 ， 在 为人 处事 上 我 也 会 努力 地 做到 。
听 着 夏天 百鸟争鸣 的 叫声 。
为了 保持 留学生 与 中国 学生 之间 的 良好 关系 并且 提高 相间 的 了解 ， 我 系 留学生 将 于 十月 三十日 举行 一 场 联谊 晚会 。
我 在 办理 住宿 登记表 上 遇到 了 很多 问题 ， 经贵 公司 解决 ， 终于 可以 放心 ， 可以 将 时间 与 力气 用 在 学习 上 。
这时候 我 天天 坐立不安 ， 未 能 集中 注意力 ， 也 影响 我 的 学习 和 公作 。
后 有 贵 公司 的 一 位 人员 帮 我 解决 这 个 问题 。
加拿大 日 每 个 城市 都 庆祝 。
大家 都 想 吃 烧烤 和 运动 。
为了 好好 庆祝 加拿大 日 ， 国家 将 在 渥太华 开 一 场 游行 。
如果 人们 享受 好 节日 。
其实 加拿大 日 没有 什么 安排 ， 并 没有 一定 要 做 的 东西 。
在 全国性 当中 ， 既 有 国家 的 法定 节日 ， 也 有 民间 风俗性 节日 。
日语 中 叫 “ 元 日 ” ， 亦 即 在 新年 ， 并且 和 中国 的 春节 一样 具有 驱逐 魔鬼 ， 迎接 神灵 的 含义 。
比如 ， 除夕 之前 大门口 搭建 了 “ 门松 ” 。
甚至 许多 过年 风俗 比如 ， 除夕夜 去神社 撞钟 、 唱神 酒 、 拜年 、 给 小孩 压岁钱 等 与 中国 相同 了 。
6 ， 共同 物品 后 ， 把 物品 清洗 干静 。
一 ， 请勿 吸烟 在 宿舍楼 内 的 什么 地方 。
四 ， 严厉 在 宿舍 内 养 偘 动物 。
三 ， 请 勿 舍弃 垃圾 。 请 用 每 屋 走廊 前面 的 垃圾 桶 或者 房间 里 。
朝鲜 时代 正祖 ( 朝鲜 的 22代王 ) 的 命令 下 做 建筑 的 。
这 座 城 是 很 有名 的 旅游区 ， 在 那里 举行 了 很多 活动 。
第一 个 是 妙 年糕 ， 韩国人 一般 都 喜欢 的 采 之一 。
第二 个 是 土司 ， 芝士 培根 金枪鱼 的 土司 ， 这 也 很 简单 。
但 通过 国家 的 支持 下 ， 我 开始 重新 建筑 。
由于 韩国 人民 想 保修 原来 的 样子 ， 保修 的 时候 很 长 。
在 冬至 吃 的 红豆 粥 里 窝 聚 着 新年 一路 平安 、 恶气 被 驱赶 的 心情 。
把 面团 和 盐 放入 在 蒸 着 的 红豆 粥 上 。
很 久 以前 寺庙 里 曾 有 太 闻名 的 一 干 尊 佛像 和 一 干 座 佛塔 。
寺 内 还 有 新罗 时代 石匠们 雕刻 了 许多 美术品 。
很 久 时候 ， 63 大厦 占 韩国 最 高 的 大厦 。
因此 63 大厦 到 现在 深 历 游客 和 韩国 市民 的 爱护 。
糖醋 饺子 最 重要 的 部分 就 是 做酱 的 。
牛 排骨 汤 源于 韩国 以前 做 过 的 先 农 祭祀 。
参 鸡汤 在 韩国 是 一道 非常 著名 的 菜肴 。
做 参 鸡汤 需要 的 材料 比较 多 ， 就 是 小鸡1 只 、 糯米 1杯 、 水 参 、 枣 6 个 、 松子仁 6 颗 和 人参 1 支 、 栗子 6 颗 。
东方 明珠 是 景色 美丽 ， 代表 上海 的 著名 现代 建筑 。
8 . 把 刚好 的 作料 均匀 地 抹 在 每 片 白菜叶 上 。
裙带菜 汤越 煮 长 时间 越 好 。
其中 有 一 是 比萨 斜塔 。
韩国 泡菜 所 取 的 原料 都 是 各 种 蔬菜 。
据信 他们 让 成千上万 的 工人 推 着 石块 爬上 斜坡 ， 可惜 的 是 印加人 并 未 掌握 文字 的 技巧 和 没有 留下 任何 描述 文字 。
豆浆石 花菜 或者 豆浆 都 是 本来 不 放 糖 ， 它 是 南方 料理 的 特色 。
我 要 介绍 一 款 减肥 食品 —— 鸡胸肉 海带汤 。
那天 大部分 的 新闻 上 的 题目 就 是 : “ 欢迎 我们 的 第一 号 国宝 ， 崇 礼 门 回来 ！ ”
听 了 我 的 介绍 ， 你们 觉得 怎么样 ， 对 泰式 炒面 吧 。
因为 北大 里 有 很多 留学生 ， 所以 北大 想 建筑 留学生 公寓 。
学校 应该 敢 快 为 外国 留学生 提供 宿舍 。
我 一 个 人 觉得 学校 造 一 个 留学生 的 网站 。
每 年 有 一 次 举行 留学生 运动会 。
我 想 你们 管理员 找找 缓和 这 个 问题 的 办法 。
第二 天 ， 我 有 事 出门 ， 发现 电梯 里 还 有 昨天 室友 说吐 。
我 希望 您 和 全体 工作 人员 会 负起 责任 ， 应该 不 让 人们 在 宿舍楼 内 抽烟 。
而且 他们 拿 着 照相机 随便 进 学生 的 房子 拍照 。
每 层 墙上 明显 贴 着 “ 禁止 吸烟 ” 的 标志 ， 但 满 屋子 都 是 烟味 的 。
要 形迹 不 准 的 陌生人 应该 能 提高 警惕 ！
我 想 说 是 关于 留学生 宿舍 安全 的 问题 ， 优其是 “ 勺园 ” 。
我 这 个 星期二 早上 走床 以后 ， 为了 去 洗手 我 个人 的 房间 。
所有 的 住 勺园 的 留学生会 担心 房子 的 问题 。
但 我 发现 很多 同学 没 去 过 其它 的 地方 旅游 。
我 先 办 了 一 个 ‘ 中文 系 旅行团 ’ 。
现代人 有 所 有 的 方面 ， 有 很多 事 要 和 别人 联系 。
说 实话 ， 我 几 天 不 能 入睡 ， 是 因为 有时 住上层 的 人 吵 得 很 ， 有时 的 前 房 的 人 非常 嘈杂 。
对 留学生 来 说 ， 有 很多 的 钱 。
首先 ， 房间 不 太 大 ， 进 三四 个人 的 时候 ， 没有 坐 在 的 位置 。
很多 人 只 用 这 两 个 洗衣机 。
我 感觉 像 是 韩国 的 大学 一样 比较 舒服 。
与 平时 不 常 ， 我 在 电递 里 感到 不安 ， 电递 突然 开始 上 摇摆 。
我 认为 ， 对 贵 宿舍 的 电递 要 进行 给专们 的 修理 。
然而 ， 有些 人 迷惑 了 豪 楼 大厦 。
四 、 在 房间 里 安静 呢 。
你们 应该 不 犯 了 。
大学 生活 在 外边 ， 身边 没有 父母 ， 只是 我 一 个 人 生活 。
但 由于 很多 战争 ， 有些 建筑物 消灭 了 。
真 不幸 的 是 ， 2008年 2月 10号 有 一 个 人 放火 。
正门 的 两 侧 原来 有 城郭 ， 但 现在 不 存在 。
而且 石 花菜 本来 以 卡 各 里 太 低 的 健康 食品 。
把 豆浆 倒进石 花菜 上面 。
煮 石花菜 、 水 开 了 之后 。 用 中低 火 一 个 小时 以上 炖 它 。
黄豆 要 坐 前夕 洗完 水泡 。
裙 带 菜 既 营养 丰富 ， 还 具有 降低 血压 与 增强 血管 级织 的 作用 。
肉熟 完 ， 把 用 酱油拌 的 裙带菜 放入 锅 内 ， 再 加 香油 一起 炒掉 。
把 裙 带 洗净 ， 泡透 大概 20 分钟 ， 撕成 小 块 。
可谓 古代 文化 极 多 的 寺院 。
一般 的 男人 都 不 能 做饭 、 采 ， 只有 少数 会 做 而已 。
因此 人们 想 为了 尝试 地道 的 安洞 炖鸡 的话 ， 必须 要 去 到 安洞 地方 。
然后 修整 别 家 的 材料 。
佛国 寺 表达 出 了 新罗人 的 信仰 和 原望 。
然后 把 鸡块 用 餐厅 纸 擦掉 。
把 鸡肉 要 切块 ， 然后 再 鸡肉 上 的 肥肉 都 要 拿到 。
博物馆 外面 的 环境 跟 博物馆 的 风格 非常 融洽 。
排骨汤 里面 的 铁分 ， 维生素 B助于 血馆 ， 甚至 能 防 衰老 ， 对 皮肤 也 很 好 。
锅开 之后 ， 放入 事先 准备 好 的 萝卜 、 人参 、 和 大葱 、 生姜 末 和 蒜泥 一道 。
当 牛肉 排骨 煮 了 一 段 时间 之后 ， 用 快 子插 了 一下 牛肉 ， 检查 煮熟 了 没有 。
它 是 在 朝鲜 建国 初期 为 防御 外敌 建筑 了 城墙 。
还 有 一 种 说话 ， 日语 的 “ 豆 ” 和 “ 魔目 ” 、 “ 魔灭 ” 都 是 谐音 ， 所以 大豆 可以 灭 魔鬼 的 。
这 是 因为 把 附近 的 祸气 和 魔鬼 等等 的 坏 的 东西 集中 在 神社 里 ， 神社 能 不 让 它们 随便 胡闹 ， 保护神社 附近 的 老百姓 。
我们 吃 的 鱼 ， 吃卷寿司 ， 报 大豆 。
我们 认为 ， 变 季节 的 时候 会 发生 邪气 ， 所以 要 把 邪气 灭掉 。
这 洋 的话 ， 下 一 年 的 福气 来到 了 自己 身上 。
因为 那时候 的 月亮 是 满月 ， 泰国 正 是 河水 高涨 ， 月儿 清辉 的 美好 季节 。
以前 是 为了 供奉 印度 的 主神 ， 三 位 有 大梵天 、 大 自在 天 与 妙天比天 。
泰国人 来 说 ， 举行 水灯节 的 活动 最 重要 是 为了 赔罪 水 女 。
企业 在 招聘 时 的 条件 也 存在 门槛 过 高 的 现象 。
可 有 多少 机率 他 或是 她 已经 身在 稳定 的 工作 呢 ？
职场 上 的 求职 竞争 越来越 激烈 ， 即使 大学 毕业生 也 频频 面临 失业 危机 。
随着 失业 的 连年 上升 ， 现在 美国 全国 失业 总 人数 已 达 1530万 。
现今 ， 很多 大学 毕业生 开开心心地 从 大学 门口 走 出来 ， 就 遇到 了 意 想到 的 困境 —— 。
要 缓解 就业 问题 ， 我 认为 应该 做 不 到 这 几 个 方面 。
在 4 年 的 大学 生活 中 ， 有 大学生 光顾 着 怎么 用 于 轻松 的 办法 拿到 学位 。
所以 ， 上 大学 不 是 为了 就业 能 有 种 很 好 的 跳板 。
尤其是 中 小 企业 ， 追求 实用 和 低 成本 ， 不 愿 承担 新人 的 在岗 费用 ; 更 有 着 缺乏 现代化 管理 方式 。
据 某 一 资料 提到 过 ， 原 国家 文物 局长 张得勒 先生 曾 提出 过 : 最近 出现 不 经 文物 部门 审批 擅自 把 文物 保护 范围 内 的 土地 或是 带有 文化 遗址 的 土地 批租 转让 给 外商 的 事情 。
传统 代表 着 民族 的 智慧 。 这 种 现象 尤其是 从 文物 中 ， 我们 可以 看到 了 先人 的 智慧 。
甚至 ， 两 个 洗衣机 中 一 个 坏 了 。
我 希望 你们 贵 部 能 接纳 ， 请 你们 考虑 增加 洗衣机 的 数量 ， 改善 服务 态度 。
他 说 那 不 是 他们 的 问题 。
我 认为 我们 有 权力 能 提出 出 我们 的 意见 。
在 那时候 余 司令 流下 的 不仅 是 红红 的 血 ， 两 行 泪水 也 是 从 他 坚硬 的 脸 上 流下 出来 。
在 《 天龙 八 部 》 中马五德 虽然 不 是 主角 ， 但 金庸 对 他 的 描写 也 很 清晰 。
其中 也 正面 描写 ， 也 有 通过 侧面 的 。
到 了 后来 ， 誉 被 打 ， 文章 写 到 “ 马五德心 中 不忍 ， 抢 过去 伸手 扶起 ” ， 这 是 心理 描写 和 动作 描写 。
对 战士 背上 的 创伤 很 羞耻 。
龚光杰 的 身体 说 完 话 前 都 已经 倒下 了 。
段 誉 看 了 看 少女 的 华丽 武功 ， 一眼 就 爱上 了 少女 心 里 想 怎样 才 能 得到 她 的 好感 呢 ？
那 姑娘 根本 就 对 左 子穆 不 害怕 吧 。
少女 的 那 黑色 皮肤 渐渐 变白 了 。
这时 ， 从 窗外 传来 了 一 位 秀丽 的 男生 。
他 脸色 变 红 ， 对 她 大声 喊 着 : “ 赶紧 下来 ！ 要不然 我 就 把 你 分成 两 块 儿 ！ ”
它们 像 是 一 队 训练 的 精锐 军队 。
左 子穆 看 了 死 过去 的 光杰 ， 冲 过去 ， 大喊 : “ 光杰 ！ 打起 精神 。 打起 精神 来 。 ”
他们 开始 对 段 誉 产生 好奇 ， 不 知 为 何 段 誉 如此 ， 如此 胆子 那么 大 。
段 誉 大吃一惊 地 瞧 了 梁 上 的 少女 ， 便 向 少女 表示 感谢 的 动作 。
众人 虽 惊奇 少女 的 出现 ， 但 注意力 很 快 又 回到 这 年轻 弟子 身上 了 。
贵 公司 对于 外国 工作 的 人员 照顾 得 非常 好 。
如果 ， 有 时间 请 去 本 次 活动 。
若非 不 是 贵 公司 可能 很 难 能 学到 。
贵 公司 给予 支持 下 我 有 了 充满 的 信心 。
开始 之前 ， 我 要 学会 多方面 的 知识 ， 做好 精神 准备 。
老师们 这 一 年 当中 为 中文系 和 我 系 的 同学 殚精竭虑 。
当做 计算机 作业 的 时候 ， 我 会 毫 无 困难 地 完成 作业 ， 想 这 离 不 开 李 先生 及 各位 的 帮助 和 表扬 。
但是 老师们 的 悉心 关怀 和 孜孜不倦 的 教诲 下 ， 我 慢慢 了解 研究所 的 工作 。
我 已 刚 回到 北京 的 学校 ， 已 完成 回 学生 的 生活 。
更 令 我 感谢 的 ， 也 便 是 贵 公司 给予 我 的 鼓励 与 帮助 。
贵 公司 受到 我 的 联系 之后 ， 立刻 派 有关 部门 的 主任 和 律师 引起 了 当地 警察 的 合作 。
希望 这 次 晚会 时 ， 同学 与 老师们 都 带 着 美好 的 记忆 ！
本人 在于 暑假 期间 贵 公司 学习 ， 事务 能力 增加 了 。
4月 3日 ， 我 在 网 上 开始 找 能 实习 的 公司 。 然后 和 领导 见面 ， 这时 ， 虽然 我 是 实习生 但 他 很 热情 。
中文系 的 各 位 老师们 都 对 这 中文系 作出 了 很 大 的 贡献 。
现在 我们 留学生 跟 老师们 交流 的 机会 太 少 了 ， 而且 我们 有 很多 问题 向 老师 教 的 。
我们 非常 感动 职员们 的 态度 。
本人 是 在 贵 公司 的 一 名 实习 吧 。
那时 ， 李 经理 全心全意 地 教导 了 我 ， 他 带领 我 去 熟悉 周围 的 环境 ， 很 热情 地 对待 。
在 飞行 过程 中 ， 张 小姐 和 刘 先生 不时 来 他 身边 看护 ， 对 我 的 关怀 无微不至 。
中国 语言 文学 可 谓 一 种 代表 中国 的 文化 ， 而 北京 大学 中国 语言 文学 系 的 历史 非常 悠久 。
6月 20日 ， 我 初次 来到 贵 公司 ， 因 我 的 小 失误 影响 了 贵 公司 的 重要 合同 ， 但 贵 公司 的 王经理 并 不 向 我 指责 。
您 对 语言 研究 以及 日常 用语 有 着 极 大 的 成就 。
本人 在 贵 公司 实习 了 二 个 多 月 ， 时间 有 了 许多 新鲜 的 事情 。
我 在 超市 里 工作 第一 次 ， 所以 我 工作 前 很 可怕 ， 工作 速度 也 很 慢 。
工作 内容 : 做菜 ， 能 从事 做 法国 菜 者 做 优先 考虑 。
在 贵 公司 实习 学期 ， 我 得到 您 的 关心 和 爱护 得 使 我 学习 到 很多 东西 。
我 感到 好像 爸爸 的 关心 一样 温暖 ， 而且 很 感动 。
伤心地 哭时 ， 您 安慰 我 告诉 我 在 公司 里 做事 ， 需要 注意 细心 一点 。
我 系 留学生 热衷 地 邀请 您 莅临 我们 的 大赛 ， 任 评委 一 职 ， 给 我们 点评 我们 在 汉语 中 存在 的 问题 以及 建议 。
每当 经历 一些 问题 的 时候 都 会 想起 了 您 对 我 的 忠告 ， 使 我 很 快 地 克服 困难 。
面试 要求 : 流畅 地 说 北京话 和 有 一点 法语 基础 的 厨师 优先 。
中秋节 时 一般 的 韩国人 都 会 回 自己 的 故系 去 见 父母 。
由于 中国 风俗 的 影响 ， 韩国人 也 有 扫墓 风俗 。
他们 在 中秋节 时 把 收获 的 谷物 中 拿 一 部分 ， 然后 捆 一 捆 。
每 年 韩国人 都 应该 醒悟 这 一 点 。
中秋节 有 好多 韩国 的 风俗 ， 其中 我 介绍 了 几 个 。
春节 就 表 食物 是 年糕 汤 。
春节 是 韩国 中 最 大 的 风俗 。 所以 ， 每 个 人 都 关心 。
圣露西 一 位 以 仁爱 闻名 的 圣徒 。
强 羌 水 越 来 是 女生们 做 的 团体 游戏 。
中秋节 晚上 洗碗 后 望 月 出来 时 ， 年轻 的 夫女们 在 宽坦 的 地方 一起 拉 着 手 旋绕 。
初始 按 慢慢 的 节奏 挑舞 ， 以后 节奏 越来越 快 ， 人们 的 快乐 也 越来越 好 ， 这 就 是 强 羌 水 越 来 的 特征 。
在 北朝鲜 玩 ‘ 火 游戏 ’ 的 时候 让 孩子们 在 栗子 树 下面 着火 ， 打栗子 树 。
元宵节 的 来源 在 《 三 国 遗事 》 记载 。
韩国 的 元宵节 有 这么 多 的 意义 ， 而且 能 跟 邻居们 团聚 机会 。
十二月 是 瑞典 一 年 中 黑夜 最 长 白天 的 一 天 。
现代化 不 是 一 件 坏事 ， 但是 世界 各 处 都 有 一样 的 摩天 大楼 、 一 同样 的 道路 。
因此 人们 要 认识 ， 要 学会 保护 一些 好 的 传统 ， 发扬 民族 的 精神 。
法国 巴黎 具有 独特 魅力 的 一 座 城市 吗 。
但是 社会 高速 发展 损坏 了 文化 遗产 。
损坏 的 文化 遗产 不 能 灰复 到 其 原来 的 价值 。
如果 我们 为了 社会 的 发展 ， 一 个 文化 遗产 可以 再 建 跟 它 像似 的 建筑 。
对 一 个 国家 的 社会 发展 和 保护 文物 都 是 很 重要 的 。
所以 人们 想 放慢 城市 发展 。
随 科学 、 信息 技术 的 发展 ， 城市 发展 与 文物 保存 之间 出现 冲突 。
就 像 现代人 到处 留言 到处 做 纪念 一样 ， 我们 的 祖先 必然 也 是 希望 自己 存在 过 的 证据 。
历史 上 曾经 出现 过 的 几 次 世界 城市 大 变动 都 在 类似 的 环境 下 出 更 的 。
孔子 想 没有 稳定 的 文化 基础 ， 还 没有 发展 。
现在 所 流下 的 文物 在 自然 的 法则 下 无法 逃脱 最终 毁掉 命运 。
在 那 混乱 的 场景 中 ， 少女 已经 到 了 段誉 的 后边 。
交流 : 指 的 是 家长 要 保持 一 个 与 孩子 交流 ， 避免 长期 时间 后 的 家长 和 孩子 相处 变 尴尬 。
她 既 教养 又 有 才能 的 人 。
他 在 出生 于 好 家庭 受到 良好 的 家庭 教育 。 甚至 他 喜观 读书 和 学习 。 全力以赴 地 学习
家庭 教育 对 孩子 的 成长 有 了 这么 大 的 影响 所以 我们 要 知道 父母 是 孩子 的 镜子 。
在 这时 ， 最 需要 的 是 既 不 是 事 大 主义 ， 又 不 是 国粹主义 ， 而 是 拥有 文化 相对 主义 的 态度 。
希望 所有 的 父母 都 能 重视 家庭 教育 境 ， 造成 良好 的 家庭 气氛 。
家庭 教育 是 个人 在 心 里 还 有 脑子 里 永远 内含 的 ， 因此 父母 得 给 孩子 正确 的 家庭 教育 。
一 个 孩子 在 很 富有 的 家庭 情况 下 长大 ， 也 没有 受 好 正确 的 家庭 教育 。
人们 总是 一 为 地 光明 ， 一 为 地 避开 黑暗 。
勤奋 刻苦 ， 不 折 不 挠 的 精神 是 从 黑暗 走向 光明 的 的 必要 条件 。
时间 过 不久 和尚 觉得 口 喝 无法 忍受 但是 他 起来 意外 摸到 身旁 有 一 瓢 水 了 。
背 生 词 并 不 难 ， 这 是 取决于 自己 的 心态 ， 多么 复习 。
光明 是 很 短暂 的 瞬间 。
于是 每 个 人 选择 对 自己 合适 的 记忆 生词 ， 或者 创造 出 新 的 背生词 的 方法 。
背完生词 之后 ， 再 读 课文 ， 那么 更 容易 做 生 词 的 用法 和 意思 。
背 生 词 时 ， 不 要 只 背 单词 ， 如果 背完生词 还 要 会 怎么 用用 。
无论 如何 语言 是 单词 构成 的 。
但 其实 同意 他 的 意见 ， 但 我 不 想 复习 。
虽然 每 个 人 有 不同 的 记忆 习惯 、 记忆 方法 、 记忆 特点 ， 但是 用 自己 的 方式 还 能 遇到 困难 ， 上 一 试 上面 的 方法 。
人 的 脑子 是 无限 的 ， 虽然 每 个 人 不同 的 办法 来 记住 东西 ， 但 这 记忆力 谁 都 不 知道 得到 达点 。
主要 的 原因 是 人 对 光明 和 黑暗 有 不同 的 意义 和 感性 认识 。
我 上 中学 的 时候 还 记得 美术 时间 。 老师 教 了 我们 明和 暗 关系 的 重要性 。
如果 我们 认识 黑暗 ， 我们 可以 把 光明 更 亮 的 明 。
如果 不 读书 ， 那么 将来 因为 没 读书 做 不 了 很多 自己 想 要 做 的 事情 。
大学 ， 表面 意义 上 就 是 每 一 学生 享受 更 多 的 、 更 高等 教育 的 地方 。
再 有 ， 即使 有些 人 想好 不 读书 ， 直接 进入 社会 工作 ， 这样 的 盲目 的 选择 下 我们 能 为 社会 做出 什么 呢 ？
读书 真 的 无用 吗 ？ 我 十分 不定 观点 。
学生 是 应 刻 学习 的 。
简单 的 工作 一定 不 能 安心 的 。
大家 不 用 一点 读书 的 时候 ， 发生 了 刚才 我 说 的 样子 。
为了 经济 的 发展 ， 老人 不 能 只 做 工作 ， 应 刻 需要 年轻人 。
但是 年轻人 是 不 能 难 的 工作 的 时候 。
这 话 说 的 人 只只 想 个 人 。
那 社会 不 能 发展 应 刻视 集体 利益 重于 个人 的 利益 。
我们 只 能 通过 书 ， 才 能 经验 那 时代 的 生活 。
但是 他 读 关于 美国 的 书 以后 ， 会 经验 美国 的 生活 吧 。
那时候 我 读 那 本 书 之后 ， 开始 捐 钱 给 非洲 孩子 的 活动 。
书 不但 给 读者 很多 知识 和 间接 经验 的 机会 以外 ， 还 有给 读者 很 大 的 影响 。
或者 觉得 大学 时 学习 内容 和 实在 工作 上 用 的 知识 之间 有 很 大 的 差别 。
我们 还是 关注 现在 大学生 就业 压力 比较 大 的 时候 真的 没用 。
通过 很多 时间 ， 在 人 的 看法 上 能 表现 。
读书 一点 用处 都 没有 的 问题 ， 对 我 来说 ， 确实 是 错 的 。
因为 得 了 准备 就业 之 忙 ， 所以 时间 能 读 只 是 一 种 借口 。
现在 找 工作 也 很 难 ， 我 估计 以后 越来越 难 找到 。
有 人 说 读书 的 那 时间 可以 跟 找 工作 有关 的 事 做 。
最 重要 的 是 自己 主动 选择 自己 想 读 的 ， 比 也 不 会 我 迫 别人 读书 。
这样 的话 ， 倒 读书 的 给 我们 的 乐趣 渐渐 少 了 。
我 觉得 读书利 以 找 工作 时 能 减少 压力 ， 同时 增进 知识 。
经过 很多 研究员 和 员工 的 功劳 ， 结果 是 会 享受 更 方便 的 生活 环境 。
即使 大学 毕业 后 都 会 遇到 就业难 。
但 从 人类 会 笔记 以后 ， 生活 环境 跟 以前 比 不 能 丰富 了 。
我们 的 人生 上 面临 各种各样 的 情况 。
所以 我们 人生 上 将 面临 各种各样 的 困难 的 问题 。
我们 以后 什么 书 最好 呢 ？ 我们 要 选择 好 的 书 。
虽然 学历 木 是 能 完全 证明 一 个 人 有 能力 。
但是 轻视 是 错 。
读书 无用 论 是 不 对 的 。
这 情况 下 就 出来 读书 的 知识 。
我 觉得 对 开始 大学生 也 不 知道 自己 的 兴趣 。
可是 我 对 这个 观点不往脚 。
可是 书 只 能 花 100 元 左右 的 钱 ， 可以 尝 名人 的 知识 ， 这 有 多么 好 啊 ？
我 以前 不 爱 读书 的 人 ， 觉得 现在 人们 在 想 的 一样 。
当时 面临 的 问题 ， 因 书 来 解决 ， 并 克服 。
现在 很多 人 认为 大学 只 为了 找 工作 的 通过 点 而 以 。
为了 学生 的 安全 ， 请 遵守 下面 写 的 几 些 事项 。
特别是 大学生 的 就业 难 是 最近 越来越 好 。
大学 要 一 种 开阔 人间 关系 的 场所 。
还有 最近 大学 为了 缓解 学生 的 就业难 ， 跟 一些 公司 。
还 有 书 让 人 拥有 一 个 自己 的 思想 。
甚至 母语 也 能 学 读书 。
读书 不但 给 人 知识 ， 而且 还 给 人 自己 的 思想 或者 意见 是 对 什么 事物 。
但是 光明 只 是 短暂 的 ， 黑暗 总是 追 着 我们 。
黑暗 也 像 光明 一样 就 带有 能力 。
我 一 个 人 住 在 房间 里 ， 偶尔 会 突然 停电 。
眼前 突然 一 片 黑暗 ， 我 没 想到 那么 害怕 了 。
如果 身边 有 朋友 或 同 屋 的话 ， 我 不 会 那么 害怕 。
黑暗 没有 什么 声音 ， 直接 过来 ， 模模糊糊 的 ， 什么 都 想 不 起 过来 了 。
只 有 这样 ， 才 能 让 孩子 在 爱 中 健康 成长 ， 才 能 感受 孩子 的 内心 的 世界 和 思想 ， 才 能 造成 和睦 的 家庭 。
父母 能 给予 孩子 更 多 的 情感 温暖 与 理解 ， 可以 促进 儿童 道德感 、 适应 能力 。
上学 之后 ， 也 一直 到 独立 ， 甚至 独立 之后 ， 受到 父母 的 教育 和 影响 了 。
因此 家长 不 要 只 在 学业 方面 ， 忽视 道德 方面 。
有 的 孩子 在 打骂 下 成材 ， 有的 是 在 关怀 里 成材 。 为 孩子 创造 了 一 个 对 孩子 最 合适 的 健康 、 和谐 、 温馨 家庭 。
那 我们 要 知道 在 家庭 对 孩子 怎样 教育 ， 对 孩子 的 成长 有 什么 好处
以色列 虽然 国家 比 强大 国 ( 美国 、 法国 等等 ) 势力 小 ， 但是 他们 已经 把 诺贝尔奖 获得 了 人 已经 超过 了 20万 人 。
市 教 教研室 对 25万 人次 进行 了 大型 调查 ， 通过 对 “ 中小 学生 英语 能力 展示 活动 ” 和 “ 近 两 年 中 高考 各 学科 成绩 反馈 ” : “ 双语 学校 部分 家长 调查 ” 等 12 个 项目 的 观察 和 分析 分明 。
在 这 个 年龄 段 开始 学习 外语 ， 不 会 与 母语 冲突 极 高 。
在 与 别人 ， 表现 出 适应 和 积极 行为 的 能力 。
孩子 会 通过 家庭 教育 ， 学到 生活 习惯 和 生活 能力 。
晚上 8点 之前 就寝 的 孩子 第二 天 让 自己 起床 63.1% ， 吃 早饭 86.9% 。
而且 ， 在 儿童 养成 的 基本 习惯 对 以后 的 成长 发达 有 颇 大 影响 。
有 了 孩子 后 ， 父母 不仅 为了 努力 工作 赚 钱 ， 还 需要 为了 孩子 的 将来 ， 为了 孩子 的 未来 应该 意识 家庭 教育 。
我 也 能 成为 在 国 现在 社会 里 生存 的 一 个 重要 的 武器 。
最后 我 再 一 次 证明 我 的 观点 : 学习 外语 不 影响 母语 退化 。
我 虽然 没有 在 母语 的 环境 ， 但 我 相信 好 的 学习 方法 能 让 汉语 和 母语 一起 提高 。
他 接受 采访 时 说 自己 的 成长 当中 ， 不管 是 在 物理 方面 还 是 在 心理 方面 ， 都 有 了 非常 大 的 困难 。
不同 的 家庭 教育 影响 着 孩子 的 性格 、 学习 及 成长 道路 。
这 就 为 培养 他们 成为 歌手 提出 了 物质 的 条件 和 可能性 。
有 的 孩子 生来 观察 ， 这 就 会 为 他们 学 绘画 等等 。
这 次 有 了 这 个 计划 ， 这 是 因为 我们 在 网 上 找到 了 印度 咖喱 的 做法 。
这 是 个 很 幸运 的 事情 ， 因为 我 小时候 学 了 一点儿 摩登 芭蕾 。
但是 ， 我 小时候 学 过 ， 后来 完全 忘记 的 东西 ， 把 它 重新 学习 ， 真 不 容易 。
每 个 人 都 做 一 、 两 种 点心 ， 但是 也 发生 了 没 想到 的 事情 。
我 从小 自己 学会 做 点心 ， 现在 已经 习惯 了 ， 做 点 心地 要 注意 的 几 个 地方 ， 现在 都 无 意识 地 做 。
虽然 这 次 有 了 不少 麻烦 ， 但是 起来 之后 看到 大家 发来 的 短信 ， 知道 大家 都 很 满意 ， 我 也 高兴 起来 了 。
吃 、 玩 到 了 晚上 十点多 就 要 赶快 坐 地铁 回去 ， 我 坐 超过 海淀 黄庄 ， 坐 到 巴沟 。
这 也 教 我 以后 要 小心 不 要 马虎 ， 不 要 玩 手机 得 不知不觉 就 会 发生 笨蛋 的 事情 了 。
我 一 开始 以为 他 打 电话 是 因为 想 过 来 找 我 ， 但是 他 只是 问 我 五 道口 哪里 有 卖 的 名牌 帆布鞋 。
为什么 这 个 时候 ， 最 不 想 早起 的 时候 ， 早点 起床 吗 ？
我 明白 了 ， 是 因为 要 办 签证 ， 而且 这 很 重要 ， 办 得 越 快 越 好 。
赶 好 办完 签证 ， 我 出来 办公室 的 时候 ， 从 姐姐 来 了 个 电话 说 : 在 外边 下雪 了 。
这 周 我 一直 没有 干劲 的 原因 ， 都 是 因为 这 雪害 了 我 ！
不 知 为什么 从 周三 开始 越来越 温 了 。
我 走向 前 ， 问 她 是否 发生 了 什么 事情 ， 她 显得 那么 不 开心 。
她 说 她 将 自行车 停放 地下 车场 ， 过 了 几 天 回去 取 ， 发现 自行车 已 不 在 原位 。
希望 明天 的 天气 将 会 是 艳阳 高照 ， 但愿 时间 能 抹淡
不过 ， 庆幸 我 在 北京 认识 了 一 群 非常 要 好 的 朋友 ， 使 我 在 北京 的 日子 不 会 过 得 那么 慢 。
在 上 一 学期 的 阅读 与 写作 ( 初级 ) 课 上 写 一 篇 作文 时 ， 我 发现 用 汉语 写作 自由 自在 地 表达 自己 的 感到 很 困难 。
在 这 两 年 里 ， 我 一 句 话 也 没有 说 过 、 听 过 、 写 过 汉语 。
她 也 是 韩国人 ， 现在 在 清华 大学 以 法学 为 专业 读书 。
当 我 刚 来到 中国 时 ， 他 对 我 在 中国 的 学习 方面 ， 生活 方面 等 帮助 了 很多 ， 在 他 的 帮助 下 ， 我 可以 考上 了 北京 大学 。
在 这 一 年 的 时间 里 ， 我们 只 能 在 网络 上 短 信 联系 。
我 通过 变色 的 日记本 发现 了 十多 岁 的 我 ， 孤独 、 可怜 。
没有 回忆 的 人生 ， 太 干燥 。
因为 去年 我 当完 了 兵役 之后 ， 发生 了 交通 事故 ， 我 每 天 都 得 服 三 次 的 药 。
在 上 个 学期 ， 我 身体 状态 不 稳定 ， 所以 在 寒假 的 时候 就 去 医院 对 医生 问 我 怎么 办
然后 给 我 的 父母 联系 ， 写 日记 ， 去 睡觉 。
我 刚 洗完 了 米 ， 把 米 放 在 电饭锅 。
我 把 家人 的 照片 放 在 桌子 上面 ， 每 次 看到 爸爸 妈妈 的 笑容 ， 都 感觉 到 他们 的 温暖 。
对 我 来 说 ， 上 个 学期 是 非常 吃力 的 学期 。
今天 晚上 是 对 我 来说 ， 幸福 的 晚上 。
感觉 到 这 家 是 我 的 家 。
到 了 高中 毕业 后 我 就 想 去 与 文学 有 关系 ， 所以 我 现在 在 中文 读书 。
“ 你 干 什么 呢 ？ 读书 吗 ？ ”
在 韩国 ， 因为 一 家 有 很多 儿子 ， 就 意味 着 ， 大多数 的 人 都 至少 有 一 个 兄弟 姐妹 ， 因此 没有 很多 机会 和 表姐 或 表哥 等 的 亲人 很 难 沟通 。
现在 我 的 “ 出国 ” 不 一定 只 能 告别 ， 也 有 了 任务感 和 能够 见到 校园 里 的 朋友 等 的 幸福感 也 包括 在 里 。
我 特别 希望 有 一 天 给 家人 、 朋友 、 亲人 等 笑 着 和 他们 说 “ 再见 ” 。
碧蓝色 的 天空 ， 青绿色 的 草地 ， 粉红色 的 大家 的 脸颊 都 融为 一体 ， 令 人 更为 兴奋 。
从 古老 的 书籍 中 散发 出 的 一 股 书 味儿 ， 睡醒 了 朦朦胧胧 的 头脑 ， 记得 大概 三 个 月 前 也 闻 到 过 的 味道 。
是 的 ， 日记 来 抒发 出 我 的 感情 是 一 件 多么 值得 去 做 的 事情 。
早上 一 起来 ， 第一 次 感觉 就 是 一点 担忧 。
在 上课 时 的 我 总会 感到 无奈 。
我 的 课表 上 被 很多 课目 满 了 ， 当时 的 我 心 中 充满 了 强烈 的 意志 。
这样 的 人 一般 很 难 适应 一 个 社会 ， 结局 过 自己 不 幸福 的 日子 。
虽然 早期 留学 不 是 一定 很 贵 ， 但是 基本上 非常 贵 。
“ 以 貌取人 ” 这 个 成语 的 来源 是 孔子 的 弟子 ， 一 个 叫 宰予 ， 一 个 叫 子羽 。
从 “ 以 貌取人 ” 的 意思 以及 上面 的 典故 来 看 ， 我 更 同意 以 貌取人 绝对 不 好 。
如果 我们 目光 如豆 ， 一 看到 他人 的 外表 就 立即 判断 他 的 品行 ， 这 一定 会 导致 了 不妙 的 后果 。
然而 ， 有些 人 虽然 有 天赋 却 是 因为 自己 不 勤奋 ， 而 最终 却 变成 平凡 甚至 平庸 的 人 。
可是 我 跟 朋友们 一起 吃 午饭 的 时候 ， 他们 推荐 去 观光 798 艺术区 。
所以 我 吃 完 后 就 在 网 上 有关 798 艺术区 的 资料
在 那儿 有 我 期待 的 所有 的 东西 ， 很 美丽 的 美术品 、 咖啡厅 、 好看 的 路 等等 。
六 天 前 我 来 中国 。
因为 中国 的 饮食 不 合 口味 ， 空气 不 好 ， 但是 最 高 的 问题 是 我 的 汉语 水平 不 高 。
之后 我们 进去 故宫 。
其实 这 不 是 我 第一 次 去 故宫 ， 所以 有点儿 乏味 ， 不过 我 看到 太和殿 的 时候 ， 我 再 感叹 不 已 。
从 我 来到 中国 以后 ， 已 经过 了 一 个 星期 多 了 。
这 几 天 我 上 了 几 个 课 ， 去 了 一些 地方 ， 买 了 对 一 个 人 需要 的 一些 东西 。
从 我 初 中学生 到 高中生 ， 我 只 关心 的 事 是 入 好 的 大学 ， 所以 我 为了 好 成绩 学习 。
到 毕业 我 只 有 两 个 学期 。
我 有 时候 觉得 我 找到 好 的 工作 要 挣 很多 钱 ， 但是 我 能 幸福 地 生活 。
很 久 以前 ， 我 喜欢 跟 很多 朋友 一起 祝 我 的 生日 。
所以 这 几 年 我 只 祝 跟 我 的 家人 还 有 几 个 好 朋友 一起 。
今年 的 生日 ， 我 在 北京 ， 没有 家人 和 至亲 的 朋友 ， 所以 我 打算 了 过 我 的 生日 好像 平凡 的 日子 。
这 真 是 愉快 的 一 天 。
我 想法 的 方式 改变 。
来 北京 以后 我 每 天 找 新 中国 朋友 ， 在 学校 里 ， 在 微信上 ， 还 有 在 路 上 找 新 朋友 。
我 有关 心 跟 历史 ， 所以 跟 他 交流 给 我 感觉 非常 满意
刚 到 那边 以后 我 会 看到 很多 人 卖香 的 东西 。
学 在 韩国 的 时候 ， 学 关于 孔子 的 一 生 。
今天 我 下决 了 心 买 一 台 电动车 。
同学们 吃 了 快餐 还是 街口 卖 的 包子 ， 甚至 有 人 只 吃 有点 饼干 。
听 起来 去 观看 杂技 的 人 大多数 就 是 外国人 。
那 两 个 中用 草帽 的 演员们 很 有 意思 ， 表得 还 不错 。
导游 说明 了 这 个 和 那 个 ， 我 不 是 所有 的话 都 听 得 懂 ， 可是 比 我 只 一 个 人 来 得 更 强 。
我 跟 朋友们 拍照 有 很多 。
我 学 汉语 学 很 太 不 多 ， 所以 我 的 汉语 水平 不 好
前年 来 旅游 的 时候 ， 我 只 让 人们 告诉 我 什么 地方 怎么 走 ， 所以 我 觉得 说 汉语 这么 太 难 。
而且 ， 北京人 都 太 忙 ， 如果 我 听 不 懂 的话 ， 他们 好像 生气 ， 我 也 越来越 不 自信 了 。
以前 我 在 韩国 的 时候 ， 我 想 我 可能 的 中国 的 生活 过 得 很 好 。
从 几 天 以前 就 感觉 身子 冷丝丝 ， 结局 感冒 了 。
我 从 韩国 带过 感冒药 ， 但是 像 无用处 。
在 我 去 宿舍 路 上 ， 继续 地 咳嗽 了 脖子 痛 了 。
我 没有 口味 ， 但是 勉强 地 吃 了 饭 。
可是 原来 今天 是 韩国 外大 的 学生 都 一起 去 安门 观光 的 天 。
同学们 回来 以后 ， 他们 为 我 很 担心 。
所以 下课 后 我 跟 朋友 逛逛 了 学校 看看 什么 同伙 。
我 想 以后 通过 同伙 活动 丰富 地 经验 ， 交 了 很多 中国 朋友 。
开始 了 8点 的 。
不 带 口罩 的 有些 朋友们 都 特别 后悔 。
那 是 中国人 的 教会 在 中关村 。
我 很 怕 ， 所以 快点儿 回 宿舍 了 。
但是 我 不 想 再 再 经验 黄砂 。
出去 的 时候 ， 我 还 不 知道 今天 有 沙尘暴 ， 所以 我 没 带 防沙尘 口罩 。
在 红桥 市场 ， 我们 游览 了 三十 分钟 。
在 中国 留学 的 三 年 当中 ， 我 最 使 我 幸福 的 那 件 事 ， 就 是 当 我 考上 了 北京 大学 中文 系 的 时候 。
今天 没 课 ， 但 因为 要 跟 中国 朋友 学 韩语 ， 要 到 下午 两 点 去 魏公村 ， 很 倒霉 电动车 的 电池 没有 电 。
但是 五 道口 里 是 韩国人 ， 韩国 餐厅 太 多 ， 这 让 我 感觉 还 在 韩国 。
我 认为 中国 的 人 多 车 也 多 ， 经常 堵车 ， 可能 比较 方便 骑 。
事候 是 北京 大学 毕业生 卖 猪肉 ， 清华 大学 毕业生 当 出租车 司机 等 。
大学生 就业 难 仅仅 是 观念 上 的 问题 不论是 学生 还是 城市 学生 ， 北京 、 上海 、 深圳 绝对 是 最 具 诱惑力 的 前 三 个 是 就业 地点 。
去年 的 奥运 台风 平静 下来 ， 不知不觉 地 ， 冬天 来到 我们 的 身边 。
可能 是 因为 天气 越来越 冷 ， 昼夜 温度 的 差距 很 多 ， 因此 跑 未 名 湖 的 人 也 越来越 难 找 了 。
” 我 认为 这 句 话 理所当然 ， 一 无 反驳 了 。
奥运 期间 也 是 一样 ， 每 个 网占 迅速 地 传达 新来 的 内容 ， 甚至 某 个 网 占 播放 现场 情况 ， 如果 在 比赛 当中 ， 我 国 的 选手 没 取得 胜利 ， 人们 不约而同 地 叹息 而 看 他 成 一 种 失败者 ， 这 是 人们 盲目 地 追求 胜利 和 结果 现象 造成 的 结果 。
就 这样 ， 体育 跟 生活 很 贴切 。
反而 一般 人们 不 是 为了 金牌 运动 ， 而 是 为了 美好 的 生活 、 自己 的 健康 运动 。
如果 竞争 优先于 健康 的话 ， 那 就 是 体育 运动 中 的 本质 的 。
我们 得 记住 ， 生活 体育 怀孕 奥运 冠军 的 ， 而 不 是 竞争 培养 出 的 。
有的 国家 ！ 比如 非洲 的 加 内 ， 把 参加 奥运 看成 已经 成功 了 很 有 意义 。
我们 也 得 着重于 体育 的 本质 和 体育 精神 ， 那 使 人们 把 体育 当作 生活 ， 而 不 是 竞争 的 工具 的 方法 是 什么 ？ 我们 对 体育 教育 须要 改善 。
让 学生 通过 体育 活动 锻炼 身体 ， 使 身体 健康 ， 明白 体育 的 本质 才 能 让 生活 体育 的 发展 起来 ， 开除 竞争 优先 与 美好 的 生活 和 健康 的 情况 。
“ 大学生 就业 ” 这 是 在 全 世界 各 个 国家 都 存在 的 问题 。
在 这 件 事情 里 我们 可以 看出 来 现存 的 大学生 的 就业 问题 。
但是 ， 离 现在 已 相当 发展 的 社会 来 说 ， 不 需要 这么 多 的 人才 。
而且 在 读书 四 年 中 没 学会 实务 技术 的 人才 更 不用 说 。
因 数 次 来到 的 经济 危机 让 大学生 追求 安定 的 职业 ， 虽然 这样 的 职业 不管 自己 专业 和 爱好 ， 但 也 想 求 这 类 的 职业 。
人们 准确 不 知道 春节 什么 时候 开始 。
秋夕 是 农历 8月 半 个 月 、 8月 15日 ， 称为 秋天 的 中心 的 月 ， 还 有 8月 中心 的 意思 ， 秋夕 是 韩国 最 大 的 最 好 的 节日 之一 。
圆圈 舞 、 拔河 比赛 、 韩式 摔跤 是 韩国 最 代表 的 秋夕 的 游戏 之一 。
三月 三 初 的 起源 没有 仔细 的 资料 ， 跟 据 韩国 有名 的 作家 、 诗人 崔南善 ， 记念 三月 初三 的 风俗 从 新罗 时代 已经 有 了 ， 传到 了 朝鲜 时代 。
人们 经常 说 在 这 个 三月 三日 ， 去年 ( 农历 ) 九月 九日 去 江南 的 燕子 回来 了 。
本 餐馆 为 顾客 的 要求 ， 诚 招 厨师 1 名 。
本 公司 为 适应 对 法国 菜 增加 的 需要 ， 需 招聘 一 位 做 法国 菜 的 厨师 。
特别 在 法国 的 饭店 工作 过 的 人 很 优先 。
怀有 孝顺 之 心 ， 关键 付诸 实施 。
怀有 孝顺 之 心 是 义不容辞 的 责任人 。
女 大学生们 选择 去 当 “ 职业 军人 ” 有 两 大 原因 ， 一 为 失败 的 求职 之后 选择 去 当兵 ， 二 为 再次 挑战 职业 战场 ， 把 “ 军人 ” 成为 自己 的 核心 的 特征 ， 与众不同 的 经历 来 争取 职业 。
可 不 单 要 看 问题 的 正面 ， 还 要 看 问题 的 反面 ， 这 便 是 大学生 的 就业 问题 。
这些 问题 为何 发生 呢 ？ 有 哪些 方案 呢 ？ 。
二 是 从事 过 法国 菜 。
现在 每 逢 端午节 ， 各 个 地方 都 开展 有关 节日 的 活动 。
譬如 : “ 江陵 端午节 ” 很 有名 ， 在 2005年 时 ， 联合国 教科文 组织 把 “ 江陵 端午节 ” 指定 了 非 物质 文化 遗产 ， ( 人类 口传 与 无形 绝 作 ) 。
在 《 魏志 》 的 韩传 里 说明 : “ 播种 后 ， 马韩人 拜祭 天地 和 歌舞 饮酒 。
之后 在 高丽 时代 ， 高丽 歌谣 《 動動 》 里 记载 ; 人们 为了 捍 # 御 # 厄运 ， 用 菖蒲 水 洗头 、 把 菖蒲 的 根 带 着 、 吃 车 输饼 、 草药糕 、 艾蒿糕 。
“ 宋 干 ” 在 泰语意 为 “ 移走 ” 或是 “ 换 地方 ” 表示 去年 过去 新年 来临 。
一般 家里 的 活动 是 子女 将 带有 香味 的 水 泼洒 到 年龄 最 大 的 人 的 手或者脚 ， 表示 尊敬 和 感恩 ; 对于 社区 而 言 ， 宋干节 可以 促进 社区 的 团结 ， 大家 可以 参加 娱乐 活动 ， 互相 交流 ， 比如 : 泼水 、 摸粉 、 造沙坛 等 ; 对于 社会 而 言 ， 宋干节 可以 加强 民众 对 环境 的 关注 ， 一般 的 活动 是 对 一些 房屋 、 寺庙 、 公共 地区 和 管方筑筑 进行 清洁 ; 对于 佛教 而 言 ， 宋干节 也 是 大 有 意义 的 ， 因为 民众们 会 对 僧侣们 进行 活动 ， 比如 : 听 僧侣们 说 经 布道 、 一 走 念经 拜佛 等 各种各样 的 佛事 。
三 一 节 是 为了 继承 三 一 运动 的 独立 精神 ， 巩固 民族 团结 ， 以及 培养 国民 的 爱国心 而 设定 的 纪念日 。
当时 无论 孩子 或 老人 ， 基督教 或 佛教 ， 工人 或 商人 ， 都 会 参与 这 个 运动 宣告 韩国 的 独立 。
据 以前 的 纪录 ， 进行 这 个 运动 的 次数 超过 2000 次 ， 参与者 大约 是 200万 人 。
韩国 的 历史 上 ， 独立 运动 的 规模 最 大 。
对 我 来说 ， 二零零二年 就 是 印像 非常 深刻 的 一 年 ， 这 就 是 韩国 足球队 在 韩国 世界杯 上 进入 了 四 强 。
上 小学 的 时候 ， 在 一 个 雨天 ， 放学 后跟 朋友们 踢 了 一 场 球 。
十 年 前 在 世界 上 踢球 最 好 的 选手 是 巴西 的 Ronaldo ， 现 在 世界 上 踢 最 好 的 选手 之一 的 就 是 葡萄牙 的 C.Ronaldo 。
因此 ， 我 开始 踢 、 炼 足球 。
有 一 次 ， 她 的 母亲 通过 电视 的 一 个 节目 来 说 ， 为了 把 她 养成 一 名 滑冰 选手 花 了 不少 的 钱 ， 要 是 日常 的 环境 比 她 好 一点 ， 可以 较 容易 地 出现 第二 ， 第三 的 金妍儿 。
大学 毕业生 人数 不断 增加 ， 有 了 毕业生 向 城市 流动 的 趋势 ， 毕业生 的 期望值 会 不断 增高 ， 企业 对 人才 的 标准 也 在 变化 。
有 这么 一 件 事 让 全 中国人 目瞪口呆 ， 一 位 毕业于 北京 大学 的 男生 在 市场 里 买 猪肉 。
这 件 事 已 是 几 年 前 ， 几 年 间 出现 了 太 多 类似 这 场景 的 事 ， 名牌 大学 毕业生 从事 劳动 工作 。
那么 ， 我们 应 怎么 解决 这 个 问题 呢 ？ 。
大学生 就业 问题 ， 只有 全 社会 共同 努力 才 能 解决 。
就业 关系 到 人 的 一生 ， 我们 这些 大学生 ， 应 尽早 了解 就业 状况 ， 对 大学 生活 的 规划 树立 一 个 前进 的 目标 ， 使 大学生 涯 更 有 意义 ， 更 有 帮助 。
许多 公司 财政 赤字 ， 不得不 作出 裁员 的 决定 。
据 报道 ， 连 北大 毕业生 都 没有 找到 好 的 工作 。
有 一 个 人 叫 “ 陆步轩 ” 在 陕西 长安区 文科 状元 成绩 考入 了 北京 大学 中文 系 ， 毕业 后 分配 至 长安区 柴油机厂 工作 ， 后 下海 经商 ， 做 过 多 种 职业 ， 最后 以 “ 眼镜 肉店 ” 老板 身份 闻名 。
” 北京 大学 毕业生 陈生 ， 说完 了 这 第一 句 话 ， 几乎 哽咽 。
对 大多数 人 来 说 ， 网站 和 招聘会 才 是 最 主要 的 就业 渠道 ， 也 不 能 满足 毕业生 的 需求 。
第二 个 原因 是 学生 的 期望 很 高 ， 很多 大学 毕业生 希望 找 一 个 高薪 的 工作 ， 他 毕竟 是 大学 毕业 的 ， 找 低 薪 工作 有点 丢脸 。
韩国人 喜欢 的 运动 ， 是 奥运会 绝 定 。
现在 呢 ？ 父母 把 孩子 掉 在 水 里 ， 休会 游泳 。
但是 汉字 还是 无法 充分 地 表现 韩语 的 发音 和 朝鲜 民众 的 思想 感情 ， 普通 朝鲜 平民 根本 不 识 汉字 ， 世宗 非常 同情 国民 的 处境 ， 作为 一 个 想要 发展 民族 文化 ， 推进 国家 独立 的 朝鲜 君王 ， 世宗 大王 开始 苦思 冥想 ， 后来 ， 梦想 创造 出 一 种 独特 而 易学 易懂 的 朝鲜 本土 文字 ， 让 普通 的 朝鲜 庶民 也 可以 轻松 驾驭 朝鲜 的 语言 。
在 朝鲜 谚文日 的 时候 在 韩国 会 做 一些 活动 ， 比如 做 一些 纪念 世宗 大王 的 活动 。
每 年 的 公历 10月 3日 是 韩国 的 “ 开天节 ” 是 纪念 韩国 传说 中 的 民族 始祖檀君 ， 在 公元 前 2333年 建立 了 古 朝鲜 的 节日 。
“ 开天节 ” 在 农历 十月 初三 ， 但 1949年 改成 了 阳历 10月 3日 。
现在 开 天 节 慢慢 在 人们 的 记忆 中 消失 ， 人们 不 重视 开天节 ， 但 开天节 对 韩国 历史 来 说 有 必 有 的 节日 。
我 希望 人们 更 重视 开天节 ， 爱国 ， 一起 赏 收 各 种 活动 。
光复节 纪念 节目 就 是 在 1970年 开始 总统 来 参加 的 。
可是 在 1974年 的 光复节 纪念 节目 ， 因为 令 夫人 被 暗杀 了 ， 所以 有 了 迂回 曲折 。
如果 光复节 是 纪念 民族 的 解放 和 独立 时间性礼式 的话 ， 对 这 个 相应 的 表达 空间 的 纪念 机器 是 独立 纪念馆 。
独立 纪念馆 是 1987年 8月 15日 开馆 的 。
跟 这 个 相反 ， 像 日本 的 痕迹 的 ， 朝鲜 总督府 建筑 在 1995年 8月 15日 被 拆除 了 。
在 光复节 ， 我们 韩国人 把 太极 旗 在 阳台 ， 表示 祝贺 我们 国家 的 独立 和 解放 ， 还 也 包括 一点点 的 对 光复 前 活 着 的 我们 祖先 的 尊敬 。
当时 无论 孩子 或 老人 ， 基督教 或 佛教 ， 工人 或 商人 ， 都 会 参与 这 个 运动 宣告 韩国 的 独立 。
据 以前 的 纪录 ， 进行 这 个 运动 的 次数 超过 2000 次 ， 参与者 大约 是 200万 人 。
韩国 的 历史 上 ， 独立 运动 的 规模 最 大 。
因些 ， 民间 企业 的 运动 越来越 扩展 ， 也 成 了 韩国 经济 发展 的 主动力 。
现在 每 年 各 地 还 有 两千 个 人 参加 的 “ 赛 龙舟 ” 活动 ， 还 挂蒿草艾叶 荷包 等 活动 。
简短 地 说 ， 光复节 是 为了 纪念 韩 民族 获得 了 解放 韩国 独立 的 政府 建立 。
仅 供 参考 朝鲜 ， 称呼 为 祖国 光复节 ， 亦 是 朝鲜 的 公立 假日 。
当天 有 诸多 纪念 活动 : 在 首 尔 举行 中央 庆祝式 : 其他 还 举行 各 个 市道 段位 别 活动 。
韩国 大 总统 从 1970年 参加 光复节 纪念 活动 ， 说 闲话 ， 1974年 在 活动 场 发生 了 第一 夫人 的 遇刺 事 ， 有 了 这样 的 曲折 。
四 、 待 有 法国 菜 证人 能 优先 考虑 。
对 此 ， 来 分析 出现 大学生 就业 问题 的 原因 。
另外 ， 大学 毕业生 对 本身 较 高 的 学历 持有 自负 心理 ， 在 找 工作 时 ， 不 从 基层 做起 ， 做事 利己主义 ， 缺乏 忍耐 。
对 大学生 建议 不 能 自视 过 高 ， 加强 自己 的 能力 ， 卖 猪肉 的 北大 才子 又 成 了 百万富翁 ， 又 引起 了 广大 人们 的 争议 。
毕竟 ， 职业 不 分 贵贱 ， 最 主要 的 就 是 靠 个人 对 自己 的 价值 判断 。
大学生 就业 的 问题 主要 在于 供 与 需求 的 不 均衡 中 。
最近 经常 播 一些 一流 大学 的 毕业生 应聘 到 不 入流 的 工作 的 新闻 ， 如 某 一 清华 大学 毕业生 成 了 月 收入 2000 的 保安 ， 甚至 也 有 卖 猪肉 卖 鸭 脖子 的 ， 即 我们 接触 到 这 种 新闻 的 第一 反应 便 是 “ 他们 到底 怎么 想 的 ？ ” “ 有 没 有 脑子 ? ” 。
《 非诚勿扰 》 的 主持人 孟菲 曾 说 过 偏见 是 人 的 无知 与 愚昧 。
大学 毕业 后 ， 就业 问题 有 下 几 种 。 政府 方面 ， 高校 方面 ， 用人 单位 方面 ， 还有 大学生 的 自身 因素 ， 如 观念 因素 等 。
本 餐馆 最好 是 擅长 法国 菜 的 。 招聘 1 名 厨师 。
新 罗 琉璃 王 常常 让 两 个 公主 参加 织布 比赛 ， 那 个 比赛 是 从 7月 开始 到 8月 半 个 月 举办 的 ， 琉璃 王 平价 她们 织布 实力 ， 然后 输 的 人 把酒 和 菜该 给 赢 的 人 ， 她们 在 一起 玩 、 喝酒 、 唱歌 跳舞 等 ， 那时候 开始 发展 到 今天 秋夕 的 游戏 文化 。
这些 问题 ， 大学 毕业生 首先 了解 自我 。
最近 韩国 学校 的 操场 都 是 一 片 绿地 。 可是 不 像 巴西 、 葡萄牙 免费 开放 了 。
大学 毕业生 在 这 个 时代 应该 背水一战 。
但 ， 1991年 ， 由于 来自 韩国 财阀 增加 工作 天数 的 压力 ， 此 法定 假期 被 取消 ， 但是 后来 人们 主张 谚文日 的 时候 应该 休息 。 所以 2006年 时 这 天 又 为 法定 假期 。
但 最近 有 很多 人 把 开 天 节 看作 一 种 宗教 活动 ， 而 不 是 民族 的 活动 ， 所以 他们 提倡 把 开天节 排队 休日 。
在 被 解放 的 那 天 ， 以前 被 日本 军队 抓着 的 韩国人 也 能 回到 自己 的 国家 ， 韩国 。
在 1946年 8月 15日 ， 祝贺 光复节 一 周年 。 那天 开始 。 光复节 慢慢 也 变成 了 全 民族 的 节日 。
从 1948年 以后 的 光复节 ， 人们 把 解放 的 意义 和 政府 建立 的 意义 放 在一起 祝贺 。
但是 在 东亚 没 清算 了 日本 帝国主义 的 支配 与 侵略 战 急 的 遗产 ， 而 是 韩国 光复 快要 到 了 70 周年 ， 韩国 还是 在 分段 国家 。
这 次 事 不 让 光复节 留持 是 个 只 为了 纪念 过去 的 历史 的 事件 。 所以 最近 的 光复节 的 意义 越来越 变成 个 为了 韩 半岛 的 统一 、 纪念 东亚 的 平和 。
秋夕 是 五谷 、 水果 成熟 的 时期 ， 农夫 把 农业 已经 收 不 成 完 了 ， 人们 都 还 新 衣服 ， 捏豆陷 糯米 面 饺子 ， 做 大 米饭 ， 去 祖先 的 坟墓 ， 扫墓 ， 进行 祭祀 。
能 擅长 法国 菜 的 优先 ， 男女 不 限 。
据 报道 韩国 女 大学生 当兵 的 数目 比 去年 增加 了 2 倍 ， 并 为了 参加 “ 将 校 考试 ” 去 学院 的 人数 比 去年 大概 增加 了 4 倍 。
这 种 现象 在 韩国 已经 是 一 种 普遍 现象 了 ， 当兵 不仅 是 单纯 的 服 兵役 的 地方 ， 是 给 大学生们 一 处 栖地 、 在 服 兵役 的 过程 中 ， 既 可以 以后 在 社会 上 的 就业 做好 准备 ， 又 可以 给 企业 面试 的 时候 能 留 一 个 好 印象 。
尽管 政府 施实 的 政策 是 解决 大学 毕业生 求职 问题 起 重要 的 作用 ， 但 大学生 正确 地 认识 到 自己 ， 而且 了解 很 快 变动 的 社会 ， 是 更 重要 的 。
其 是 泰国 是 传统 新年 ， 也 相当于 中国 的 春节 。
国民 为了 追悼 他们 ， 每 个 家人 的 窗 上 ， 挂 了 国旗 。
雨天 踢 完 球 ， 我 的 衣服 正如 进 一 次 黄河 的 感觉 。
这样 的 环境 造成 了 伟大 的 两 Ronaldo 的 诞生 。
看 滑冰 为 例 ， 韩国 有 一 名 大 滑冰 。
对于 学校 来讲 ， 学校 应该 发展人 的 综合性 能力 ， 开始 正确 地 就业 指导 ， 使 学生 成为 综合性 人才 。
可是 乒乓球 的 热气 不 到 十 年 就 要 冷 了 。
按 传说 ， 4345 年 前 的 10月 3日 有 一 位 天帝 ， 叫 桓因 ， 他 为了 实现 弘益 人类派 自己 的 儿子 桓雄 ， 桓雄 从 天 上 来到 地上 ， 建立 神市 ， 而 他 的 儿子 檀君 建立 古 朝鲜 ， 从此 开始 民族 社会 了 。
前 ， 这 个 节日 叫 “ 建国 纪念日 ” ， 后来 韩国 解放 后 改名 为 “ 开天节 ” 这里 的 “ 开 天 ” 表示 最初 的 人 问 社会神市 的 建立 ， 第一 个 国家 古 朝鲜 建立 。
在 这 个 活动 里 放 郑寅普 作词 与 尹龙河 作曲 的 《 光复节 的 歌 》 。
从 三 一 运动 之前 ， 进行 的 用 国 产品 运动 、 物产 奖励 运动 等 ， 这些 运动 三 一 运动 以后 也 在 继续 进行 的 同时 ， 也 扩展 设立 民间 企业 的 运动 。
当天 为了 高昂 光复节 的 意义 ; 全 国 的 所有 的 家庭 都 在 升 国旗 庆祝 。
其外 政府 当天 晚上 招聘 各 级 各 层 的 人士 与 外交 使节 举行 庆祝 宴会 。
这时 ， 我们 应该 先 思考 追求 问题 的 解决 方案 。
这样 以来 分析 来 分析 去 ， 还是 按照 原著 的 脚步 走 下去 了 。
作为 一 个 良 军 ， 作为 好心肠 的 人 ， 关羽 做出 了 他 必定 做出 的 选择 。 值得 后人 敬仰 。
曹操 是 《 三 国 演义 》 的 负面 主人公 ， 残忍 的 暴军 ， 只顾 自身 的 目的 ， 不 顾 军队 和 老百姓 付出 的 血迹 。
不管 曹操 要 付出 的 多少 人民 的 生命 和 灵魂 、 耗费 多少 时空 和 跨越 多少 距离 ， 他 一定 要 达到 最终 的 胜利 。
对于 敌人 要 用以 敌人 的 方式 对待 。
因此 我 通过 描述 当时 关云 可能 有 的 心 里 活动 而 表示 他 释放 曹操 的 原因 。
他们 好像 已经 打 过 100 个 战役 。
若 诸葛亮 估计 的 对 而 曹操 带 着 军队 的 幸存者 到 华容 ， 那么 争斗 就 会 在 此 地 结束 。
曹操 这么 一 说 关云 开始 怀疑 在 战斗 之前 这么 表示 尊敬 是否 合理 的 。
在 三 班 学习 过程 他 学到 了 很多 知识 ， 每 次 考试 中得 了 九十分 以上 的 成绩 ， 第二 个 学期 他 升 了 一 个 班 。
他们 两 在 一 个 班学 中文 。
那时候 ， 认认 真真 听课 的 小雪 姐姐 听完 这 句 话 ， 很 伤心 。
她 很 努力 ， 不过 她 学 汉语 还 不 到 三 年 ， 还是 很 难 跟上 以 汉语 为 母语者 的 速度 。
可是 中国 所有 的 大学 都 是 在 八月 底 开始 开学 。
所以 经理 让 有 贵知 责任 那些 客人 。
在 客人 等 的 期间 ， 有 一 位 客人 大声 地 喊 : “ 舍 时候 才 可以 吃饭 。 ”
从 小 我 便 对 中国 文化 很 感 兴趣 。
我 很 喜欢 看 一 部 中国 电影 ， 那 部 电影 是 《 三 国 演义 》 电影 里 的 关公 。
学习 汉语 有 机会 了解 到 了 关于 中国 武术 知识 。
说 实话 在 高中 的 时候 我 最 喜 受 的 门课 是 武术 课 。
武术 给 了 我 自信 和 建康 的 身体 。
出入 意料 的 是 我 得 了 第一 等 奖 。 那时 我 喝 了 密 一样 甜 。
最后 我 想 从 我 小 的 时候 到 高中 的 时候 是 我 很 幸福 的 时光 。
回去 时 ， 因为 喝醉而而错路 。
玉 帝 知道 了 猴王 做 的 事情 ， 就 命令 兵追 他 。
其中 我 最为 烦感 的 工作 ， 只是 擦 店 内 的 玻璃 。
我 本身 就 是 个 留学 于 外地 的 女儿 ， 好不容易 回国 一 荡 也 见 不 到 彼此 ， 感觉 我们 在 天涯 之际 。
但 我 每 次 都 坚定 地 说 ， 中国 留学 是 我 一生无悔 的 选择 ！
如果 有 人 还 问 我 : “ 你 最 难忘 的 时期 是 那 一 段 ？ ”
那么 我 毫不 犹豫 地 回答 : “ 是 2012年 。 ”
高中 三 年 的 努力 ， 我 终于 考取 了 韩国 的 一 所 大学 。
我 报 汉语 院 了 。
汉语 那样 富有 魅力 ， 而 当时 兴起 的 “ 汉语 热 ” 引起 了 对 中国 的 好奇心 。
虽然 中国 迅速 发达 ， 可 人们 对 中国 了解 只 会 停 在 电视 、 媒体 报道 。
很 遗憾 的 是 ， 关于 “ 中国 ” 的 报到 韩国 电视 、 报纸 媒体 报道 的 更 多 关注 的 是 负面 内容 。
父母 的 支持 下来 北京 开始 留学 。
现在 ， 欣赏 北大 最 美 风景 《 一塌糊涂 》 ( 未名湖 、 博雅塔 、 藏书 几百万 册 的 图书馆 ) 是 我 最 幸福 的 时刻 。
果然 中国 留学 个 不错 的 选择 。
我 一 句 话 也 没 发 牢骚 ， 就 让们 他 。
从 那时 开始 的 行动 慢慢 变 奇怪 ， 事情 闹大 了 ， 直 到 现在 都 不 能 恢复 。
打架 的 时候 。 我 不 控制 自己 ， 把 我 的 手机 向 他 扔 了 。
可能 这 是 我们 俩 兄妹 的 误会 的 。
还 有 兄妹 关系 将 破坏 了 ， 受伤 。
我 在 书 上 看 了 一 句 ， 如果 一 辈子 只 爱 别人 过 时间 ， 这 时间 也 很 短 。
没 获 奖杯 的 两 个 表哥们 心情 一直 不 好 ， 对 我 和 表弟 都 闹 着 脾气 。
在 弟弟 手 里 的 奖杯 ， 但 从 他 的 手 掉 下来 了 。
我 还 记得 这天 事情 。
我 以为 护照 住 在 我 的 口袋 里 ， 但 我 以后 发现 了 护照 不 在 我 的 口袋 里 。
第二 天 ， 去 办公室 对 老师 告知 我 要 丢 护照 。
再 办 新 护照 的 事情 是 很 麻烦 的 事情 呢 。
每 个 地方 的 事情 办完 后 ， 我 都 精皮力尽 。
等到 四 个 月 后 我 终于 把 新 护照 在 我 的 手 里 。
以后 做 某 个 事情 的 时候 要 更 仔细 地 做 。
那时 我 刚 来 中国 一 年 ， 当时 我 学 了 点 汉语 ， 查 不 多 可以 跟 中国人 打交道 。
每 次 做 事情 的 时 我 都 不 会 忘记 “ 每 天 事情 ， 一定 要 很 认真 地 对待 。 千万 不 要 骄傲 。 ”
因为 我 年龄 ( 17 岁 ) 最少 ， 自然而然 地 受到 了 他们 的 影响 。
每 天 都 是 娱乐 ， 对 17 、 18 岁 大学生 来 说 ， 都 是 美好 的 生活 。
我 对 他们 觉得 很 遗憾 ， 但是 给 自己 一 种 新 信心 : 我 自己 的 生活 阶段 并 不 是 太 完 了 。
现在 想 ， 处于 青春期 的 我们 之间 发生 的 冲突 是 个 理所当然 的 。
结果 自己 试 着 去 做 ， 烧 了 饭锅 ， 被 骂完 了 顿 。
听到 熟悉 的 声 间 ， 我 立刻 回头 看看 。
我 想 我 的 家人 ， 特别是 从来 没 来 过 北京 的 我 的 父亲 和 姐姐 ， 亲自 体会 很多 东西 。
尽管 家人 都 回国 了 ， 不 跟 我 在 一起 了 ， 但 我 心 里 永存 着 他们 的 关心 、 支持 、 很 爱 。
他 一点儿 没有 什么 犯 错误 就 站 着 ， 他 被 骂 的 原因 只 是 他 是 个 亚洲人 。
这 是 他 第一 次 经过 的 种族 歧视 ， 非常 难受性 。
但是 现实 是 不 一样 的 ， 现在 世界 还 存在 着 种族 歧视 。
谁 知道 他 能 通过 了 美国 军队 考试 呢 ？
圣泽 和 朋友们 觉得 不 能 忍受 ， 计划 暗暗 地 出去 。
他 在 准备 高考 的 时候 ， 跟 朋友们 一起 住 了 。 在 望京借 一 个 房间 。
虽然 很 危险 ， 但是 不 自由 的 欲望 比 受伤 的 危险 大 。
之后 他 和 他 的 朋友 以及 父母 都 找 老师 包歉 了 。
这样 的 进脱 也 是 一 种 缓节 压力 中方法 。
为了 考上 北大 努力 学习 ， 真 艰苦 的 时间 ， 但 我 克服 了 这 时间 ， 结果 获得 了 灿烂 的 结果 。
这 次 她们 选择 的 饭厅 是 在 北大 里 因 价格 便宜 而 出名 的 “ 学 五 食堂厅 。
当 同学们 不 知 要 吃 什么 ， 犹 予 不 决 的 时候 ， 她 先点 了 “ 土豆 烧肉 ” ， 随后 同学们 也 开始 点 那个 饭菜 。
由于 时间 不 够 ， 她们 四 个 人 不 出生 声 ， 只 会 看 着 饭碗 吃饭 。
她 没 看到 这么 帅 的 。 比 一般 的 演员 或者 名星 长 得 帅 ， 她 的 心脏 开始 跳动 。
听 司机 的 回答 之后 ， 她 出现 这 一 个 词 “ 失望 ”
当时 她 第一 次 吃 过 麻辣 香祸 ， 所以 觉得 味道 很 奇怪 。
她 虽然 当时 不 习惯 做 麻辣 香祸 ， 但是 随着 带 中国 的 时间 长 ， 她 慢慢 习惯 了 中国 菜 ， 后来 她 最 喜欢 的 菜 变成 了 麻辣 香祸 。
到 了 北京 以后 ， 首先 他 去 长成 了 。
第一 次 爬过 的 长成 对 他 来 说 是 很 累 。
但 他 看 了 长成 的 坚固 的 形象 ， 看到 漂亮 的 风景 。
这 是 她 第一 次 去 外国 ， 第一 次 坐 飞机 ， 第一 次 离开 父母 的 胸怀 。
3月 3日 ， 零点 ， 她 和 她 哥哥 的 朋友 燃点 了 蛋糕 上 的 蜡烛 。
对 那 对 兄妹 人 都 来 说 ， 今天 应该 是 最 幸福 的 日子 。
那时 ， 外面 雪 下 得 很 大 ， 全 地 都 满 着 白白 的 雪 。
第一 学期 快要 结束 了 。 我们 就 到 这儿 ， 外面 去 玩 吧 ！
后来 ， 学生们 在 冰 的 未名湖 上 开始 做 雪仗 。
男 同学们 开始 做 女 同学们 。
对 她 来 说 ， 那 件 事 是 在 预科班 学习 的 过程 中 ， 有 一 件 难忘 的 事情 。
四 个 人 在 同 棹 吃 一 顿 饭 很 难得 。
他 说 : 这么 难得 的 晚会 ， 如果 没有 酒 是 ， 真 有感 。
他们 吃饱 酒 足 了 ， 他们 兴高采烈 地 回家 了 。
当时 ， 她 的 学校 组织 了 去 昆明 留学相目 。
因为 在 自己 的 国家 ， 的确 是 缷 乏 语言 环境 ， 使 她 做出 了 这样 的 决定 。
但是 通过 漫长 的 时间 ， 校 内 活动 ， 她们 俩 的 关系 竞然 变得 越来越 好 ， 日益 亲密 ， 而 不知不觉 中 变成 了 好 朋友 。
久而久之 ， 他们 俩 的 关系 就 从 晋通 的 好 朋友 脱离 出来 ， 最后 改变 了 她 的 知 已 。
知 已 是 要 一起 同 过 各种各样 的 事情 ， 有福同享 ， 有 难 同 当 ; 才 能 从 晋通 的 朋友 脱离 出来 。
回家 的 路 上 ， 她 跟 家人 一直 在 互 想 谈话 。
心 里 舍 不 得 ， 但 没 办去 延长 他们 的 时间 了 。
于是 虽然 为 此 一 天 准备 了 很 久 ， 可 她 才 还是 在 “ 扑腾 、 扑腾 ” 的 很 块 挑 。
3点 到 了 会场 的 寿司 道场 ， 一百 条 左右 的 椅子 跃入 在 她 眼帘 。
她 无意 中 涩涩 发抖 ， 它 轻轻 地 抹 了 她 的 娇弱 的 肩膀 。
如果 今天 来 的 新生潮 笑 你 的 主持 ， 除了 我 外 都 讥笑 你 也 ， 我 支持 你 ， 零和 一 是 不 一样 的 。
六点 ， 最终 开始 了 晚会 。
吃完饭 的 时候 ， 他们 约好 下 周 又 一起 去 滑雪场 。
她们 约定 了 华清嘉园 的 北门 7点半 见面 。
她们 赶忙 出发 学校 。
其实 我 很 孤独 ， 但 我 没有 办法 考上 本科 我 应 刻 这样 努力 学习 。
我 很 着急 睁大 眼睛 寻找 我 的 名字 ， 终于 在 角落 发现 了 我 的 名字 ， 我 的 心 很 激动 。
最近 他 经过 很 痛苦 的 事情 ， 他 和 他 的 女 朋友 分手 了 。
他 和 他 的 女 朋友 几 年 前 在 中国 第一 次 见面 ， 之后 他们 见 了 几 次 ， 日益 曾 加 了 亲密感 。
恋爱 初 他们 每 天 辛福 ， 一起 吃 、 一 起 学 、 一起 玩 等 所有 的 时间 在一起 。
过 了 一 年 ， 他们 还 有 好 关系 。
发生 了 什么 事情 ， 他 的 解决 方法 和 她 的 解决 方法 有点 差 ， 就 不 一样 的 角度 ， 渐渐 他们 吵架 ， 频率 越来越 多 。
原来 她 的 母新 是 中国人 ， 所以 从小 她 在 家里 跟 妈妈 用 汉语 说话 。
她 要 在 这儿 学 五 个 月 ， 跟 她 来 还 有 16 个 同学 。
所以 他 常常 想 一 想 ， 放假 的 时候 肯定 会 外国 旅行 。
他 准备 照相机 。 为了 把 美 亮 的 风景 回忆 。
下 天 ， 他 交 了 个 土耳其 朋友 ， 所以 他 和 他 的 朋友 被 招待 土耳其 朋友 的 家 。
每 天 练习 结束 了 很 晚 夜 。
但是 她 经常 先辈 来 了 练习室 ， 给 他们 好吃 的 小吃 。
他 毕业 高中 后 ， 因为 高考 来到 北京 。
二零十二 年 他 合格 了 北京 大学 和 中文 系 。
不过 金 年 他 来 了 中国 。
李 老师 的 印象 很 深 。
于是 我 为了 继续 受 他 讲课 ， 每 周 两 次 到 遥远 的 望京 进行 辅导 。
但 老师 没有 收到 我 的 短信 ， 甚至 为 我 亲自 准备 了 好多 重 菜 和 炒饭 了 ！
那 按时 吃药 ， 睡 完好 个 觉 ！
他 这样 关心 学生 的 面貌 让 我 深深 地 感动 了 。
天 越来越 暖和 ， 我 对 李 老师 的 想 思 变 越来越 浓厚 。
“ 这 个 人 有 美丽 的 长相 写成 泰语 ， 语序会 变成 “ 人们 个 这 有 长相 美丽 ” 。
世界 上 的 语言 很多 。 其中 最 被 广泛 使用 的 英语 就 有 地区 的 差异 。
这 个 和 汉语 完全 相反 的 。
羊 驼 一般 栖息 于 海拔 四千 米 以上 的 高原 ， 以 高山 棘刺 植物 为 食 ， 喜好 群居 ， 性情 温驯 得 ， 适合 圈 羊 。
并 不 依 山 旁 水 的 秘鲁 土著 居民 也 懂得 利用 这 种 高原 独有 的 物质 来 适应 高寒 的 气 。
由于 其 敦厚 的 长相 和 可爱 的 体态 ， 羊驼 受到 世界 各 地 的 人 的 喜爱 ， 同时 也 被 更 多 的 人 所 知晓 ， 许多 国家 纷纷 引进 着 饲 羊 。
利马 位于 秘鲁 西部 海岸 沙漠 带 的 中部 ， 腹射 了 全 国 。
利马 因 马里克河得明 。
这时斯所 建 的 大量 的 雄伟 壮丽 的 欧式 建筑 、 城堡 成 了 利马 的 一 大 亮点 。
像 《 泰囧 》 等 电影 大家 都 会 觉得 去 泰国 肯定 挺 好玩 。
我 整 年 不 必 穿 羽绒服 ， 直 穿 T恤 短裤 ， 十分 舒服 。
本 府 华桥 人 多 路 ， 假如 你 来自 广东 潮州 ， 在 本 府 生活 就 不 会 有 多 大 困难 。
朝鲜语 与 韩 国语 的 区别 只 在 与 口音 和 几百 个 单词 。 口音 不同 的 原因 在 与 每 个 地方 的 方言 : 单词 不同 的 原因 在 与 韩国语 存在 着 很多 外来语 。
泰语 是 富有 民族 文化 包含 内 的 语言 。
最 难为 的 就 是 语法 的 问题 。
尤其 有 深 高 层次 的 语法 。
下面 绍介 一下 。
日语 有 几 类 特点 ， 其中 我 绍介 外来语 、 敬语 、 语法 的 问题 。
不 这样 的话 ， 就 成立 不 了 ， 而且 是 不 明白 的 句子 。
日语 虽然 很 复杂 ， 但 对 日本人 来说 是 很 重要 的 语言 。
羊 驼 是 美洲 驼 属 动物 ， 已经 存在 约 有 六千余 年 ， 秘鲁 是 其 源地 之一 。
羊驼毛 的 颜由 浅 至 深 分为 白色 、 浅褐色 、 灰色 、 浅棕 、 棕色 、 深棕 、 黑色 及 杂色 等 22 种 。
随 科技 的 发展 ， 毛毯 、 座垫 、 抱 枕 等 羊驼 制成 的 生活 用品 及 各 种 羊 驼毛 工艺品 应运而生 ， 日益 丰富 。
随 经济 全球化 的 趋势 和 旅游业 兴起 ， 服务业 也 成 了 秘鲁 的 一 大 产业 。
利马 是 个 非常 值得 一 观 的 游览 。
若 你 真 来 ， 我 保让 你 肯定 会 吃香 辣 ， 大手大脚 。
在 讨论 外语 和 母语 之间 的 影响 之前 ， 我们 先 了解 母语 和 外语 的 定义 。
母语 ， 在 一 个 人 出生 之后 ， 最早 接触 、 学习 并 掌握 的 语言 。
有 人 认为 ， 过分 注重 英语 的 学习 导致 学生 忽略 了 母语 ， 即 汉语 的 学 甚至 带来 负面 影响 。
最近 ， 北京 推出 了 新 的 高考 政策 : 语文 从 150 分 提高 到 180 分 ， 而 英语 却 从 150 分 降低 到 100 分 。
有 人 说到 : 无论是 在 中国 还 是 外国 发展 ， 了解 的 文化 才 是 最 重要 的 ， 外语 不过 是 一 种 增强 交流 的 工具 。
想要 真正 地 去 理解 一 种 文化 ， 那么 就 必须 从 它 的 语言 开始 。
这 不免 使 家长 甚至 有 一些 人士 担心 ， 考生们 偏重于 学习 英语 是否 会 影响 汉语 的 学习 。
如果 取消 了 英语 考试 甚至 是 于 英语课 ， 孩子们 的 汉语 一定 会 学好 吗 ？
他们 对于 外语 抱持 是 欢迎 的 态度 。
由于 地理 位置 而 言 ， 韩国 的 首都 位于 首 尔 。
这 个 数字 等于 泰国 所有 人口 的 数字 。
泰语 的 词型 没有 时态 与 数 的 变化 。
基本 语序 与 汉语 一样 。
另 一 个 最 重要 的 语法 就 是 连 词 、 连 词 的 作用 就 是 标志 着 一 个 句子 的 话题 和 主题 、 不 是 在 汉语 中 的 三 个 的 、 得 、 地 。
由于 羊驼毛 的 价格 比 羊羔毛 低廉 且 更 具优 的 保暖性 ， 羊驼毛 却 被 越来越 多 的 商家 选用 为 最 新 原料 。
冬天 最低 气温 为 18 左右 。
高考 的 改革 应 是 针对 学生 在 全面性 学习 方面 着手 。
学习 外语 是 多多 一 种 技能 。
主要 的 科技 文献 是 以 英语 为 原始 语言 。
原本 以前 可 只 求 及格 的 心态 ， 转变 得 一定 要 得 高分 。
鲁迅 、 严复 、 梁名超 等 著名 文人 比 他们 的 英文 底子 翻译 了 西方 近 现代 科学 文化 成就 到 中国 。
如今 人 学习 汉语 ， 能 说 得出 语法 上 的 主谓宾 ， 却 很 少 人 对于 汉语 这 个 母语 有 较 深 的 认识 ， 其实 这 导致 了 学习 汉语 的 难度 。
有 对比 才 能 对 自己 的 母语 有 更 深 的 认识 ， 学习 起来 会 更 容易 。
确实 汉语 对 韩国语 有 很 大 的 影响 ， 但是 韩国语 是 韩国人 独特 的 文字 。
一四四三年 ， 李 世 朝鲜 的 第四 代 世宗 大王 亲自 创制 成功 朝鲜语 。
英语 在 世界 上 的 许多 国家 都 不 能 缺少 的 。
随着 韩国 世界 舞台 上 的 地位 越来越 高 ， 越 多 人 学会 韩语 了 。
二O一二年 ， 韩语 是 英国 的 TIMES 最 具 科学性 的 语言 。
这 美丽 的 语言 是 怎么 呢 ？
因为 汉语 不 好学 就 只有 地位 高 的 人 才 能 用 汉语 。
韩国人 对自 国有 自豪感 。
想 珍惜 母国 ， 那 就 想 要 继续 发展 咱们 美丽 的 “ Hangul ” 。
泰国 声母 ( 辅音 ) 根据 拼读 声调 规律 来 分 ， 可 分为 成 中 辅音 、 高 辅音 和 低 辅音 三 类 。
中国 的 东北 三 省 、 美国 、 日本 、 前 苏联 的 中亚 各 国 及 远东 地区 也 有 分布 。
它 的 哲理性 毋庸 讳言 。
在 家里 发生 祭示 、 生日 等 时候 就 把 年糕 做 了 分给 临居们 一起 吃 。
年糕 在 韩国 是 一 个 很 有 福气 的 东西 。
年糕 是 韩国 儒教性 祭示 上 重要 的 祭示 食品 。
在 般 家 到 别 的 地方 时 ， 就 会 定制 很多 红豆 年糕 ， 分给 那 个 区域 的 临居们 。
把 它 做成 了 创意 美食 ， 受 着 各 国人 的 欢迎 和 美赞 。
两 班 面具 在 韩国 最 有名 的 一 个 面具 ， 而且 是 在 韩国 面具 历史 上 最 顶峰 的 位置 。
如果 ， 戴 这 套 面具 后 抬头 时 ， 是 一 个 大笑 的 表情 ， 反面 ， 低下头 时 是 一 个 合上 嘴巴 像 生气 的 样子 。
眼睛 周边 和 两 颊 有 细细 地 皱纹 。
鼻子 非常 大 ， 给予 人们 留下 了 深刻 的 印象 。
世界 上 许多 人 认为 最 早 的 印刷 述 是 在 西方 发展 。
你们 也 快 来 尝 一 尝 吧 ， 肯定 不 会 辜负 你 ！
先 让 水烧开 后 ， 放入 10 个 海蜓 ， 再 烧开 十分 。
从 古 至今 有 很多 的 说法 ， 虽然 很 难 确切 地 知道 人们 是 从 什么 时候 开始 吃 的 拌饭 。
拌饭 可能 出现 更 早 。
它 的 独特 魅力 吸引 了 韩国人 ， 还 渐渐 走向 了 全 世界 人 的 饭桌 前 。
现代 女性 韩服 普通 抱 括 “ 赤 古 里 ” ( 是 韩服 的 上衣 ， 有 五 个 部分 ， 分别 是 衣 、 襟 、 动襟 、 黔 和 简袖 ) 和 高 腰 背心 裙 ; 男性 韩服 普通 有 “ 赤 古 里 ” 和 裤 。
表示 辅音 的 字母 照 着 人 发声 器关 创制 。
“ 训民 正音 ” 的 忧点有易学性 和 普遍性 的 。
语言 学者 重视 “ 训民 正音 ” 的 忧点吧 。
“ 训民 正音 ” 不仅 是 韩国 固有 的 文字 ， 还 会 成为 国际 公用 文字 的 基初 了 。
饮酒 与 做 诗 习惯 就 是 他们 生活 中 最 大 乐趣 的 。
由于 韩 中 两 个 不同 国家 ， 传统 酒 的 种类 与 饮酒 有所 不同 。
希望 中国 同学 与 韩国 同学 之间 的 多 次 接触 ， 更 深深 地 了解 对方 的 传统 文化 ！
由于 传统 韩服 因 穿戴 复杂 繁琐 ， 只有 在 特殊 的 日子 里 才 穿 。
蒙古军喝 的 酒 也 是 烧酒 一 种类 。
烧酒 的 名气 越来越 高 ， 甚至 有 人 用 喝 烧酒 的 人称 “ 烧酒徒 ” 。
古代 烧酒 没 普遍 时期 ， 烧酒 是 来 药 的 。
南方 只 在 夏天 和 秋天 喝 烧酒 。
那时 喝 米酒 就 能 解决 口渴 的 感觉 ， 而 带来 清爽 的 感觉 。
总而言 之 ， 训民 正音 是 韩国人 值得 高傲 的 文字 ， 也 是 韩国 代表 文化 的 财富 之一 。
狗肉 本性 就 有 热性 ， 于是 有 热病 的 尽量 避免 饮食 狗肉 。
夏天 吃 猪肉 要 小心 ， 相反 狗肉 不 会 让 肚子 坏 ， 然后 狗肉 的 狗油 也 比 猪肉 和 牛肉 十几 倍 的 好 消化 。
以后 泡菜 随着 韩国 的 气候 ， 季节 和 各 个 家庭 的 生活 环境 或者 饮食 习惯 多样 的 发达 。
介格 也 便宜 ， 一 盒 人民币 十五 块 左右 。
美国 歌手 麦克儿·杰克逊 也 曾经 喜欢 吃拌饭 。
通过 中国 和 韩国 的 美食 交流 ， 希望 能够 能 了解 对方 。
大部分 韩国人 在 日常 生活 已 不 在 穿 韩服 ， 只有 在 节日 或 举行 重大 事件 时 才 穿 韩服 。
北纬 37 º 33 ’ ， 东经 127 º 为 暖温代气 。
是 一 座 有 过 悲残 历史 的 城市 。
我们 的 生活 在 世界 上 ， 我们 应该 为 世界 做出 一些 贡献 ， 给 世界 留下 一 个 印象
光明 和 黑暗 是 人生 必然 的 事情 。 我们 不 能 一 只 等待 光明 ， 而且 害怕 黑暗 。
我们 应该 边接 光明 和 面对 黑暗 。
由于 我 家 离 外婆 家 比较 远 ， 不 能 常常 见面 。 但是 我 和 婆婆 的 关系 难怪 比 别人 的 更 好 ， 是 为什么 呢 ？
外婆 去世 后 的 那 几 天 ， 我 很 伤心 ， 十几 天 之后 ， 又 回归 原来 的 生活 。
我 觉得 “ 去世 了 ” 是 最 伤心 的 事情 ， 不 是 伤心 的 程度 有 多 深 ， 而 是 不 能 接受 跟 我 喜爱 的 人 永远 不 能 再 见面 的 事实 。
我 现在 还是 很 想念 她 ， 依然 能 感受 到 伤心 的 情绪 ， 但 我 相信 她 一直 活 在 我 的 心 中 。
一 天 。 在 刚刚 结束 工商 管理 课 去 别 的 楼 的 路 中 ， 妈妈 给 了 我 打 电话 ，
第二 我 人生 中 弟 一 次 变 到 爱 的 记忆 让 我 感觉 到 高兴 。
我 在 韩国 生活 的 时候 ， 不 努力 学习 ， 往往 去 网 玩 ，
我 高中二 的 时候 ， 一 见到 中情 了 一 个 具有 倾国 倾城 之 貌 的 同学 ，
过 了 一会儿 ， 有 一 个 学妹 说 ， 给 我 介绍 她 认识 的 朋友 认识 的 学哥 。
2010年 初 ， 好莱坞 有 了 全 世界 人 的 反响 很 大 的 一 部 电影 ; 《 阿凡达 》 。
文明 的 冲突 之所以 都 是 悲剧 ， 因为 双方 常用 暴力 来 解决 冲突 中 所 产生 的 矛盾 。
人类 有 自私 的 面貌 。
因为 ， 虽然 物质 文化 水平 通过 生产量 的 大小 有 量 数据 测量 ， 但 社会 文化 等 无形 文化 难以 会 被 量化 。
总之 ， 文化 上 只 有 差异 ， 没有 差距 ， 而 这些 差异 必需 得 直接 接受 ， 不 能 以 文化 的 不同 而 轻视 对方 的 文化 。
这样 的 观念 对 人类 文化 的 多样性 造成 了 最 大 的 威胁 。
西方人 的 想法 内 ， 有 自己 的 文化 ， 比 印第安人 的 文化 优越 得 多 。
例如 ， 人间 关系 上 ， 印第安人 的 文化 得 比 西方 的 先进 得 多 。
尽管 印第安人 为 小 村 的 管理 而 设置 了 酋长 的 职位 ， 但是 酋长 的 角色 只 是 主动 为 村民 服务 ， 他 绝对 不 利用 自己 的 职位 强迫 村民 做 这 个 跟 那个 ，
这样 的 印第安人 的 文化 仍然 是 对 当今 社会学家 的 重要 学习 课题 的 。
像 这样 ， 因为 从来 没有 接触 过 外界 的 人 ， 有 这样 的 反应 可以 算作 是 理所当然 的 。
人 在 光明 与 黑暗 的 心理 相争 中 ， 每 天 都 生活 在 人生 上 。
人 的 心理 中 光明 往往 代表 于 善 、 黑暗 代表 恶 ，
这 也 是 人 在 心理 中 的 善心 ， 还 可以 说 心理 中 的 光明 部分 。
举例 人们 的 善意 与 恶意 、 光明 与 黑暗 的 矛盾 就 没有 终结 。
阴阳 的 国案 中 ， 有的 意思 是 白 是 “ 善 ” ， 黑 是 “ 恶 ” 或 “ 邪 ” 的 意思 。
在 我们 的 生活 当中 ， 无 不 有 光明 和 黑暗 的 出现 。
我 想 如果 人们 凡是 热衷于 某 一 件 事 ， 而且 对 它 产生 感 兴趣 ， 那 这时 人们 都 不知不觉 得 产生 “ 喜爱 ” 之 情 。
这么 一 个 性格 的 我 最 承受 不 了 的 是 压力 。
曾经 我 从 读 一 年 高三 ， 准备 考习 大学 的 时候 ， 往往 在 压力 陪伴 我 的 生活 。
我 准备 考试 的 那 一 年 ， 凡是 我 受到 什么 压力 ， 就 会 看 电视 里 所 能 播放 的 足球 比赛 。
后来 ， 我 所 考完 大学 后 ， 没有 像 以前 只 是 看 足球 比赛 。 而 是 我 参加 了 韩国 留学生 的 足球队 ， 亲身 地 感受 着 这 足球 的 “ 魅力 ” 。
对 我 来 说 ， “ 喜爱 足球 ” 的 情绪 是 永远 离 不 开 的 ， 也 是 希望 以后 也 一直 度过 我 的 生活 。
凡是 人 都 希望 快乐 ， 都 愿意 产生 高兴 的 事 ， 开开心心 地 度过 每 一 天 ， 这 是 人之 常情 。
每当 爸爸 的 生日 时 ， 我 往往 在 北京 呆着 ， 从来 没有 送给 他 礼物 。
终于 到 了 爸爸 的 生日 这 一 天 了 ， 我 和 弟弟 去 蛋糕 店 里 买 了 一 个 就 回来 ， 准备 让 爸爸 惊讶 。
我 的 孩子们 长大 了 ， 今天 是 我 人生 中 屈指可数 的 一 天 了 。
我 的 这 丑 怪 的 性格 不 止于 看 ， 而且 亲自 去 体验 。
事情 发生 的 场 听 ， 尸体 旁边 一直 响 着 刺耳 的 女子 哭声 ， 这 痛哭 使 我 的 心 更加 昆杂 了 。
钟表声 一直 在 打扰 我 的 睡眠 。
平时 听 不 到 的 钟表 声 ， 突然 怎么 能 听 得 这么 清楚 呢 ?
我 毕竟 是 个 经历 者 ， 仍然 却 脱 不 了 七上八下 的 心理 。
因为 这个 ， 我 没法 完全 脱 不 了 紧张 。
打钤 后 ， 北京 的 大学 的 高考 就 开始 了 。
我 开始 动笔 之后 ， 一切 的 精神 都 集中 到 了 考卷 上 。
但 和 去年 不 一样 ， 我 付出 了 全部 的 努力 ， 即使 我 没 能 入 取 北大 ， 也 不 会 感到 后 恢 。
我 感到 害怕 的 事情 有 很多 各种各样 。
如果 那个 情况 就 是 之前 没有 经过 的 情况 ， 我们 就 未免 受到 “ 害怕 ” 。
人们 说 的 克服 “ 害怕 ” 的 方法 叫 千方百计 。
为了 自己 克服 害怕 ， 应该 定 一 个 目标 以后 具有 着 不 怕 失败 的 精神 付出 不懈 的 努力 。
工作 之前 所以 特别 紧张 ， 是 因为 这 个 歌手 是 被 誉为 韩国 最佳 歌手 之一 。
我 现在 才 20 岁 ， 想到 每 个 人 平均 死亡 年龄 是 90 岁 的话 ， 我 连 人生 的 一半 都 没 活 。
男人 往往 在 女人 面前 吹牛 ， 自夸 。
不论 是 什么 害怕 它 给 人体 带来 的 损害 是 挺 大 的 。
从 那时 起 我 心 里 总是 七上八下 的 安定 不 下来 。
当然 每 个 人 的 性格 不 千篇一律 ， 引起 高兴 情绪 的 原因 也 不同 了 。
她 的 班 一 个 男 同学 告白 了 ， 但是 她 对 他 没有 男女 的 感觉 。
别 的 三 个 室友 自习 结束 ， 就 迫不及待 地 赶回 宿舍 。
那天 大家 一起 到 很 晚 的 时间 聊天 了 。
每当 我 看见 那 天 拍 的 照片 时 ， 就 想 起来 那天 的 情况 和 高中 朋友们 。
室友 往往 到 很 晚 的 时间 喝酒 ， 旁若无人 地 大 哗 ， 让 我 睡 不 着 。
事情 始于 我 小学 三 年级 的 时候 发生 。
那时 我 在 韩国 刚刚 上 了 小学 三 年级 ， 小时候 因为 想 做 的 事情 特别 多 ， 天天 过 了 一 个 非常 丰富 的 一 天 。
我 在 韩国 正 过 着 美丽 的 日子 ， 有 很多 的 好 朋友 。
一 想 上学 ， 就 觉得 毛骨悚然 ， 每 一 天 都 是 痛苦 。
我 有 一 个 姐姐 ， 她 比 我 大 两 岁 ， 从小 的 时候 一起 长大 了 。
我 想起 姐姐 的 时候 ， 立刻 感觉 到 是 “ 可恶 ” 。
她 故意 期 负 我 ， 故意 向 我 说 了 气话 。
我们 姐妹 经常 对 衣服 的 问题 就 吵架 了 。
我 对 她 生气 的 不 是 她 不 借给 我 她 的 衣服 ， 是 她 的 可恶 的 态度 。
如果 你 对 别人 问 ， 在 最 辉煌 的 瞬间 感觉 什么 情绪 ？
那时 里 留学 的 生活 让 我 很 幸福 。
回国 后 ， 我 往往 想 起来 那时候 的 回忆 ， 所以 这 个 学期 又 来 中国 了 。
所以 我 下 决心 来 北京 后 每 天 热衷 学习 。
人们 在 一辈子 经历 很多 事情 。
我 从 以前 总是 觉得 我 很 倒霉 ， 所以 我 变成 了 想 不 开 的 人 。
对 我 来说 ， 到 现在 ， 我 觉得 最 高兴 的 事情 是 合格 考 的 。
那时 ， 我 已 下 了 破釜 沉舟 的 决心 ， 不 完 我 的 打算 ， 绝 不 停止 了 。
高兴 这 情绪 是 ， 对 我 来 说 ， 我 生活 的 原动力 ， 而且 是 我 的 力气 的 。
开始 登山 的 时候 ， 有点 惶恐 ， 也 有 了 生气 。
那 是 我 第一 次 看 松鼠 。
不论是 心态 还是 学习 状态 都 与 之前 大一 、 大二点有很大 改变 。
人 不 可能 永远 过 着 被 光明 的 生活 ， 黑暗 也 同样 不 可能 一直 存在 。
经历 过 黑暗者 一定 会 走进 光明 的 道路 ， 过 着 黑暗 的 生活 ， 通过 自身 的 努力 之后 ， 务必 会 得到 光明 。
光明 和 黑暗 会 分别 带给 我们 不同 的 感受 ， 甚至 对 我们 会 起到 影响 。
高兴 的 青绪是万 病 有效 的 青绪 。
我 个人 认为 “ 害怕 ” 这 个 情绪 的 原因 ， 包罗 万象 而 不 想 屈指可数 。
我们 仨 七点半 就 去 机场 ， 但 没 想到 他们 的 飞机 误点 了 两 个 小时 ， 我 这时 悲常惶恐 。
到 了 表演 的 时候 ， 我们 的 这 种 不满 被 这 一 次 表演 消失 了 。
我们 凌晨 五点半 一直 在 喝酒 。
在 这 三 天 的 工作 中 我 得到 了 这么 好 的 人 也 有 不论是 男人 还是 女人 能力 是 最 重要 的 。
随着 时间 经过 ， 我 越来越 喜欢 了 他 。
我 跟 他 一起 学习 越 长 ， 我 的 成绩 越 提高 了 。
这样 ， 喜爱 的 情绪 有 力量 可以 让 积极 一 个 人 的 人生 恋化 ， 还 可以 控制 “ 生气 ” ， “ 辛苦 ” 等 不 好 的 情绪 ” 。
从来 我 没 受到 那样 的 诚心 充满 的 饭盒 ， 同时 在 外地 上 从 外国 朋友 都 受到 那样 的 关心 ， 我 特别 感动 。
而且 很 感谢 她 ， 不 知道 怎么 报到 她 的 好处 。
每 天 每 天 边 哭 跟 父母 吵 了 好几 天 ， 但 也 没有 用 了 。
有 一 次 ， 在 我 找 房子 的 时候 ， 我 被 一 家 中介 公司 给 了 坑 。
其实 ， 我 知道 这些 钱 是 大家 千辛万苦 赚 来 的 钱 ， 但 我 实在 是 忍不住 的 。
天气 也 随 人心 ， 一 天 比 一 天 灰 。 花草 开始 衰落 了 ， 寒气 弥漫 着 京城 的 处处 。
四 年 前 我 是 你 的 学生 ， 你 是 我们 班 的 主任 老师 。
长 得 完全 像 鸭 的 班长 ？
他们 说 西班牙 最 美丽 的 三 个 地方 是 马德里 巴塞罗那 和 格拉纳达 。
Sopia ” 在 巴塞罗那 还有 有名 的 美术馆 叫做 “ Museo
那 个 兵馆 给 每 个 客人 很多 机会 学 西班牙 传统 跳舞 ， 学 吉他 和 学 西班牙语 。
格拉纳达 就 是 欧洲 和 穆斯林 融汇 的 地方 ， 那儿 的 文化 有 很多 穆斯林 的 影响 。
怪 不 得 那 个 兵 馆 教 客人 西班牙 的 文化 ， 为了 保存 自己 的 文化 。
你 快要 一点儿 来 呢 ！ 北京 真是 有意思 的 城市 之一 ！ 还有 中国 的 历史 和 文化 都 很 灿烂 ！
你 到 北京 的 时候 ， 去 看 长城 、 故宫 和 颐和园 。
这些 地方 征 着 中国 灿烂 的 文化 和 历史 。
我 第一 次 去 这些 地方 时 ， 真 感动 ！ 朋友 ， 响们 一起 去 吧 ！
我 在 北京 第一 次 吃 中国 菜 的 时候 ， 我 哭 了 。
余 外 ， 你 来 北京 时 ， 一定 要 吃 烤鸭 ！
朋友 ， 我 很 想 你 。 虽然 我 在 北京 但是 别 会 忘我 。
一会儿 热 了 一会儿 冷 ， 而且 会 经常 下 天雨 。
仙人掌 的 外貌 特征 明显 ， 多数 仙人掌 的 肉 为 绿色 ， 上面 长满 刺 ， 根据 品种 不同 ， 长 在 仙人掌 上 的 刺 也 千差万别 ， 有 软 有 硬 ， 也 有 直 的 ， 弯曲 的 ， 有如 叉子 般 长 开 的 ， 也 有 如同 网状 将 躯干 包围住 的 。
仙人掌 在 世界 上 的 分部 广泛 ， 其中 以 北美洲 为首 ， 因此 仙人掌 也 被 墨西哥 定 为 国花 ， 其 起源于 美洲 与 非洲 ， 后来 经过 航海 贸易 ， 传入 世界 各 地 ， 如今 在 中国 南方 及 东南亚 都 能 见到 仙人掌 的 踪影 。
不仅 如此 ， 仙人掌 全 是 都 是 珍贵 的 药材 ， 其 果实 是 一 种 珍贵 的 水果 ， 仙人掌 的 茎 具有 治疗 糖尿病 的 功能 ， 把 仙人掌 切开 后 的 肉 还 能 美容 。
乐园 在 二00一年 九月 四日 开幕 ， 最早 是 要 建设 一 座 电影 摄影棚 的 类型 的 主题 乐园 ， 类似于 美国 佛罗里达洲 的 华特·迪士尼 世界 度假 、 法国 的 巴黎 迪士尼 乐园 度假区 。
但 市场 评估 后 才 发现 日本 对于 电影 文化 还 不 够 熟悉 ， 因此 把 主题 变更 为 “ 海洋 ” ， 这 是 全 世界 迪士尼 乐园 第一 次 出现 的 主题 。
Harbor ) 是 以 南欧 的 海港 小镇 为 主题 ， 风景 十分 优美 。
Miracosta ) ， 这 是 世界 唯一 的 在 迪士尼 主题 乐园 内 的 饭店 。
火山 的 山麓 就 是 “ 神秘岛 ” 区 ， 这里 是 以 一八七三年 南 太平洋 的 一 个 火山岛 为 主题 。
区域 内 有 乐园 中 最 受 欢迎 的 游乐 设施 “ 地心 探险 之 旅 ” 。
东京 迪士尼 海洋 与 东京 迪士尼 乐园 有所 不同 ， 东京 迪士尼 海洋 内 设施 的 美术 技术 比 东京 迪士尼 乐园 更 高 ， 能够 享受 迪士尼 的 美术 技术 的 精华 。 同时 也 可以 享受 日本 顶级 的 非常 好 的 服务 。
到 了 上 中学 的 时候 ， 因为 我 遇上 了 一 位 耐心 又 充满 热忱 的 汉语 老师 —— 陈秋华 ， 所以 我 开始 对 学习 汉语 的 态度 有所 改变 了 ， 不 再 觉得 是 一 件 苦 差 ， 反而 逐渐 产生 兴趣 。
她 使 我 重新 看待 汉语 这 门 科目 ， 甚至 爱上 了 她 。
毕竟 我 的 汉语 水平 和 能力 并 不 特别 高超 ， 所以 在 学习 汉语 的 过程 中 相当 辛苦 。
将来 有 意愿 在 中国 发展 事业 的 我 选择 来 中国 留学 ， 而 先前 所 学 的 汉语 让 我 在 中国 生活 和 学习 的 日子 更加 容易 、 顺心 。
我 不 敢 相信 自己 会 有 那么 大 的 转变 ， 也 不 敢 相信 自己 那 来 的 勇气 和 毅力 地 读 中文 。
我 在 中国 已经 有 六 年 的 时间 ， 可是 最 让 我 难忘 的 是 刚 来 中国 时 初次 接触 过 的 汉语 。
不 知 听 写 得 了 多少 不 极 格 。 不 知 我 花 了 多少 时间 来 记 和 写 汉字 ， 记 是 记 不 住 。
我 认识 了 一 个 教 汉字 课 的 老师 ， 她 就 帮 我 解决 我 最 烦恼 的 问题 。
我 当时 自己 的 汉语 水平 很 差 ， 勉强 会 读 会 写 汉语 拼音 ， 日常 会话 也 不 会 如意 。
在 留学生 的 语言 班 里 都 全 都 是 韩国 同学 ， 在 这里 的 同学 大家 都 几乎 不 会 说 汉语 ， 所以 我们 之间 的 沟通 是 很 困难 的 。
我 的 汉语 进步 很 多 ， 虽然 还 有 语言 的 阻碍 、 但是 跟 老师 和 同学们 能 交流 了 。
从 那个 时候 起 我们 班 ， 周末 开 了 HSK课 。
但 还是 多亏 那时 的 痛苦 的 时段 ， 我 能 入学 了 北京 大学 。
入 北求 以后 以 经过 了 一 年 半 的 时间 ， 我 的 汉语 水平 比 刚 来 北京 时 进步 了 不少 ， 但 还 是 不 是 很 好 ， 所以 以后 也 好好 学习 才 行 。
我 小 时候 ， 住 一 个 鸟 ， 名字 是 长山鸟 。
他们 特别 热情 地 对 我 ， 因为 我 爸爸 是 老师 。
在 韩国 的 乡时 ， 老师 很 中 要 的 作业 。
在 鸟 里 不 能 卖 自由 。
自行车 太 小 了 ， 我 很 大 。
我 的 身体 都 很 环 了 。
他们 都 想 求 我 ， 但是 水 很 深深 。
那个 时们 ， 我 的 爸爸 对 我 。
但是 我 很 感动 了 。 爸爸 的 逐日 wei 大 。
因为 爸爸 和 妈妈 每 天 都 很 忙 着 工作 ， 小时候 我 和 弟弟 整天 在一起 ， 所以 童年 时 做 的 所有 的 事情 是 跟 他 一起 做 的 。
弟弟 和 我 喜观 很 好气 地 做 了 新 的 事 ， 而且 很 有 活力 常常 跟 朋友们 去 家 外玩 。
虽然 大部分 的 事情 是 像 小孩子 做 的 那样 的 事 ， 但是 我 记得 我们 在 夏天 时 常常 去 找 小鸟 ， 比较 特别 和 留 了 深刻 的 印象 。
弟弟 也 很 想 成功 ， 所以 我们 会 回家 找 合适 的 东西 为了 带 小鸟 ， 然后 再 出去 观察 它们 的 动作 和 样子 。
我 一直 在 弟弟 的 身边 告诉 他 怎样 做 ， 他 跟 小鸟 的 动线 走 来去 ， 可是 当然 地 ， 不 能 成功 。
我们 常常 这样 ， 但 做 没有 意义 的 好多 东西 ， 可是 觉得 很 有 意思 ， 做 了 童年 的 宝贵 经历 。
因为 有 在一起 的 那 段 好 时候 ， 我 很 爱 弟弟 。
在 这 世界 上 大部分 国家 都 有 自己 的 国花 ， 它 是 一 个 国家 的 自然 资源 ， 历史 传统 和 民族 审美 取向 的 象征 和 体现 。
为了 提高 民族 自豪感 ， 凝聚力 和 国际 影响 ， 体现 民族 特点 和 审美 取向 ， 很多 国家 以 自己 国家 最 有名 的 花 作为 他们 国家 的 象征 ， 并 具有 一定 的 涵义 。
在 国花 的 特性 中 ， 我们 不 难 看出 各 国 的 民族 特征 。
木槿 花 的 独特 品质 正 可以 影射 韩国 悠久 的 历史 。
这 就 充分 显示 出 韩国 政府 在 国花 方面 的 普及 认知 是 不 能 轻视 而 忽略 的 。
我 回想 我 童年 的 时候 ， 自己 觉得 可 爱 得 自然而然地笑 。
我 小 时候 ， 我 个性 很 外向 ， 而且 喜欢 外郊 活动 ， 天天 在 外面 玩 ， 所以 我 的 脸 总是 黑黑 的 。
决定 跟 他们 一举 办 一 个 表演 是 为了 让 老师 和 同学们 高兴 。
所以 我 跟 朋友 下课 后 ， 经常 准备 表演 包含 唱歌 、 跳舞 、 找 ▉ 表演 。
那时候 ， 有 一 个 很 流行 的 歌手 tuan体 ， 我们 担当 那个 歌手 里 的 每 一 个 人 ， 甚至 打ban 得 像 她们 一样 ， 漂漂亮亮 的 。
大家 都 很 满意 我们 的 活动 。
现在 我 想 这些 事情 的 时候 ， 就 不 能 相信 。
我 上 小学 、 中学 的 时候 我 对 狗 的 小心 之 心 积极 增加 ， 我 害怕 比交 利害 ， 所以 如果 我 走路 的 时候 碰到 一 个 狗 、 我 会 千方百计 各种各样 的 办法 绕路 、 我 到 和 这 种 狗 不同 之 路 好 。
在 俄罗斯 海参崴 有 很多 狗 发生 的 事故 ， 比如 说 二〇〇 一 年青 天 有 一 只 大 狗 咬死 小孩 ， 咬 他 的 脸 那么 重 、 甚至 父母 很 难 认出 这 个 小孩 ， 他 的 脸 变成 了 一 块 肉 。
我 害怕 情绪 从 不 意识 的 状态 转到 意识 的 壮态 。
过 了 一 段 时间 我 长大 了 ， 我 想 抛出 我 这 个 不 量 好 的 情绪 ， 不 想 害怕 生 。
每 个 人 都 有 自己 的 感情 ， 每 逢 时间 ， 每 见 事情 都 会 产生 各 种 情绪 。
比如 害怕 ， 生气 ， 厌严 ， 伤心 ， 惊讶 ， 喜爱 ， 高兴 等等 其中 ， 高兴 是 一 种 能 表现 出 愉快 与 亲福 心理 状态 的 情绪 。
他 在 出来 休假 ， 计 # 划 # 跟 他 去 海边 玩 。 不过 旺季 已经 过去 了 ， 到 了 每 边 没有 几 个 人 ， 屈指可数 。
我 值接 问 他 为什么 那么 高兴 了 。
难怪 这么 小 的 事情 可以 让 她 高兴 吗 ？
在 困难 的 环境 下 每 天 都 劳动 ， 身体 很 累 。
不 伦 大 的 事 或是 小 的 事 ， 都 可以 让 我们 高兴 。 最 重要 的 是 怎么 想 。
我 个人 觉得 我们 的 情绪 来 决定 一 个 人 的 性格 ， 甚至 决定 一 个 人 。
我 把 “ 伤心 ” 奉为 圭泉 的 艺术 理念 。
特别是 人 和 人 之间 的 离别 ， 显然 给 我 很 大 的 打击 。
每当 不论 男女 老小 ， 我 都 曾经 喜欢 过 的 人 离别 时 住住 如此 。
我 的 母亲 为了 增强 我 的 耐心力 和 能力 ， 她 确实 用 了 千方百计 。
其中 ， 每 个 周末 都 利用 青少年 社团 去 旅游 。
后来 慢慢 适应 下去 ， 认识 到 世界 上 有 包罗 万象 。
每 个 周末 跟 陌生 的 同辈 朋友 一起 去 旅游 陌生 的 地方 是 可以 适应 的 。
可 到 我 在 还是 不 习惯 的 事情 是 在 旅游 结束 的 那时候 的 离别 。
我 从 小 经历 过 数 多 次 的 离别 ， 所以 和 人 友去 开始 时 ， 不 相信 对方 。
这 应该 为了 不 想 再 受伤 的 原因 。
其中 我 跟 别人 此 较 起来 有 一 个 很 特别 的 一 个 表出 情绪 的 特点 就 是 “ 眼泪 ” 。
害怕 、 生气 、 高兴 、 伤心 等 都 会 流泪 ， 每 当 流泪 的 意思 都 不 一样 ， 可 刺激 我 的 情绪 程 ， 就 喜欢 流泪 。
虽然 学校 都 不 一样 ， 可 小时 就 一起 长大 的 所以 常常 见面 一起 玩 。
胸脯 剧 起伏 着 ， 仿佛 像 一 个 大 气球 爆炸 似 的 ， 我 的 嘴巴 生气 地 咬东 切齿 。
丰满 诱人 的 身子 ， 从 背后 仅仅 抱 起 了 那个 男生 。
跟 中国 朋友 一起 聊天儿 的 时候 ， 虽然 有点儿 难过 ， 但是 很 有 意思 。
其实 这 也 难怪 ， 她 对 汉语 课本 的 内容 也 有 很 大 的 关心感 。
其实 有 北京 的 不 好 的 样子 ， 比如 ， 污染 的 空气 、 有些 服务员 的 旁若无人 的 态度 ， 但是 这样子 在 什么 国家 也 会 发现 ， 所以 对 我们 来说 ， 不 是 很 大 的 问题 。
因为 造成 了 好 环境 ， 所以 每 年 很多 留学生 来 北京 ， 我 的 朋友 也 希望 會 北京 留学 。
不过 ， 每 个 人 对 什么样 的 事情 到底 可以 算是 成功 ， 什么 不 可以 算 都 不 一样 。
说 成功 是 什么 我们 就 必须 说到 怎么 成功 ， 成功 是 不 是 一 个 只 能 通过 努力 的 路线 达到 的 东西 ？
这 个 情况 有 很多 。
运气 是 一 个 很 广义 的 概念 ， 但是 总的来说 运气 就 是 那些 我们 控制 不 了 ， 但是 最后 还 会 影响 到 我们 是否 能 成功 的 东西 。
听完 了 以后 ， 那 位 侦查员 特别 喜欢 那个 歌手 的 音乐 他们 就 签 合同 ， 后来 的 故事 就 不用 说 。
不管 怎么 说 都 是 一 个 的 概念 ， 那个 歌手 一直 努力 但是 一直 没有 成功 ， 然后 突然 有 一 天 一 件 他 控制 不 了 的 跟 他 没有 关系 的 事情 发生 了 ， 侦查员 来 了 。
总得 来说 努力 与 运气 都 是 成功 的 基本 条件 ， 都 是 不 可 缺少 的 。 他们 都 是 对 成功 一样 重要 的 现象 。
他 吓 了 一 跳 ， 她 为 麻雀 非常 担心 ， 于是 到 竹林 去 找 麻雀 。
爷爷 说 自己 已经 老 了 ， 拿 不 起 那么 大 的 箱子 ， 背 着 小 箱子 回 了 家 。
于是 ， 奶奶 也 跑到 竹林 去 ， 找到 麻雀们 的 家 闯 进去 ， 要求 准备 礼物 。
回家 的 路 上 ， 她 想 看看 这 个 大 箱子 里 到底 有 多少 财宝 ， 把 箱子 放 在 路边 ， 慢慢 打开 了 。
在 刚果 ， 有 一 条 很 有名 的 河， 是 “ 果 ” 。
王永丽 是 个 美丽 可爱 又 有 魅力 的 姑娘 ， 她 有 大大 的 眼睛 、 浅 咖啡色 的 长 头发 、 厚厚 的 性感 有型 的 小 嘴巴 ， 她 的 身材 很 苗条 ， 长 得 标准 女性 高 。
但 世界 上 没有 是 十全十美 的 ， 她 生出 很 贫穷 的 家 ， 她 爸爸 妈妈 俩 是 捡拉圾 的 。 她 还 有 两 个 哥哥 和 一 个 弟弟 ， 她 在 宾馆 做 送 餐 人员 ， 有 一 天 有 小 K 来 宾馆 住 ， 他 是 从 上海 来 的 ， 他 爱上 了 北京 姑娘 ， 她 也 觉得 是 一 见 钟情 ， 他们 开始 互相 爱昧 ， 但 由于 她 觉得 她 配 不 上 他 ， 她 就 辞 了 ， 他 找 不 到 她 ， 他 用 各 种 办法 ， 最后 找到 她 了 ， 他 知道 她 家庭 的 情况 ， 他 最后 娶 王永丽 当 新娘 ， 是 王家 的 幸运 ， 他们 的 生活 都 不 要 那么 劳累 了 ， 这 是 命中 注定 的 ， 有时候 我 觉得 一 见 钟情 ， 钟 的 不 是 情 ， 是脸 ， 所以脸 ， 形象 也 是 很 重要 的 ， 但是 他 也 不 用 她 的 往事 ， 去 怀疑 她 个人 的 本质 。
她 和 他 最后 在 一起 ， 过 3 年 他们 有 3 个 孩子 ， 老大 是 男 的 ， 老二 是 女 的 最 小 也 是 女 的 ， 她们 过 得 很 愉快 ， 是 两 个 家庭 ， 虽然 一 个 是 有钱人 ， 一 个 是 贫穷 人 ， 但 最后 在 一起 没 问题 ， 世界 上 总是 出现 这样 的 事 ， 本人 想 可能 是 天命 注定 吧 。
就 像 很多 后母 一样 ， 这 位 妇人 很 讨厌 丈夫 的 女儿 ， 所有 的 活儿 都 让 她 做 ， 而 自己 的 女儿 确 像 公主 一样 伺候 着 。
她 自己 的 丈夫 把 那个 女孩儿 拉进 森林 里 ， 扔 在 雪堆 里 。
小姑娘 在 雪堆 里 冻 的 直 发抖 ， 突然 感到 严寒 ， 原来 是 雪 先生 来 了 。
后母 在 家里 觉得 时间 差 不 多 了 ， 让 她 去 森林 去 把 自己 女儿 埋 了 。
妇人 的 女儿 在 雪 里 坐 时 ， 雪 先生 又 来 了 ， 雪 先生 问 她 冷 不 冷 ， 她 大叫 到 : “ 冻死 我 了 ， 你 快点 走 ！ ” 雪 先生 很 生气 就 离开 了 。
妇人 在 家 看 时间 差 不 多 了 ， 命 丈夫 去 接 女儿 回来 ， 她 到 门口 迎接 ， 接 回来 的确 是 一 条 尸体 ， 此时 后悔 已经 太 晚 了 。
过 了 十几 年 ， 弟弟 回到 这 个 部落 来 看哥 生活 怎么样 。
去 找 哥哥 时 ， 路上 碰到 了 一 个 非常 漂亮 的 女子 ， 他 就 问 这 个 女子 就 找到 了 他 的 哥哥 的 家 。
这 在 这儿 是 ， 弟弟 刚刚 看到 的 漂亮 的 女子 走进 了 屋子 。
“ 没有 ， ” 哥哥 很 自豪 地 说 ， “ 她 就 是 小 女儿 ， 是 我 当时 要 娶 的 那个 。 ”
哥哥 的 妻子 就 对 弟弟 说 : “ 就 是 我 当时 明白 了 ， 我 值得 这 十 头 牛 。 ”
有 一 个 寒冷 的 雪天 ， 老爷爷 出去 到 城镇 去 卖 木材 后 的 回家 路 中 ， 发现 有 东西 在 雪地 里 调动 。 “ 那 是 什么 呢 ？ ” 老爷爷 发现 了 在 雪地 里 有 一 只 鹤 被 困 在 圈套 里 了 。
老爷爷 觉得 那 只 鹤 很 可怜 ， “ 安静 点 ， 不 要 动 ， 我 马上 来 救 你 ”
当 老爷爷 帮 把 鹤 脱身 后 ， 鹤 就 往 向 山 飞去 了 。
老爷爷 回到 家 后 就 奶奶 说道 了 那 件 事 。 “ 我 今天 做 了 件 好 事 ， 我 救 了 被 困 在 圈套 里 的 鹤 。 ”
一 说完 ， 门口 就 来 听见 敲门声 ， “ 是 谁 呢 ？ ” 老 奶奶 把 门 打开 ， 门口 里 站 着 一 位 美丽 的 姑娘 ， 说道 : “ 这么 晚 了 打扰 真 不 好 意思 ， 我 是 去 这 村子 来 探望 朋友 的 ， 我 因为 外面 下 着 大雪 而 迷路 了 。 请您们 让 我 在 这里 借宿 一下 ， 可以 吗 ？ ”
“ 今晚 特别冷 ， 快 进来 虽然 我们 很 贫穷 ， 没有 被褥 ， 如果 不 介意 的话 就 是 你 留下 来 吧 ”
没有 小孩 的 二 个 人 ， 都 把 她 看成 亲生 女儿 的 对待 。
。
有 一 天 ， 姑娘 这么 说 ， “ 我 想 编织 美丽 的 布 ， 可以 买 些 线 回来 给 我 吗 ？ ” 老爷爷 就 把 线给 买来 了 。 要 开始 编织 的 时候 ， 她 这么 说 了 ， “ 现在 开始 做 织布 了 ， 我 在 织布 的 时候 绝对 不 能 看 房 里面 ， 请 绝对 不 要 看 房里 。 ”
“ 明白 了 ， 绝对 不 在 看 房 里 了 ， 编织 出 好 的 布 来 吧 ！ ”
那个 的确 是 他们 见 过 的 织物 中 最 美丽 。
女儿 说 “ 这 是 鹤 的 织物 ， 请 明天 拿到 城镇 去 卖 ， 然后 也 请 买 些 线 回来 给 我 。 ”
三 天 过去 的 时候 老 奶奶 对 老爷爷 说 : “ 这么 好 的 织物 是 怎么 做 出来 来 的 ？ 稍微 看 一 眼 。 ”
“ 不 可以 这么 做 ， 你 已经 答应 了 绝 不 看 房 里 的 ”
“ 老公 ， 只有 只 鹤 在 织布 啊 ” 小声 说道 。
那 一 夜 ， 女儿 拿着 织物 从 房里 走 出来 ， “ 爸爸 、 妈妈 ， 我 决 不 会 忘记 你们 的 恩情 ， 我 是 那时 困 在 圈套 里 被 你 救 出来 的 鹤 ， 为了 报恩 来到 这 ， 可是 我 的 真份 被 识破 了 ， 所以 不 能 再 留 在 这里 了 ， 这 段 日子 ， 真的 感谢 你们 。 ” 说完 后 张开 双 后 变成 鹤 ， 向 天空 飞去 ， 回绕 在 屋顶 上 ， 往山 飞走 了 。
他 的 五官 端正 ， 有 一 头 褐色 的 头发 ， 长 得 高头大马 ， 很多 女生 都 有 外表 着迷 ， 他 的 家境 富裕 ， 父亲 是 国际 饮食 集团 的 总裁 ， 母亲 则 是 妇产科 医生 。
他 待人 诚恳 ， 性格 温和 谦逊 ， 到 那儿 到 非常 受 欢迎 。
她 的 性格 乖巧 ， 有 一 头 乌黑 的 长发 ， 一 双 明亮 的 大 眼睛 ， 简直 是 典型 的 邻家女 ， 她 和 他 相恋 ， 已经 有 两 年 了 。
他们 瞒 着 父母 和 亲戚 ， 私 底下 偷偷 展开 这 段 恋情 。
这 他们 经常 去 的 购物 中心 ， 因为 离 他们 俩 的 住家 非常 远 ， 所以 被 熟人 看见 的 机率 也 就 不 高 。
过 了 几 天 ， 一 辆 救护车 和 警车 出现 在 了 她 的 住家 楼下 。
伟大 来自于 平凡 ， 往往 一 个 企业 每 天 需要 作 的 事 ， 就 是 每 天 重复 着 所谓 的 平凡 的 小 事 。
古今 ， 因为 重视 细节 成功 的 例子 屡见不鲜 。
我 是 2010年 在 北京 大学 中文 系 大 韩国 留学生 叫洪世美 。
从 那 天 开始 她 会 当 我 的 偶像 。
可是 我 决心 的 是 19 岁 冬天 有点 晚 了 ， 在 韩国 19 岁 冬天 要 准备 考上 大学 。
所以 我 一直 是 软膜 的 父母 ， 盲目 得到 中国 来 了 。
全 方面 拌蒜 。
所以 阅读 与 写作 这 门 课 对 我 来说 非常 有用 再 锻炼 的 机会 。
爱迪生 发明 了 电灯泡 之后 ， 大家 都 说 他 有 天才 ， 但是 在 他 找到 了 适当 的 材料 之前 ， 他 花 了 多少 心思 去 考虑 材料 的 适用 度 。
未来 我 用 汉语 能力 ， 希望 有朝一日 能 为 中 韩 的 联谊 文化 发展 做 工作 。
其实 说 是 4 年 ， 汉语 水平 没 那么 好 ， 是 因为 我 一般 都 读 专门 学 汉语 的 外国 学校 ， 没有 跟 中国 朋友 交流 的 机会 ， 所以 口语 相当 差 ， 不用说 写 文章 。
当然 日常 生活 上 没有 特大 的 沟通 障碍 ， 但是 一旦 用 那 笔 写 出来 文章 的话 ， 直接 露出 我 幼稚 的 写作 水平 了 。
和 一般 中国人 交流 时 ， 几乎 沒 遇到 很 大 的 困难 。
当然 有 运气 ， 就 能 得到 “ 成功 ” ， 但 这样 做 会 拿到 成功 的 概率 很 低 。
如果 自己 觉得 不 如 某人 的 时候 ， 自然 会 产生 竞争 的 心 里 ， 那时 我们 比 平时 更 努力 。
古代 汉语 一 个 字 一 个 字 都 勾引 我 到 文章 里面 ， 文章 给 了 我 文学 历史 知识 ， 那 知识 给 我 丰富 理解 中国 。
我 家 有 四 口 人 。
我 选择 去 外国语 高中 学校 的 原因 是 在 那 个 学校 韩国 最 聪明 的 学生 都 来 了 ， 所以 学习 环境 很 好 ， 教育 的 质 很 高 。
我 已经 通过 了 HSK5 级 ， 准备 着 6 级 三 个 多 月 。 所以 在 日常 情况 下 ， 我 能 用 汉语 比较 流畅 ， 可是 讨论 对于 专业 知识 的话 我 就 会 遇到 困难 。
结束 ， 我 觉得 “ 中国 专家 ” 不 是 只 能 说 汉语 ， 就 是 能 说 汉语 的 基本上 ， 通解 中国 政治 、 文化 、 经济 什么 的 。
我 的 不足 的 词汇量 和 语法 可以 改善 通过 自己 的 努力 ， 可是 对 正确 地 写 论文 ， 或者 文章 来 说 ， 在 我 的 能力 下 ， 不 能 改善 ， 所以 在 那个 部分 我 真 需要 专家 老师 的 指导 和 修改 好 。
虽然 我 的 汉语 水平 还 没 达到 那么 高 ， 可是 认真 地 努力 学习 ， 想 要 成就 我 的 目的 。
从此 ， 我 的 心 里 渐渐 发生 了 变化 。 我 开始 努力 学习 ， 通过 各 种 测验 选好 了 更加 提高 汉语 水平 的 方法 ， 把 它 当成 了 我 的 专业 。
但 剩下 的 高考 或者 校 内 优秀 成绩 的 方法 也 就 不 能 放弃 ， 就 认真 地 抓好 了 三 方面 的 学习 。
一 说 运气 ， 可能 会 有 很多 人 嘲笑 他 吧 。
但是 我 觉得 运气 是 到达 成功 的 最后 一 笔 。
那 是 我 报名 的 学校 中 最 差 的 大学 ， 大部分 参加 面试 的 人们 学校 成绩 ， 汉语 考试 成绩 都 比 我 不 好 ， 但 我 可 没有 骄傲 ， 很 认真 地 对待 面试 了 。
面试 的 老师 也 对 我 亲密 友谊 ， 而且 对 我 直接 说 我 肯定 能 考上 这 个 学校 ， 但 无缘 无故 的 被 淘汰 了 。
然而 ， 我 考上 的 大学 面试 中 想 ， 一 个 问题 也 没 回答 好 却 考上 了 。
我们 在 很多 地方 都 听 过 ‘ 成功 是 由 99% 的 努力 加上 1% 的 运气 组成 的 ’ 。
我 的 国贼 是 韩国 ， 还 有 我 的 老家 是 首 尔 。
我 学习 汉语 的 时候 最 有趣 的 是 汉语 ， 有 历史 很多 。
那 是 更 听 电视 节目 ， 看 汉字 。
我 希望 在 这 堂课学 提高 我们 的 写作 。
我 去 泰国 时 ， 去 山 族 村子 。
住 在 他们 的 村子 是 新 经历 。
泰国人 十六 岁 时 ， 他们 就 结婚 了 ， 所以 我们 年龄 的 时候 他们 是 爷爷 和 奶奶 。
那个 消息 给 我 打 了 冲击 。
去 蒙古 时 ， 我 去 了 乌兰巴托 。
我 不 忘 的 是 夜 天 ， 夜 天 有 耿耿 星河 。
我 在 蒙古 觉得 自然 的 很 大 美丽 ， 还 有 我 在 马上 感 凉快 的 气氛 。
中国 规模 跟 韩国 的 不 一样 。
在 那儿 很 广大 ， 很 厉害 。 我 在 江山 公园 看 故宫 博物馆 ， 感受 吃 凉 。
但是 那 个 梦想 改变 了 ， 现在 我 是 秘密 。
我 爱 的 方面 很 少 。 其实 我 在 相思 她 七 年 了 。
从来 我 单相思 她 ， 如果 回国 时 的话 ， 我 会 告白 她 。
几 个 青年 神仙 如 桌子 神仙 、 食物 神仙 等 都 忙 着 追 她 。 可 天上 老大 女娲 哪 能 这么 容易 ？
再说 ， 女娲 根本 没 对 他们 得 赶 兴趣 。
女娲 哪 能 想到 过 一 个 纯纯扑扑活 的 红尘 的 小伙子 会 打动 她 的 心 呢 ？
程郁缀 得知 事情 的 真相 ， 一 把 劲儿 叫到 女儿 ， 痛骂 一 吨 ， 下 命令 把 林军 给 杀掉 。
父亲 ， 亲 您 经 恕 我 的 错过 。
所以 我们 将来 要 成功 ， 我们 应该 发挥 马拉松 精力 。
可是 我们 绝对 不 要 停顿 下来 ， 而 应该 坚持 下去 ， 而 是 因为 我们 很 年轻 、 很 有 机会 、 很 有 潜能 。 只是 我们 还 没 自觉 不 出 坚持 的 价值 来 而已 。
他 2011 年 来 北京 的 那 一 天 ， 正好 也 是 我 在 北大 的 第一 天 上课 。
因此 我们 去 上 了 地铁 ， 我们 一 上 他 一 脸 大 汗 淋漓
正好 那时候 是 尖峰 时间 ， 所以 到处 都 充斥 着 在 跑 回家 的 人民 ， 我 自己 一生 只 做 了 北京 的 地铁 ， ( 小时候 也 做 了 伦敦 的 但是 我 记 不 住 我 当时 是 什么 感觉 ) ， 所以 我 没法 拿 北京 的 地铁 和 别 的 城市 的 来 比较 。
他 当时 觉得 特别 不 礼貌 ， 因为 我们 的 国家 不 能 盯 着 别人 ， 但是 在 北京 好像 是 可以 的 ， 我 和 他 说 大家 可能 在 看 我们 因为 他 有 很 红 的 头发 ， 我 有 辫发 ， 所以 他们 不 习惯 而且 很 他们 是 好奇 的 所以 这 也 难怪 他们 。
他 说 在 他 印象 里 古 北京 是 很 有 文化 的 ， 很 有 有 道德 的 一些 文人 和 诗人 ， 且 那 时候 的 美女 一定 是 有 倾国 倾城 的 之 貌 。
他 走 之前 感谢 我 说 ， 在 热诚 地 招待 下 ， 他 有 宾至如归 ， 而且 虽然 他 不 喜欢 北京 的 很多 方面 ， 他 喜欢 的 让 他 觉得 他 可以 习惯 住 在 北京 。
大学 考试 迟到 ， 表现 了 一 种 大学生 不 太 有 责任感 的 人 ， 后果 往往 是 自负 的 ！
士兵 的 最 大 目地 就 做战 ， 人们 常常 说 军土 训练 十 年 百 年 都 是 战争 。
在 去年 我们 专业 有 一 门 科 叫做 现代 汉语 课 ， 这 门 课 的 老师 非常 有 责任感 与 很 认真 的 对带 学生 门 ， 而且 这 门 课 的 老师 也 很 严格 ， 所以 学生们 都 很 认真 地 听 老师 讲课 。
在 教室 门口 的 老师 跟 她 说 了 一些 话 ， 然后 这 位 同学 就 底 着 头 很 失望 地 走出 教室 去 ， 她 这 学期 认真 学习 这 门 课 的 目地 就 全 军 覆灭 了 ， 我们 都 很 同情 她 ， 但是 我们 也 没 办法 ， 因为 这 是 学校 的 规定 ， 而且 我们 大学 没有 补考 ， 只有 重修 。
我们 知道 规则 是 用来 空制 不 遵守 规则 的 人 ， 但是 有些 特殊 的 情况 时 ， 学校 应该 打开 更 宽 的 胸怀 来 包容 学生们 ， 这样 学生们 会 更加 的 感觉 到 在 校 里 的 生活 是 宾至如归 ！
在 理论 上 ， 生气 指 的 是 因 不 合 心意 而 不 愉快 ， 但是 这 个 定义 有点 模糊 不 清 因为 我们 因为 因 不 合心 也 可以 产生 各 种 其他 的 情绪 ， 比如 伤心 ， 失望 等 。
当然 每 个 人 生气 的 时候 都 可以 自己 感觉 到 ， 但是 形容 这 个 心态 并 不 简单 。
无论 如何 ， 我们 生气 的 时候 的 表达 和 行为 ， 就 可以 把 我们 所 感觉 到 的 情绪 分为 三 个 阶段 ， 也 就 是 初级 ， 中级 和 高级 。
相对 来 说 ， 初级 指 的 是 过 了 段 的 时间 后 就 没有 那 个 生气 的 感觉 ， 中级 是 过 了 越 长 的 时间 ， 高级 是 过 了 很 长 的 时间 才 好 起来 。
后来 我 发现 全 飞机 一直 在 等 我 一 个 人 ， 飞机 的 官员 很 愤怒 ， 我 说 不 让 上 。
所以 我们 现在 一定 要 过 得 很 充实 ， 少 生气 ， 不 能 避负 发怒 的 时候 就 亥 听听 能够 让 自己 快乐 的 音乐 ， 去 玩 让 自己 放松 的 运动 。
我 以前 是 认为 恋爱 是 个 不知不觉 地 令 人 感到 快乐 幸福 的 。
初期 的 时候 相处 得 令 人 羡慕 。
然而 ， 过 了 一 年 后 ， 咱俩 之间 的 关系 开始 变化 。
每 次 下课 时 ， 她 应该 到 我 家 一起 做 功课 。
但 后来 ， 当 我 和 她 在 一块 的 时候 ， 感觉 很 像 一 个 人 在 沙漠 里 一样 十分 冷漠 。
当 我 提 她 几 个 问题 的 时候 ， 有时 她 会 认真 回答 ; 有时 她 会 默默 无语 ; 有时 她 就 会 赶 我 走 。
为了 安心 地 走 ， 他 还 能 勉强 我 ， 把 我们 俩 拆开 … …
不论是 跟 她 走 ， 哀求 她 父母 ， 凡是 能 让 地 回到 我 身边 的 主意 ， 不管 好坏 ， 我 都 做 。
这 事 也 影响 到 了 她 的 “ 想 呆 这 ” 的 念头 。
但 当 我 得到 了 她心 和 信赖 ， 却 没有 好好 珍惜 。
我 相信 事 终 会否 极 泰来 ， 这 只 是 我 的 第一 次 恋爱 ， 我 相信 第二 次 一定 要 比 第一 次 好 得很 。
很多 人 不 相信 我 没 受 过 汉语 基础 教育 ， 但是 我 真 的 进 北大 预科 后 才 真正 开始 学 汉语 ， 因此 最 基本 的 拼音 、 汉字 、 语法 等 我 都 没 学 过 。
直 到 我 能够 在 课堂 上 正常 发言 ， 需要 两 周 的 时间 。
当 时候 ， 我 开始 学会 写 一二三四 这样 简单 的 字 。
除了 每 天 在 课 上 学习 的 汉字 外 ， 还 会 看 一些 有 拼音 的 小儿书 。
我 是 一 名 泰国 留学生 ， 我 从 小学 一 年级 就 开始 学 中文 ， 是 在 泰国 的 学校 学来 的 一点点 滴滴 最 简单 的 口头语 、 数字 、 水果 等 。
从 这 之前 我 也 学 过 汉语 拼音 ， 是 很 优秀 的 翻译家 ， 思想家 ” 。
她 很 爱 我 ， 我 小时候 当 婴儿 时 ， 她 还 养 过 我 一 段 时间 ， 因为 我 爱 哭 我 妈 受 不 了 ， 妈妈 要 把 我 舍掉 了 ， 幸运 有 她 。
所以 我 长大 后 ， 我 妈 会讲 这些 故事 ， 我 就 知恩 她 和 他 。
黄 老师 她 出版 了 很多 教 泰国人 学 中文 书籍 ， 教 外国人 学 泰语 的 书 也 有 各种各样 的 作品 。
最后 取得 第二 名 ， 去 广州 免费 学习 两 个 星期 都 是 礼物 。
回 泰国 老师 还 让 我 一 个 人 在 台 上 表演 给 大家 ， 全 学生 和 老师 看 ， 我 很 荣幸 ， 感谢 各位 老师 慈悲 人 。
我 大三 时 再 参加 汉语 桥 演讲 毕赛 最后 取得 第二 名 ， 这 一 次 比 大 一时 更 好 了 。
现在 我 还是 坚持 每 天 有 时间 就 静下 心 来去 聆听 各 种 旋律 带给 我 心灵 上 的 放松 ， 学习 上 的 帮助 。
在 食堂 、 医院 、 银行 、 车站 、 地铁站 、 超市 等 需要 排队 等候 的 场合 ， 我们 常见 插队 ， 现象 不 是 那么 意外 的 事 。
我 从 火车 上 一 下来 ， 面对 寒冷 的 空气 ， 使 我 感觉 到 我 确 到 了 哈尔滨 。
从此 以后 ， 我们 一家人 去 了 上海 ， 苏州 ， 杭州 ， 桂林 等 地方 ， 但是 哈尔滨 是 第一 次 我们 一 家 一起 旅游 的 城市 ， 因此 哈尔滨 在 我 的 心 里 永远 不 能 忘记 的 城市 。
我 记得 对 童年 的 我 来 讲 ， 比 和 动物 玩更 有趣 的 事情 是 我 爷爷 的 这 种 在 城市 里 上 不 了 的 教育 。
我 小时候 在 英国 生活 ， 在 英国 、 有 很多 养成 足球 运动员 的 乐部 。
那 天 ， 我 回到 家 ， 妈妈 说 : “ 妈妈 ， 我 想 上 英语 陪训班 。 ” 她 对 我 说 : “ 好 ！ 明天 我 带去 吧 。 ”
但 那 时候 我 的 年龄 少 ， 语言 吸收 能力 比较 好 ， 我 的 英语 水平 很 快 就 提高 。
从 那时候 我 跟 我 的 朋友们 自由 地 勾通 ， 跟 朋友们 和 教练 的 关系 也 发展 了 。
在 北京 这 块 大 土地 上 繁忙 无暇 的 我 ， 多少 想 回到 那 一 小 片 土地 和 陶冶 情操 ， 发现 真谛 。
比如说 ， 如果 学校 里 的 世宗 大王 的 铜相 翻开 了 自己 手 里 的 书 ， 那么 有 一 个 我们 学校 里 的 学生会 死亡 。
学校 里 的 草场 上 有 一点 的 人 来 运动 。
我 突然 觉得 我 的 背 很 爽快 ， 手 在 在 发抖 。
有 一 天 傍晚 ， 奶奶 做 晚饭 时 ， 发现 厨房 里 的 盐剩 得 不 能够 做汤 。
直 到 懂事 了 之后 才 知道 ， 那些 人 以 廉价 ( 最 贵 的 也 就 是 三 块 钱 左右 ) 出售 快要 死掉 的 小鸡 ， 骗取 小孩子 的 钱 。
冬天 的 时候 ， 夏天 的 时候 玩 的 水 ， 因为 天气 太 冷成冰 ， 我们 就 在 那 滑冰 、 玩雪 。
那 一 年 发生 的 世界 足球杯 睡醒 了 韩 民族 的 。
历史性 事件 中 发生 的 那 闷热 的 七月 我 只 是 个 爱 笑 爱 玩 的 小 男孩 。
和 朋友 一起 去 玩儿 电脑 也 是 在 我 初中生 时 才 普遍 起来 。
一 开始 ， 我们 队 占 了 优势 ， 我 幼稚 地 逗 弟弟 说 : “ 不 好 意思 。 今天 也 会 赢 了 。 ”
我 爸 深深 地 说 过 人生 就 像 这 座 山 ， 中途 会 有 很多 坎坷 ， 都 要 克服 那些 困难 ， 才 能 到 高峰 和 喜悦 。
我 从 小 就 很 喜欢 打扮 。
这 种 颜色 我 从小 的 时候 到 现在 很 喜欢 的 颜色 。
可是 ， 到 现在 回到 这些 故事 ， 虽然 受伤 的 记忆 太 痛 ， 但是 觉得 好笑 而 很 可爱 。
那 中 有 件 事 很 快乐 ， 有 事 很 悲伤 ， 但是 那 中 最 多 的 是 有 意思 的 事 。
现在 我 已经 二十多 岁 了 ， 但是 还 记得 很 鲜艳 。
我 希望 再 一 次 有 机会 来 见 奶奶 的 微笑 。 我 真 想 她 。
他 早上 醒来 ， 手 到处 摸 ， 寻找 眼镜 ， 居然 没有 找到 。 看来 ， 今天 只有 生活 糊涂 之中 。
我们 玩 得 很 开心 。
虽然 到 现在 我 还 有 伤口 ， 但 觉得 那 件 事 是 我 童年 有趣 的 事 。
各种各样 的 运动 中 我们 最 喜欢 的 是 足球 。
老师 让 我 当成 我们 班 的 足球队 长 ， 我 感觉 很 开心 。
所以 胜利 四 次 的 比赛 的话 ， 我们 可以 当 第一 的 名 。
上 半 我 踢 得 真 不 好 。 相对队 进球 了 一 个 。
在 门口 我 就 发现 了 日本 的 动物园 和 韩国 的 动物园 有 什么 差别 。
因为 我 姐姐 长 像 老虎 ， 所以 我 在 有 老虎 的 地方 的 前面 很 久 。
这 是 因为 我 第一 次 看到 那么 广大 的 足球 比赛 。
他 喜欢 用 唱歌 和 跳舞 教 我们 ， 我们 也 很 喜欢 跟 他 一起 唱歌 。
忙 的 学业 生活 中 累 时 ， 他们 还 可以 加油 我 。
今年 我 有 很多 趣事 。 比如说 ， 我 有 机会 在 北京 大学 上 中文系 的 课 还 有 前 几 天 ， 我 找 完 我 的 新 女 朋友 。
虽然 他们 很 忘 ， 但 为了 实现 儿子 的 心 ， 他们 来 我 太 感动 了 。
在 我们 生活 当中 ， 有 很多 规律 ， 其中 有 很多 在 法规 上 不 存在 的 ， 比如 “ 在 公共 场合 要 排队 ” 。
可是 目前 在 食堂 、 医院 、 银行 、 车站 等 需要 排队 的 场合 ， 插队 现象 屡见不鲜 ， 那么 ， 到底 人们 为什么 如此 做 “ 插队 ” 呢 ？
也许 有的 人 认为 插队 是 一 个 小 事情 ， 但 “ 插队 现象 ” 不 只 是 一 个 或者 两 个 人 的 小 事 ， 是 社会 的 很多 问题 结合 起 ， 并 引起 的 现象 ， 我 通过 理解 问题 的 原因 解决 这样 的 问题 。
所以 老人 插队 的 时候 ， 年轻 人 不 好 意思 跟 他 说 ‘别 插队 ’ 。 后果 ， 老人们 插队 的 现象 增加 了 。
我 觉得 解决 插队 的 问题 ， 应该 要 共同 努力 。
年轻人 也 要 有 勇气 地 说 老人们 ， 以后 不 再 插队 吧 。
亏 了 那 个 公益 广告 ， 中国人 的 市民 意识 多 提高 。
但是 别人 先 来 了 ， 当然 再 后边 排队 。
人类 是 高等 动物 ， 都 通过 教育 就 改变 。
日本 ， 韩国 没 学 过 插队 现象 是 不 好 的 事 的话 ， 他们 也 没有 市民 意识 。
如果 急救车 和 警车 在 路上 后面 都 表示 处于 危急 的 情况 ， 就 前面 的 车闪让 的 事情 也 能 发现 。
再次 如 有的 人 很 久 排队 ， 然后 发现 有 的 人 插队 ， 这 也 让 人 生气 。
插队 可以 觉得 个人 的 问题 ， 但是 这样 小小 的 决定 了 一 个 国家 的 印象 。
甚至 他们 接到 救护品 ， 他们 排队 得 很 好 。
所以 插队 发生 的 原因 就 是 在 从小 的 教育 中 对 排队 意识 的 培养 。
我 觉得 无论 如何 情况 下 ， 人们 插队 以前 先 要 提醒 自己 ， 别人 也 有 自己 的 特殊 情况 ， 他们 的 时间 和 努力 都 是 像 自己 的 ， 也 是 贵重 的 。
从 社会 的 角度 来 看 ， 政府 要 努力 把 文明 水平 提高 。
此时 的 花果山 被 围困 地 水泄不通 ， 悟空 与 之 展开 了 混战 ， 直 到 日落 西山 。
李 天王 重新 对 战略 布局 整顿 了 。
于是 玉帝 采纳 了 许旌阳 真 人 的 主意 封 孙悟空 去 了 管蟠 桃园 。
齐 天大圣 闹够 了 便 回 花果山 和 玩乐 。
几 个 仙女 来 了 蟠桃 圆摘桃 时 ， 告诉 孙悟空 是 王母 要 做 蟠桃 盛会 。
因为 孙悟空 吃 过 的 仙果 和 金丹 让 孙悟空 变 得 无懈可击 。
经过 一 整 天 的 战斗 ， 被 天兵 抓住 的 只 有 虎 ， 豹 等 之 动物 。
张爱玲 《 倾城之恋 》 的 主人公 男女 之间 的 感情 ， 许多 学者 对 这 个 问题 都 进行 不同 的 解读 。
张爱玲 在 1943年 发表 了 中篇 小说 《 倾城之恋 》 ， 许多 文学家 对 它 发表 评论 。
张爱玲 没有 正面 描写 这 个 相亲 与 跳舞 的 场景 ， 通过 回来 后 的 家人们 的话 来 交 这些 。
我 认为 这 种 看法 也 有 一定 的 道理 。
从 作为 中国人 的 自我 的 范柳 原来 说 ， 在 香港 能 见到 的 洋派 女人 不 能 给予 他 足够 的 民族 认同 。
白流苏 并 不 是 一 个 善于 吸引 异性 的 女人 ， 但 范柳 原 被 她 吸引 住 了 ， 在 一定 程度 上 与 “ 中国味 ” 有关 的 。
张爱玲 把 爱情剧 最 典型 的 求爱 场面 写成 如此 紧张 的 。
因为 这些 ， 白流苏 再 到 香港 以后 的 他们 关系 得 发展 很 快 。
现实 的 人们 对 自己 最 爱 的 情人 也 有 不 喜欢 之 处 ， 也许 有 缺点 比 有点 多 。
他 的 生活 变得 简单 平实 。
而 正 因为 这 本 ， 这 篇 小说 得到 广泛 的 欢迎 。
除外 ， 这 篇 被 沦为 还 指出 通过 贾宝玉 的 思想 ， 可以 看出 作者 的 早期 民主主义 思想 体系 。
她 代表 的 不仅仅 是 白流苏 个人 ， 也 反应 了 当时 那 个 封建 没落 的 时代 里 传统 女性 的 凄凉 的 人生 命运 和 传统 观念 。
上天 将 这 个 风流 潇洒 放荡不羁 的 范柳 原 送到 她 的 身边 。
仔细 从 小说 中 揣摩 张爱玲 对白 流苏 的 任务 塑造 得 便 可 知道 答案 。
由 此 展开 了 两 个 截然不同 性格 却 又 有 几 分 相像 的 脾性 之间 是 关于 爱情 的 “ 战争 ” 。
但 在 他 的 心 里 ， 对 女性 及 其 尊重 。
张爱玲 是 中国 现代 著名 作家 ， 作者 原名 叫 张瑛
故事 发生 在 香港 。
这 场 战乱 使 成千上万 的 人 牺牲 了 ， 成千上万 的 人 痛苦 ， 在 经济 方面 也 受到 了 一定 的 灾难 。
从 性 叛逆 、 男人 解放 和 初 民主义 思想 。 在 贾宝玉 这 一 个 人物 ， 身上 都 有所 体现 。
贾宝玉 是 中国 文学史 上 一 个 十分 独特 的 ， 充满 了 深刻 矛盾性 的 复杂性 的 艺术 。
然而 真实 生活 当中 的 她 正好 是 与 镜子 倒影 当中 光鲜 靓丽 的 她 成为 了 一 个 明确 的 对比 。
她 选 在 “ 向 死 而 生 ” 。
一般 战争 会 给 人 带来 灾难 、 痛苦 、 人 流离失所 、 死亡 。
在 这 部 小说 中 却 相反 ， 战争 给 流苏 和 柳原 似乎 很 幸福 。
贾宝玉 是 一 个 性格 丰富 、 复杂 相些 矛盾 。
贾宝玉 没有 一般 的 男人 做 的 事情 。
比起 女孩 来 ， 男孩子 都 有 更 多 的 独立 倾向 ， 但 伴随 着 种 独立 而 来 的 是 孤独 。
为了 刺激 经济 高速 发展 ， 榨取 更 多 的 乘余 价值 ， 维护 这 个 高速 运 的 资本主义 机器 ， 资本家 不断 采取 增加 劳动 时间 和 劳动 强度 的 办法 来 残酷 地 剥削 工人 。
我 去年 五·一节 就 没有 出去 那儿 旅游 ， 就 在 家里 打扫 卫生 。
但 我 也 想 应该 会 有 人 不 喜欢 放假 的 人 。
每 天 上课 ， 虽然 不 是 什么 很 大 的 动作 的 劳动 ， 但是 也 要 用 头脑 的 劳动 。
齐 天大圣 ， 从 酒 中 醒 过来 的 时候 ， 蟠桃 大会 变得 乱七八糟 了 。
从 我们 的 生活 中 最 亲密 的 单词 也 有 这样 的 差异 。
馒头 的 来源 来自于 “ 三 国 演义 ” 中 。
而且 海上 贸易 重视 際祀 的 特点 也 加强 这样 的 说法 。
不 尽 食物 上面 的 单词 ， 这样 的 差异 有 的 时候 引起 两 国 关系 的 恶化
之所以 “ 端午节 ” 这 个 词 来自于 春秋 战国 时期 的 爱国 诗人 屈原 的 故事 ， 但是 现在 的 两 国 端午节 的 内容 是 不同 的 。
当然 我 在 中国 提出 议见 。
第一 声 “ 哎 ” 就 能 感叹词 。
韩语 对 声调 没 受 任何 影响感 。
因为 我 认识 一 个 词但 常常 说错 声调 你 就 别人 听 不 懂 。
一般 韩国 留学生 的 声调 问题 相同 的 。
道路 两 边 有 很 大 树 排列 着 。
其中 最 漂亮 的 是 盛开 鲜花 。
这里 是 南山 地区 最为 古老 的 佛像 之一 。
我们 也 夹杂 的 人流 中 ， 前来 膜拜 了 。
浏览 庆州石 都 也 就 等于 在 探索 古代 灿烂 文化 的 遗迹 ， 知道 了 新罗 王朝 时代 当时 的 文化 。
上 中 7点 ， 我 和 哥哥 依依不舍 地 踏上 了 归途 。
中国人 习惯 于 用 木 筷子 来 吃饭 ， 反 来 韩国人 喜欢 用 铁制 的 筷子 。
中国 的 勺子 一般 多数 为 汤勺 。
用 它 吃 像 炒饭 一样 的 用 筷子 很 难 去 挟 的 饭时 ， 中国人 会 用 手 拿 着 碗 去 吃 。
韩国人 吃饭 时 拿 着 碗 吃饭 是 不 文明 的 礼节 。
关于 吃饭 要 讲 的 礼节 来 说 。 中国人 吃饭 最 年长 的 人 要 座 在 正 对 着门 的 位置 。
因为 那 个 位置 最 能 到 每 位 来宾 ， 视野 都 是 最 好 。
年轻人 主动 地 把 好 位子 让给 年长人 的 。
我 非常 荣幸 在 这 部 电视 节目 介绍 中 代表 我 国 送给 中国 礼物 。
珍 岛 位于 韩国 的 南部 。
有 一 个 人 买 了 一 条 已 成长 好 的 珍岛犬 。
它 走 的 距理 是 人 开车 的 得 走 三 个 小时 的 非常 长 的 距理 。
按照 很多 种 原因 ， 珍岛犬 在 1962年 被 韩国 政付 制定 了 天然 纪念物 ， 国家 开始 保护 珍岛犬 。
现在 大家 都 了解 我 为什么 珍岛犬 送给 中国 吗 ？
珍 岛犬 猎 一些 比 它 大 的 动物 时 ， 虽然 自己 身体 小 、 力量 不 大 也 拼命 地 咬 对方 、 永 不 放弃 。
总而言 之 ， 我 希望 不管 韩国人 或 中国人 都 能 学珍岛犬 的 精神 ， 而且 要 学 它 的 忠诚 精神 ， 忠诚 祖国 ， 爱护 祖国 。
我 代表 韩国 送 中国 礼物 的 是 韩国 传统 混合 料理 与 混合 甜点 。
这些 是 在 中国 有名 的 我 的 国家 演员 亲自 做 的 。
我 在 中国 见 中国 朋友 ， 听 中国 大学 的 课 ， 去 看 中国 各 各 地方 。
我们 一生 当中 ， 可以 见 许多 邻居 ， 但是 不 能 对 他 有 深刻 的 印象 。
我 从来 见 过 好多 邻居 ， 有 一 位 奶奶 给 了 我 了 难忘 的 记忆 。
我 在 小学 的 时候 ， 我 是 个 非常 淘气鬼 ， 喜欢 开玩笑 。
最后 我们 听到 了 那 位 奶奶 发 脾气 ， 给 我们 脸红 脖子 粗 地 吼叫 。
下 一 天 ， 我们 跟 平时 一样 集合 在一起 ， 我 先 建议 今天 我们 又 去 我 的 邻居 摁 电铃 跑走 的 游戏 。
我 被 她 整治 了 一 个 小时 ， 那时候 我 是 快出哭 的 。
我 看 起来 他们 不但 日子 过 得 非常 穷苦 ， 而且 平时 的 样子 也 挺 不起眼儿 的 。
我 以为 我 要是 开始 把 蜡烛 借给 他们 的话 ， 那 以后 他们 每 天 找 我 要 借 什么 东西 了 。
那 一 个 穷 小 男孩子 听见 我 说 的话 ， 忽然 笑 了
那 一 天 以后 ， 我 常常 拿 着 小 的 东西 去 他们 家 一边 吃 ， 一边 一起 聊天 。
读 莎士比亚 的 作品 使 人 感悟 人生 的 辛酸 ， 读 鲁迅 的 文章 让 人 让清 社会 的 黑暗 。
要 有 保护 自己 的 国家 文化 的 意识 ， 要不是 读 这些 书 的 人 会 更加 减少 。
不知不觉 到 二 年级 的 第一 个 学期 立刻 结束 。
我 在 这 六 个 月 学 过 了 很多 东西 ， 还 通过 这 时间 让 我 自己 进一步 的 发展 。
因此 最后 自己 总结 了 决 觉 这 个 问题 的 方法 。
翻倒 的 水 ， 不 能 再 把 装 在 瓶 里 。
最 总 ， 我 对 这 时间 非常 的 感谢 ！
那时候 她 已经 挡 不 住 怀疑 别人 的 念头 了 。
这 个 作品 的 中心 内容 是 女生 是 一 种 常 感到 孤独 的 动物 ， 没有 收到 异性 的 爱情 的话 没有 浇水 的 玫瑰 一样 变得 枯萎 了 。
白流苏 的 社会 还 是 个 因 男人 为主 的 。
古代 是 以 力量 为 分 阶层 的 社会 。
由 此 范柳 原 把 女生 看成 “ 脚 底下 的 泥 ” 。
张爱玲 在 这 种 幻想 小说 当中 添加 了 批判 社会 和 自己 贴实 的 故事 给 读者 展开 了 又 美丽 又 给 我们 领悟 人生 的 美妙 的 世界 。
《 倾城之恋 》 是 张爱玲 的 短片 小说 之一 。
由于 尴尬 的 身份 ， 他 的 童年 可以 说 是 充满 “ 羞辱 、 疑惑 和 强烈 的 罪恶感 。
高中 毕业 之后 我 来到 北京 ， 遇到 了 无数 的 困惑 ， 但是 小时候 的 我 ， 却 很 自然 地 接受 并 适应 中国
由于 母亲 工作 的 关系 ， 我 在 小学 三 年级 的 时候 住 过 北京 。
虽然 我 不 会 说 汉语 ， 连 同学们 的 名字 都 不 清楚 ， 但是 每 天 一起 跑来 跑去 ， 现在 想 起来 ， 我 和 大家 之间 成立 了 一 种 非 语言 的 沟通 。
坐 在 母亲 骑 的 自行车 后边 走 过 的 路 、 爬过 的 纪念碑 、 学 过 的 “ 鹅 ， 鹅 ， 鹅 … … ” 的 歌 ， 我 一下子 都 想 起来 了 。
我 选择 了 到 北京 留学 ， 才 能 想起 那些 快乐 的 ， 幸福 的 记忆 ， 是 一 件 非常 幸福 的 事情 。
轻声 走 过去 ， 半 蹲 下来 仔细 察看 那里 有 动静 ， 如果 看到 了 蛐蛐 在 爬动 ， 也 要 按兵不动 ， 等 有 十足 把握 了 ， 再 伸手 上前 遮盖住 那 只 蛐蛐 。
我 从 幼儿园 一 年级 到 出 中 三 年级 就 在 一 所 温爱 的 学校 ， 强 民 学校 离 我 的 家 两 公斤 。
我 记得 我 的 妈妈 来 送 我 到 学校 ， 当时 我 是 幼儿园 三 年级 ， 我 很 爱 哭 ， 不 想 去 学校 ， 到 下课 时 ， 妈妈 来 接 我 ， 我 却 会 哭 ， 因为 我 不 想 回家 。
我 小学 三 年级 最 深 的 印象 是 我 跟 男 同学 抄jia ， 我 忘 了 他 做错 了 什么 让 我 那么 生气 到 用 脚 踢 他 两 三 次 ， 他 差一点 就 要 打 我 了 ， 但是 没有 。
他 是 小学 五 年级 的 学弟 ， 我们 怎么 恋成 男女 朋友 我 也 忘 了 是 怎么 回 事儿 ， 我 记得 他 是 爱 运动 的 男孩 ， 他 踢 足球 很 历 害 、 打 乒乓球 也 不错 。
有 一 次 他 吃 的 冰淇冷 让 我 的 朋友 把 它 给 我 ， 我 不 知道 是 他 的 ， 我 吃 了 一 口 ， 然后 朋友 告诉 我 是 他 的 ， 所以 我 就 很 害羞 的 。
我 是 我 全 班 就 ai 的 女孩 到 体育课 ， 带 全 班 跑步 ， 其实 不 叫 “ 带 ” ， 反正 我 在 最 前面 。
我 在 上课 ， 小学 五 年级 就 是 下课 休息 时间 ， 他 和 他 的 朋友 总 看 我们 上 体育课 ， 我 有点 ▉ # ? # 。
每 周五 我 家 附近 我 的 寺庙 ， 寺庙 举行 夜市 ， 所以 每 周五 下课 后 就 要 买 东西 ， 跟 朋友们 走走 。
我 连续 当 拉拉 对四年 和 其它 跳舞 唱歌 的 活动 是 我 印象 中 有趣 。
小时候 妈妈 教 过 我 一 首 罗大佑唱 的 《 童年 》 的 一 首 歌 ， 当时 只 觉得 这 首 曲子 很 好听 ， 郎郎 上口 ， 但 发现 自己 越 长大 越 开始 明白 歌词 的 意义 。
也 有 我 自己 答 出来 的 时候 ， 那自毫感 不 打 一 处 来 ！
听 妈妈 跟 我 讲 ， 在 我 很 小时候 有 一 次 坐 在 爸爸 的 肚子 上 玩 的 时候 ， 爸爸 深 吸 了 一口气 ， 结果 把 我 给 吓哭 了 。
大家 已经 紧张 起来 了 ， 时间 快 到 晚上 时 ， 小 朋友 的 父母 已经 开始 回家 了 。
是 那 次 的 经历 是 一 种 教训 。
小孩子 是 创造 玩具 的 天才 ， 从 什么 都 没有 的 地方 做趣 的 东西 。
小孩子 之间 也 有 一 种 流行 的 。
老师 评 了 我们 ， 后来 大家 不 会 在 教室 里 做 了 。
这 泥土 团块 又 黑 又 圆 又 滑 又 光 ， 很 美丽 ， 后来 这 泥土 团块 变得 班 里 的 宝贵 。
或者 也 可以 说 童年 时候 无论 什么 无趣 的 东西 都 可以 做成 有趣 的 东西 的 力量 。
在 我 大学 的 那 一 年 ， 母亲 还 特地 花 钱 买 票 带 我 去 看 美国 剧团 上演 的 儿童剧 《 冰上 芝麻街 》 。
我 总会 在 那儿 买 一些 零食填填 肚子 。
这 也 是 我 当时 最 大 的 快乐 来 源泉 之一 。
有 一 种 动物 叫做 蜂 子 ， 这 种 动物 非常 勤劳 ， 也 非常 之间 合作 。
在 社会 当中 能 有 几 个 真心 永恒 不 变 的 对 你 有 福同享 ， 有 难 同 当 的 好 朋友 ， 只有 到 天荒 地老 ， 你 还是 他 心中 永恒 不 变 的 好 朋友 。
我 觉得 友谊 之间 最 宝贵 的 东西 是 在于 心意 上 。
在 泰国 ， 我 有 一 个 非常 的 好 的 好 朋友 。
他 今年 25 岁 ， 还 毕业于 泰国 曼谷 商业 大学 。
我 在 2005年 的 时候 认识 他 ， 我们 是 在 万佛慈恩寺 中学 认识 的 ， 我 刚 认识 他 的 时候 是 初一 ， 那时 他 已经 是 高二 的 学长 了 。
中国 是 世界 上 人口 最 多 的 国家 ， 北京 里 的 人 也 非常 多 ， 特别是 经济 文化 中心 。
地铁 里 的 人 也 非常 多 ， 中国人 说话 的 时候 也 很 大声 地 说话 ， 好像 装作 旁若无人 一样 的 大声 说话 。
到 我 来 了 北大 以后 才 才 发现 北大 建筑 也 现代化 的 建筑
这 几 部 电视剧 和 小说 都 很 吸引 我 ， 但 唯一 我 最 不 感 兴趣 的 《 三 国 演义 》 。
通过 罗贯中 在 这 两 个 回目 高超 的 语言 艺术 处理 ， 作者 从 不同 角度 揭示 了 诸葛亮 的 性格 特点 ， 使 其 人物 形象 更为 丰富 而 饱满 。
无论 对 三国 时代 了解 与否 ， 一旦 看 了 这 部 电影 的 人 都 赞美 不止 ， 十分 欣赏 。
我 通过 比较 《 三国志 演义 》 中 的 两 回 ， 分析 了 一下 罗贯中 如何 刻画 诸葛亮 这 个 人物 ， 并 这 两 者 之间 存在 什么样 的 区别
首先 ， 作家 借助 其他 人物 的 语言 以及 他们 处于 的 环境 ， 表达 了 诸葛亮 才华横溢 、 料事 的 面貌 。
诸葛亮 的 形象 被 别人 的 对话 、 评价 塑造 ， 这 导致 他 渗透 在 故事 情节 里 。
在 这样 的 情结 里 ， 罗贯中 起到 了 两 者 对比 的 作用 。
由此 可 见 ， 几乎 诸葛亮 引导 了 故事 情节
这些 句子 强烈 反映 出 诸葛亮 在 建国 立业 谨慎 地 持重 ， 并 具有 无比 的 使命感 。
从 那时 以来 每 次 吃豆腐 的 时候 我 都 有 一样 的 感觉 。
而且 从 我 的 角度 来 看 ， 最后 几百 年 才 豆腐 由 日本 传入 西方 。
凝固 以后 它 就 会 变成 豆腐 。
中国 有 很多 各种各样 的 豆腐 ， 不如 说 : 毛豆腐 、 酿 豆腐 、 豆花 、 麻婆 豆腐 、 干 豆腐 ， 豆腐皮 和 冻 豆腐 ， 而且 是 很 有名 的 臭豆腐 。
我 从小 的 时候 就 不 像 同龄 朋友们 一样 偏食 ， 一般 孩子们 不 爱 吃 的 蔬菜 和 水果 我 都 胡吃 。
我 妈妈 平时 做菜 也 爱 多 放 洋葱 。
我 来 中国 留学 后 的 洋葱 也 期 负 我 。
一 开始 中国 菜 也 很 不 习惯
随着 科学 的 发展 ， 人们 从 贫困 的 环境 中 可以 摆脱 而 来 ， 现在 享受 着 充足 的 食物 。
我 妈妈 说 我 从小 的 时候 ， 我 妈妈 勉强 吃豆腐 ， 所以 现在 能 吃 。
结果 那 一 天 不 去 吃 了 午饭 。
而且 连续 喝水 为了 减少 辣 的 痛 ， 所以 很 吃饱 了 。
随着 世界 上 的 发展 提高 ， 人们 的 生活 越来越 富裕 而 丰富 。
其中 好几 个 富人 再 也 不 讲究 基本 的 衣食住 ， 为 此 他们 要 开始 寻找 又 奇特 又 贵 的 食物 。
为了 得到 那样 的 食物 ， 无奈 危害 自然 生态 系统 ， 能 制造 社会 内 的 抵触 情绪 。
所以 我 不 喜欢 食用 它们 不 是 因为 我 吃惯 了 的 ， 而 不 是 这些 东西 本身 的 原因 。
为 此 ， 人们 产生 了 自己味 的 喜好 食物 。
我 特别 不 喜欢 这 种 人造 味道 的 汉堡包 ， 所以 我 吃 汉堡包 有 。
不过 老人 杀狗 的 时候 ， 杀别 的 动物 却 不 一样 。
为 此 我 亲密 的 朋友 的话 ， 跟 我 见面 的 时候 ， 大多 要 去 西方 食堂 还是 手 切面 食堂 等等 。
但是 以前 的 不 好 的 回忆 能 让 我 举棋不定 的 态度 。
其实 现在 也 讨厌 辣 的 菜 ， 可是 比 上 次 的 留学 吃 。
而且 这 次 留学 可能 是 最后 的 。
因此 我 可以 来到 中国 学习 ， 甚至 我 在 生活 方面 是 没有 困难 的 。
以往 任何 时候 更 重视 想象 ， 所谓 “ 创新 时代 ” 。
中国 是 发展 中 国家 ， 有 很多 地方 建 一些 高楼 大厦 、 公寓 等等 … … 因此 打工 时 发生 的 噪音 会 给 我们 的 耳朵 很 大 的 刺激 。
《 失恋 33 天 》 的 两 个 主角 都 是 城市 白领 ， 在 枯草 的 生活 中 寻找 着 浪漫 的 。
调查 显示 : 三成 受访者 又 做 作业 。 他们 多数 表示 出 了 留学生 也 用 攻 学习 。
5% 的 受访者 表示 做 工作 、 如 英语 辅导 。 这 类 人 的 国家 是 加拿达 ， 比例 最少 。
《 海豚湾 》 是 于 2009年 由 路易·皮斯霍 新 导演 拍摄 的 纪录片 。
但 当 他 心爱 的 海豚 自杀 以后 ， 里 克 深深 地 认识 到 海豚 需要 的 是 大海 而且 不足 人们 为 它 创建 的 狭隘 的 环境 。
在 韩国 有 老话 : “ 世上 没有 人 因为 他 害怕 蛆虫 ， 不 能 做到 发酵 酱 ！ ” 这样 ， 新 变化 可能 有 大 副作用 ， 但是 我们 要 积极 收容 变化 ， 而 要 开导 世界 。
这 是 人生 ， 盖茨 比 的 人生 当中 的 爱情 超越 了 世俗 带给 他 的 无穷 魅力 。
我 刚 开始 住 在 中 关新园 的 时候 ， 前边 和 旁边 的 没有 人 居 。
结果 吵架 了 ， 双方 都 会 感到 很 费尽 。
本人 来 北京 马上 就 要 两 年 多 了 ， 北京 的 生活 比较 舒服 ， 但 外国人 对 中国 的 印象 被 有些 问题 也 收到 影响 。
还 例如 本人 上 个 学期 亲身 骑 电动车 上课 的 时候 ， 一 辆 汽车 突然 向 我 飞驰 而 来 ， 当时 我 未 及 避那 汽车 就 装上 了 ， 但是 那 车 的 驾驶者 看到 我 是 外国人 ， 这 发生 的 情况 反而 都 询问 我 责任 ， 并且 他 驾 逆向 行驶 ， 我 正 给 中国 朋友 打 电话 时 ， 他 驾车 仓皇 逃走 了 。
对 外国人 来 看 ， 这些 问题 来 会 判断 中国 人民 的 文化 素质 非常 差 ， 其实 本人 知 着 那些 人 只是 少数 而已 ， 但 我 担心 站时留 在 北京 的 外国人 会 戴 着 有色 眼镜 来 看 中国人 。
有的 人 说 社交 网络 是 ‘ 潘多拉 的 盒子 ’ 如果 ， 不 好好 利用 社交 网络 的话 会 上面 监 很多 问题 和 带来 麻烦 。
我 当时 大吃一惊 ， 我们 都 是 从 各 地 来到 中国 留学生 同样 身份 的 留学生 ， 哪里 会 仅 限于 韩国 留学生 穿 的 衣服 呢 ？
全 世界 卡通片 排行榜 中 walle 之前 15 位 。
皮克斯 动画 工作室 的 代表 也 说 过 walle 是 一 部 完美无缺 的 卡通片 的 。
我 也 知道 每 天 打扫 宿舍 是 非常 辛苦 的 ， 但 如果 因为 管理 的 疏忽 ， 而 给 住 宿舍楼 的 学生 带来 不便 与 不 快乐 的 我 ， 我们 哪 有 必要 交 那么 多 钱 呢 ？
我 是 一 名 贵 公司 的 老 顾客 ， 我 想 经经意意 地 告诉 您 这 几 天 对 我 发生 的 事情 。
但是 很 开心 地 吃 中 ， 突然 感到 奇怪 ， 咬时 感到 有 一 个 小 硬 的 东西 ， 咬 不 了 。 所以 我 吐出 一 看 ， 就 发现 那 硬 的 东西 是 小 的 塑料 片 。
其实 ， 如果 他 说 “ 对 不 起 ” 这 一 句 就 不 会 让 我 情怀 不 宁 吧 。
我 认为 贵 公司 是 个 比较 大 的 企业 ， 应当 需要 具备 与 名副其实 的 服务 环境 。
我 已经 看 过 本 电影 十几 次 ， 但是 如果 有空 ， 我 会 再 看 一 次 。
问题 从 占菜 的 时候 ， 就 会 出现 了 。
作为 贵 店 的 一 名 顾客 ， 我 希望 能 改善 贵 店 环境 。
最后 我 想 说 一 句 : “ 对待 好 顾客 比 用 自来水 节省 的 钱 更 想 紧 。 ”
调查 分析 人员 认为 : 留学生 感觉 应 刻 出去 。 担 是 ， 调查 中 ， 上网 的 比例 达到 25% 。 这 个 数 不 太 少 。
电动车 是 对 学生 是 很 受 欢迎 的 交通 工具 。
所以 应刻 。 多 使用 别 的 交通 工具 出行 了 。
个个 人 互相 找 朋友 ， 价绍 自己 的 朋友 ， 为了 让 自己 的 人际 关系 广大 而 人们 参加 社会 网络 。
真 ， 用 武力 来 压迫 老百姓 示威 的 突呢斯 独裁 政权 被 用 社会 网络 传播 自 国 的 情况 的 人民 打坡 了 。
还有 ， 若 用 智能 手机 使用 社会网 绐 的话 ， 时间 和 场所 不 能 被 人们 认为 交流 的 障碍 。
但是 社会 网络 的 坏处 也 存在 ， 比较 严重 。
第二 是 信息 的 可靠性 低 的 。 社会 网络 是 所有人 可以 上 信息 和 传播 信息 ， 我 ] 们 不 可 判断 那 信息 是 对 的 或错 的 ， 第三 是 恶用 社会 网络 的 公司 。 他们 只 看 钱 ， 用 在 商业 上 。
家长 只 是 负责 给 学生 报 各 种 补习班 ， 放学 后 ， 孩子 不 回家 ， 直接 去 各 种 补习班 ， 小学生 的 时候 就 9点钟 回 回家 ， # 随 # 着 年龄 的 长大 ， 回家 的 时间 更 晚 。
所以 ， 韩国 的 孩子 和 父母 基本上 没有 沟通 ， 甚至 会 好 长 时间 见 不 到 工作 亲苦 的 爸爸 。
每 天 监督 孩子 完成 学校 的 作业 ， 还 多 布置 家庭 作业 ， 以 提高 孩子 的 成绩 。
他 的 恶梦 正 是 三百万 灾民 的 缩影式 … …
有 一 个 女人 推持 说 她 想 去 自 刹 。 她 推特 上 的 朋友们 之中 有 几 个 在 留言区 问 她 发生 了 什么 事 ， 但 一部分 人 把 她 的话 当成 玩 话 。
社会 网络 # ? # 我们 容易 可以 建立 、 断结 朋友 关系 ， 有些 社会 网络 保障 匿名性 。
这 是 为了 减少 国民 的 吸烟率 ， 而 防止 人民 的 被动 吸烟 的 目的 制定 的 法律 。
宿舍 的 环境 很 好 、 从 宿舍 到 学校 也 挺进 ， 宿舍 也 很 干净 。 但是 费用 时 很 贵 。
宿舍 的 一 个 月 费用 时 三千 元 钱 。 对 留学生 来 说 ， 三千 元 钱 是 很 贵 。
中国 的 国民 体育 应该 与 竞技 体育 共同 发展 ， 使 国家 选手 在 国际 比赛 上 获得 金牌 的 同时 ， 人民 也 能 将 运动 化为 生活 的 一 部份 。
加拿大 多数 的 运动 场所 仍 公共 场所 ， 使用者 缴费 。
目前 ， 随着 现代 的 生活 节 ， 人们 需要 的 就 是 最 快 的 联系 方式 ; 随着 科学 的 展 ， 联系 方式 也 日益 增多 。
所 似 我们 会 说 社交 网络 已经 是 我们 现代 人 的 生活 中 的 一 部分 ， 而且 从 社交 网络 那里 现代 人们 会 得到 更 多 的 东西 。
最后 ， 使用 社交 网络 的话 ， 会 使 您 的 人生 更 快乐 ， 更 有 意思 ， 而且 对 比较 有 年级 的 人 来 说 ， 通过 社交 网络 ， 因为 跟 年轻人 交流 他们 也 会 变 年 经 还 有 幽默 ， 跟 年轻人 容易 地 交流 。
我 是 来自 韩国 的 一 名 留学生 ， 想 向 中国 的 信号灯 系统 提出 建议 ， 希望 为了 解决 中国 的 交通 问题 ， 您 对 信号 灯 问题 的 重视 。
我 来 中国 不久 发现 了 很少 人 尊 守 交通 规则 ， 车 、 人 等 都会 闯红灯 过 马路 。
当时 ， 我 心 里 充满 了 恐惧 的 同事 对 中国 非常 矢望 了 。
到 21 世纪 ， 网络 晋遍 使用 ， 一般 没有 使用 网络 。
我们 所 认识 的 社会 网络 有 facebook ， 推特 ， QQ 等等 。 现在 全 世界 各 国人 用 这 社会 网络 来 交流 发言 自己 想 说 的 。
网络 的 晋 及 带来 了 社会 网络 的 晋及 。 每 次 用 社会 网络 的 人 越来越 长 。 如果 创造 有名 的 社会 网络 ， 那 可以 歉 很 多 钱 。 比如 facebook 的 创造 人 马克·扎克伯格 。
无论 你 在 哪里 ， 我们 都 可以 联系 。 由于 这样 的 好处 ， 很多 人 入迷 了 社会 网络 。
跟 陌生人 交流 ， 跟 朋友 交流 更 。
这样 的 个人 信息 很 重要 ， 但 社会 网络 公司 为了 歉 钱 ， 卖 我们 的 个人 信息 ， 主要 卖给 广告 公司 ， 他们 参考 我们 的 个人 信息 来 做 广告 。
有的 人 通过 社交 网络 来说 自己 是 那样 的 人 ， 喜欢 什么 歌 、 自己 对 莫 方面 有 怎么样 的 观点 等等 。
可以 拿出 你 的 手机 ， 打开 微信 后 瞬间 了解 所有 朋友 都 在 做 什么 : 正在 哪里 吃饭 、 情绪 、 失恋 和 交往 情况 、 买 了 啥 、 等等 细节 。
我 个人 亲眼 见 过 社交网 给 我们 男女 浪漫 带来 的 不便 有 了 社交网 以后 ， 很多 男人 和 女人 变 的 非常懒 ， 以及 慢慢 失去 自己 的 社会性 ， 和 社会 交流 经验 。
虽然 ， Linux 系统 操 做 很 难 ， 但是 ， Linux 系统 的 软件 大部分 都 是 免费 地 ， 而且 是 比贵 公司 的 软件 好 用 多 了 。
我 个人 觉得 这 是 开辟 创造 世界 的 第一 部 。
并且 ， 有些 驱动 存储 也 相当 大 ， 下载 的 时候 还 要 等 很 时间 。
搞 电脑 的 人 来 说 ， 这 时间 太 浪费 了 。
我 向 贵 公司 提出 警告 ， 这 一 回 ， 回 不 为 例 。
我 希望 贵 公司 能 更 关注 电脑 的 保安 上 。
这 部 电影 的 背景 是 21 世纪 ， 在 电影 里 为了 解决 越来越 恶化 的 地球 的 温暖化 ， 天上 放 了 一些 化学 物质 ， # 竟 # 然 是 那 个 化学 物质 引导 了 地球 冰河期 。
当然 没有 人 的 尊严性 。
我 觉得 这 列 火车 像 正 很 少 的 富人 # 统 # 治 大多数 的 人民 ， 为了 ？ 富人 的 利益 好多 没有 实力 的 人们 受到 # 痛 # 苦 。
还 有 每 列车 房 表示 各 个 的 社会 介 段 ， 越 往 前 走 越 很 好 的 环境 条件 。
看 着 这 部 电影 就 想起 这 部 关点 。
对 我 来 看 现在 的 社会 是 不 太 理想 ， 这 部 电影 给 我们 想 什么样 的 社会 是 美好 ， 理想 ， 还 有 环境 的 问题 ， 现在 除了 地 温暖化 以外 ， 很多 环境 问题 ， 但 并 不 没有 解决 。
我 认为 工业 工厂 是 污染 环境 的 最 主要 原因 ， 因此 在 工厂 周围 需要 较 广阔 ， 并 我们 能够 管理 好 的 森林 。
而且 ， 现在 市民 的 文化 水平 越来越 好 ， 也 有 很 外国 方客 。
北京 大学 没有 没 有 采取 任何 措施 来 推动 新 教育 发展 。
当然 上述 措施 不 全面 ， 但 我 希望 能 引发 辩论 反思 ， 让 未来 与 您 进行 对话 。
此时 都 会 发现 人们 不 尊 守 交通 规律 ， 导致 交通 混乱 甚至 交通 事故 。
这 不 算是 大 问题 ， 最 大 问题 就 是 人们 不 尊 守 规律 。
1 . 在 拥挤 时间 ， 让 人们 尊守 交通 规律 ， 派 至少 两 个 警察 或者 交通 管理者 。
显然 ， 如果 人们 意识 到 路上 有 人 的 管理 交通 ， 他们 会 尊守 规律 得 多 。
最后 ， 可怜 的 相恩 失去 了 妈妈 ， 边 哭 着 边 在 妈妈 的 手 中 写道 : 我 非常 幸福 能够 成为 你 的 女儿 ， 也 感谢 你 能够 做 的 漂亮 的 妈妈 ！ 经历 了 “ 离别 ” 变得 格外 成熟 的 相恩 把 妈妈 的 骨粉 撒 在 自己 最 喜欢 的 芳草 田 上 。
倘若 跟 朋友 约会 时 ， 没 带于机 ， 一定 会 发疯 。
有 人 假装 好人 ， 受 不 了 学习 压力 的 小 男孩 和 小 女孩 ， 听 此 骗人 的 巧舌如簧 ， 就 被 遍 上 。 犯人 对 他们 作 猥亵 行为 ， 拍 他们 的 照片 后 ， 把 照片 卖 出去 。 若 没有 社交网 ， 小 男 女孩 不 会 接触 坏人 ， 若 没有 接触 坏人 ， 不 会 被 骗 ， 若 没有 被 骗 的 活 ， 不 会 发生 诸多 令 人 伤心 的 事件 … …
单 不 正确 的 使用 会 孕育 了 危险 的 机会 。
现在 我 写 这 封信 ， 是 为了 向 你们 反映 在 探访 的 过程 中 遇到 的 困难 ， 愿 你们 能够 重视 我 提点 的 问题 ， 并 接纳 我 的 建议 ， 以便 建立 更 舒适 的 医院 环境 。
最后 要 反映 的 问题 是 关于 医疗费 的 问题 : 外国人 因 没有 保险 而 要 交 的 医疗费 是 很 高 的 ， 会 有 交费 延期 的 情况 。
但是 在 利用 你们 店 的 服务 时 发现 了 很多 不足 ， 我 想 给 您 提出 几 个 意见 。 希望 您 对 我 的 意见 引起 重视 ， 改善 店 内 饮食 环境 和 服务 态度 。
为了 来 休息 的 顾客 和 为了 来 就餐 不 发生 互相 影响 ， 希望 你们 店 采取 措施 加以 管里 。
服务 态度 方面 出现 的 问题 比较 严重 也 正 是 因为 此 我 打算 提笔 给 您 写信 了 。
我 知道 每 天 都 有 不同 的 客人 进来 让 你们 受到 辛苦 ， 但 希望 你们 把 这些 客人 服务 得 离开 店门 时 同 一 个 笑脸 ， 还 想 再 来 。
希望 能够 引起 北京 的 空气 污染 的 重视 。
其中 ， 我 还是 不 习惯 的 是 北京 的 空气 污染 。 北京 的 空气 无论是 春夏 秋冬 都 严重 。
比如 ， 一 个 在 法国 的 大学生 ， 在 上学 的 公交车 上 ， 可以 与 在 墨西哥 的 公司 职员 在 社交 网 上 自由 自在 地 讨论 欧 美 国际 贸易 ， 这 就 是 最 新 的 IT 技术 以及 ， 社交网 普及 在 全球 的 力量 。 从 这 可以 看出 ， 社交 网络 能 带给 每 个 人 积极 的 影响 。
第一 是 ， 建立 了 阔 的 人际 关系 ， 以前 通过 互联网 形成 的 虚拟 社交圈 只 是 双边 的 交流 ， 那时 没有 全球 内 普及 的 Network 。
甚至 灭亡 了 一 个 国家 ， 比如 突尼期尼主化 事件 。 突尼斯 的 市民们 通过 SNS 很快 就 形成 舆论 垮 了 突尼斯 独裁 政权
社交 网络 是 为 世界 个 国人 做 的 一 种 新 工具 ， 但 世界 人口 4分之1 的 人 使用 的 社交 网络 造成 着 严重 的 社会 问题 。
社交 网络 说 是 个 ‘ 双 刃 剑 ’ ， 它 能 不 能 当成 新 世代 的 交流 手段 是 看 我们 怎么 做 的 ， 我们 要 看 社交 网络 的 好 方面 ， 利用 它 本来 提 共 的 自己 的 功能 ， 不 要 弄得 过分 。
按照 技术 的 发展 ， 社会 出现 了 新 的 现象 ， 就 是 某 个 人 在 网络 上 写 自己 的 日记 ， 今天 自己 的 情绪 等等 。
甚至 把 自己 的 照片 上 在 网络 ， 这样 的话 ， 不但 表出 在 自己 的 情况 而且 表出 自己 的 情绪 ， 然后 无论 认识 的 人 不 认识 的 人 可以 一起 交流 、 分享 ， 目前 有 这样 的 现象 我们 叫 社友 网络 。
第一 ， 隐私 侵犯 ， 社交 网络 的 特点 之一 是 可以 跟别 的 人 一起 分享 自己 的 消息 ， 但 重要 的 不 知道 的 时候 可以 把 自己 的 隐私 消息 被 侵犯 ， 在 韩国 有 一 个 有名 的 男 歌手 ， 他 在 自己 的 社交 网络 上 是 非公开 地上 了 一 张 照片 ， 照片 就 是 跟 女 演员 只 穿 着 内衣 拍 的 照片 ， 由于 社交 网络 上 的 差错 ， 那个 照片 公开 着 登上 ， 公开 以后 他们 的 粉丝 ， 对 他们 失望 了 ， 掉头 不理 ， 他们 一下 不 能 受 欢迎 。
我们 在 这程 繁华 的 现代 社会 里 经常 能 碰到 这 种 事情 。
加拿大 是 人人 所 知 的 一 个 堂堂 的 世界 强国 ， 但是 使 人 感到 差异 的 是 它们 只 是 一 块 金牌 的 国家 。
也许 注重 “ 金牌 ” 的 奥运 强国 中国 或 韩国 ， 这些 人 的 娱乐 活动 是 晚上 喝酒 ， 熬夜 玩 游戏 这 种 对 身体 健康 有害 的 ， 而 加拿大人 享受 的 是 “ 绿色 游戏 ” 。
第三 ， 奥运 精神 不 是 指 狂 览 金牌 。
我 以为 这 个 是 因 该 的 ， 为了 跟别 的 人 一起 联系 ， 社交 网络 就 是 最 方便 的 ， 而且 比较 便宜 —— 例如 ， 人们 给 别人 打 个 电话 的 情况 比 以前 少 一点 ， 因为 有时候 ， 这样 的 联系 方式 比较 贵 。
不但 社交 网络 是 免费 ， 而且 比 写信方 。
我 个人 认为 这样 的 现 像 不 太 好 ， 因为 一直 在 家 里 拿 着 手机 跟 别人 聊天儿 很 长 时间 的话 ， 他 在 跟 别人 聊天儿 的 时候 ， 觉得 不 舒服 。
我 认为 社交 网络 有 很多 的 好处 ， 也 有 很多 的 坏处 ， 我 相信 适当 使用 社交 网络 ， 才 能 社会 成为 给 人们 帮助 。
爱因斯坦 说 : “ 我 担心 有 一 天 科技 充斥 人间 时 ， 世界 才 只 生下 笨蛋 的 一 代 。 ” 所以 我们 一定 要 主义 。
2004年 ， Facebook 在 美国 诞生 后 ， 随之 社交 网站 的 热潮 席卷 全球 。
虽然 中国 不 能 上 Facebook ， 但是 这样 情况 下 也 是 中国 自己 做 了 从网 和 微博 ， 日本 也 做 了 自己 国家 的 社交 网站 mixi 。
这 种 在线 聊天 、 博客 撰写 、 网页 游戏 等 多 种 网络 社交 工具 造成 了 一体 的 新型 虚拟 社区 形态 ， 对 现实社 社交 结构 形成 了 巨大 冲击 。
社交 网站 是 有 共同 的 爱好 或者 有 共同 的 目的 的 人 聚集 ， 为 人际 交往 提供 很 大 的 便利 ， 开创 了 现实 社会 之外 的 全新 社交 方式 。
但是 ， 虚拟 的 社会 交往 不 能 替代 现实 社交 ， 这 种 互相 阻隔 的 交往 方式 不 能 成为 人际 交习 的 主流 ， 否则 ， 过度 依赖 社交 网站 ， 会 降低 人们 社会 交往 的 能力 。
进入 21 世纪 ， 网络 的 发达 很 新月 异 。
我 一直 不 明白 为什么 不仅 是 一 两 个 的 年轻人 做 这么 幼稚 的 事儿 。 这 件 事情 证明 了 社会 上 确实 存在 着 一些 不 懂事 的 人 ， 对 他们 来说 特别 需要 有 人 来 教 他们 应该 怎么 利用 社交 网络 。
小说 情节 的 高潮 是 老三 去世 之前 ， 二 人 安静 地 躺 在 一 间 护士 那 借来 的 房间 里 ， 制造 了 令静秋 和 老三 终生 难忘 的 回忆 。
我 现在 在 苹果 公司 终于 当 了 副经理 。
前 两 年 的 今天 ， 我 您 公司 聘用 了 。
实不相瞒 ， 当时 的 我 对 电脑 软件 很 不 了解 ， 而且 总是 笨手笨脚 ， 什么 任务 都 办 得 很 差 ， 让 我 觉得 自己 是 个 饭桶 ， 特别是 没有用 的 人 。
他 和 我 是 同龄 的 ， 也 是 同乡 的 。 他 的 工作 经验 算是 不 大 丰富 ， 但 我 最 欣赏 的 是 他 不 是 一 个 轻易 放弃 的 人 。
这 句 话 至今 仍 刻骨铭心 ， 这 句 话 使 我 改变 了 想法 ; 这 句 话 给 我 加 了 油 。 这 句 话 令 我 勇敢 地 往 前 走 。
《 双 旗 镇刀客 》 是 导演 何平 1990年 拍摄 的 武侠片 ， 影片 风格 独树一帜 ， 与 此 前 和 此后 的 武侠片 都 有 很 大 的 差别 ， 风格 上 具有 浓厚 的 古 龙 小说 味道 。
他 父亲 死 前 说 要 他 去 双 旗 镇 找 “ 好 妹 ” 取媳妇 。 刚 开始 瘸子 和 好妹 都 看 不 起 她 ， 但 通过 常期 相处 ， 觉得 他 很 善良 ， 刀法 也 不错 ， 于是 在 好 妹 父亲 瘸子 的 安排 下 他们 成亲 了 。
有 一 天 在 双旗镇 来 了 几 个 流氓 ， 那 个 流氓 要 强奸 好 妹 ， 在 强奸 时 ， 突然 孩哥 看到 马上 跟 那 流氓 打死 了 。
这 件 事 惹恼 了 流氓 兄弟 一刀仙 ， 三 天 之后 会 来 报仇 的 。
孩哥 想起 沙里飞 ， 在 来 双 旗 镇 的 途中 认识 的 ， 于是 在 求沙里飞帮 他 的 忙 。
那天 要 跟 一 刀 仙 动手 ， 沙里飞 故意 让 他们 动手 好 了 ， 再 出现 ， 真 不 靠普 了 。
孩哥 几 岁 就 可以 取 媳妇 了 ， 还 很 坚强 ， 会 刀法 。
当时 小孩们 就 没有 上课 ， 因为 他 那 个 双旗镇 ， 他们 只 能 帮 爸妈 干活 ， 听 爸妈 的话 。
在 那个 镇里 有 很少 的 水 ， 因为 在 沙 上 生活 ， 可以 看出 他们 的 脸蛋 上 都 有点 黑呼呼 。
这 片子 还 有 一 种 武侠 电影史 上 的 独特性 ， 我 觉得 这 就 是 主 觉 是 孩子 ， 而 大部分 武侠 电影 的 主角 是 成人 了 。
这 也 是 一 种 比较 独特 ， 让 看片 的 人 知道 小孩 也 比 得上 大 男人 ， 要 靠 小时候 就 开始 苦练 ， 这 片子 还 教 我 做 什么 不 用 怕 ， 从 最后 片子 的 部分 ， 孩哥 真 的 很 怕 ， 眼睛 又 哭 ， 手 又 发斗 。
孩哥 是 有点 缺乏 信心 的 孩子 ， 从 片 中 可以 看 这 点 就 是 他 为了 确定 好妹 是 不 是 他 要 取 的 媳妇 ， 有 一 个 地方 可以 证明 她 的 屁股 上 会 有 痣 ， 所以 他 偷看 她 洗澡 ， 但 也 没 成功 ， 还 被 瘸子 打 了 。
时 移世移 ， 在 女人 越来越 有 能力 和 男人 竞争 的 时代 中 ， 男人 是否 也 该 做出 一些 改变 ， 也 试 着 处理 家务 ， 照顾 孩子 ？
当 我 正 为了 准备 生日 晚会 ， 七上八下 时 有 一 个 人 给 我 打 电话 ， 说 要 请 我 午餐 为 礼物 ， 我 兴高彩烈 。
为什么 比萨 做法 不 大 好 呢 ？ 其实 ， 问题 的 在于 使用 的 原料 是否 有 问题 。
她 说 : “ 不 只 是 必胜客 ， 比萨 都 能 使用 过剩 与 罐头 里 的 食物 来 作为 原料 。 ”
因此 ， 人们 把 比萨 列 在 “ 垃圾 食品 的 黑名单 ” 上 ， 让 它 不利于 身体 健康 。
第一 ， “ 加塞儿 ” 的 这 种 现象 是 缺乏 的 体现 。
大家 都 有 文化 ， 有 修养 的 家庭 来到 这里 。
本来 北京人 就 很多 的 了 ， 再 加上 外国 ， 外国人 更 增加 人口 了 ， 所以 插队 现象 在 地铁站 是 屡见不鲜 的 。
泰国 曼谷 虽然 也 是 泰国 的 首都 ， 但是 是 很 少 有 这样 的 现象 ， 原因 可能 是 因为 泰国 的 人口 没有 中国 这么 多 的 。
任何 事情 都 是 讲究 个 先来 后到 ， 如果 大家 都 在 用 自己 的 宝贵 时间 来 遵守 规则 ， 为什么 有些 人 就 做 不 到 ？
如果 在 车站 有 几 个 人 在 排队 ， 但 一旦 车 ， 就 在 排队 的 几 倍 插队 坐车 。
所以 我 刚 来到 北京 ， 别人 插队 ， 不 成 坐车 的 事情 多 得 数 不 清 ， 感到 气愤 了 好几 次 。
到底 为什么 他们 常常 不 排队 插队 呢 ？
另外 我 个人 认为 大部分 中国人 的 性格 都 着急 ， 像 有 着 强迫 观念 般 的 被 别人 插队 之前 自己 先 做 插队 。
我 认为 人民 的 性格 特点 也 是 可以 说 一 个 文化 ， 单独 我 想 说 没有 规律 的 “ 赶紧 ” 是 最 远离 于 “ 赶紧 ” 的 行为 ， 更 混乱 的 行为 ！
更 何况 拥有 5000多 年 历史 的 她 ， 对于 这 种 插队 的 现象 或许 已 是 根深蒂固 、 司空见惯 的 事情 了 。
看 完 之后 我 很 这 部 电影 很 有 意思 。
如果 我 没有 看 这 片 电影 ， 我 肯定 会 感到 很 大 的 后悔 。
在 《 独立 日 》 作品 中 ， 充分 地 表现 出 英雄主义 的 是 美国 总统 亲身 上 飞机 率领 他 的 部队 向 外星人 飞碟 扑 过去 的 场景 ， 我 感到 了 他 对 自己 国家 的 责任感 以及 他 强烈 地 追求 独立 的 迫切感 。
在 美国 指导 下 世界 各 国 准备 交战 的 场景 ， 就 容易 看透 美国 想 做 “ 世界 警察 ” 的 美国 文化 特征 。
虽然 这 部 电影 不 影响 那样 非常 精彩 的 华丽 ， 但是 我 认为 这 部 电影 包含 着 中国 独特 的 历史 。
对 我 来说 比 书 理解 得 更 容易 ， 读书 的 时候 ， 因 语言 的 问题 在 主人公 的 感情 上 有些 不 懂 的 ， 但 看 电影 的 时候 我 可以 看到 他们 脸上 的 表情 而 更 容易 了解 到 那些 事情 。
这 不仅 是 极 大 的 电影 的 紧张感 ， 而且 使 观众 不知不觉 之间 沉醉 在 电影 中 。
而且 就算 他们 有幸 没有 被 火 燃烧 ， 还是 隧道 里面 的 空气 很 少 ， 不 能 呼吸 ， 导致 窒息 。
在 这 部 影片 中 ， 这 四 个 人 每 一 个 人 都 有 着 自己 独特 的 故事 和 人格 特点 ， 但是 ， 这些 人物 的 背后 ， 透露 出 一 个 主题 : 不 怕 困难 ， 尽己所能 ， 团结 一致 ， 拼搏 奋斗 ， 哪怕 是 粉身碎骨 不 怕 。
除 此 之外 ， 还 勇敢 不 怕 死 ， 带领 士兵们 与 外星人 交战 ， 让 人们 感到 他 是 一 位 很 有 正面 的 总统 形象 。
更 让 人 感到 幸福 的 是 ， 在 回到 地球 后 ， 大卫 和 史蒂文 俩 人 摆 着 酷酷 的 姿态 ， 慢慢 地 走 在 沙漠 上 抽 雪茄 ， 还 有 他们 的 爱人 的 拥抱 。
可 就 是 这 看 起来 很 不 正经 的 老人 ， 内心 深处 是 一 个 爱国 之 心 。
他 的 制作 电影 虽然 一 部 一 部 都 是 关于 我们 世界 的 灾难 ， 但 热爱 收看 灾难片 的 观众 却 不 觉得 腻味 ， 反而 盼望 着 欣赏 到 艾默里奇 这 类似 的 新 作品 。
人们 熟悉 的 地球 变成 了 地狱 一般 ， 强烈 的 地震 ， 巨大 的 火山 就 发生 在 面前 。
在 轮船 上 为 人们 演唱 的 一 对 黑白 的 老年人 ， 表示 了 老 朋友 生死 相伴 ， 不 离 不 弃 的 友情 。
在 面 生死 的 时候 有 一 个 朋友 陪伴 ， 这 可 是 一 种 幸福 啊 ！ 那 种 幸福 是 很 难 用 语言 表达 出来 。
那时 的 她 的 家里 只 有 妈妈 一 个 人 ， 生活 也 不 富裕 ， 就 是 一 个 孤零零 的 小孩 。
故事 结束 后 ， 我们 可以 发现 ， 女 主角 的 名字 叫 什么 来 着 ， 电影 中 只 提到 她 是 江 小姐 ， 这些 观众 会 感到 更 悲伤 。
我们 小时候 都 有 过 暗恋 的 经历 。
从 现代 人 的 观点 来 看 ， 希区柯克 电影 清洁 显得 陈旧 。
其一 ， 男 主人公 斯考蒂 的 朋友 加文 请求 斯考蒂 侦探 要 想 精神 错乱 ， 而 恍惚 的 自己 妻子 玛德琳 之 行踪 。
《 迷魂记 》 这 部 电影 的 精彩 之 处 就 在于 它 把 几 个 毫 不 相干 的 要素 结合 在一起 ， 让 我们 为生 与 死 惊心动魄 的 同时 ， 一样 为 主人公 之间 的 情感 纠葛 神伤 。
我 看 完 这 部 电影 后 ， 感到 这 部 电影 引人 入胜 ， 这 是 值得 被 称为 当代 最佳 电影 之一 。
我 尤其 为 《 独立 日 》 的 卓越 的 视觉 效果 而 鼓掌 。
因此 这 种 电影 能 用 相对 少 的 费用 来 实行 出真 的 效果 。
就 利用 了 这 简单 的 主题 成为 了 名作 ， 原因 就 是 在 主人公 菲利普 传奇 般 的 故事 上 ， 他 所 创造 的 伟大 业绩 把 这么 简单 的 主题 升华 成 了 一 个 名作 。
如果 他 没有 朋友 的 帮助 ， 这些 梦想 只 能 成为 一 个 空虚 。
菲利普 的 好友们 也 为了 帮助 菲利普 在 暗暗 的 楼 里 一动不动 呆 了 四 个 多 小时 。
《 影武者 》 这 部 电影 是 描述 人物 的 心理 状态 的 变化 的 描述 太 精彩 的 电影 。
这 部 电影 最 大 的 特点 就 是 从 “ 影武者 ” 这 非常 独特 的 身份 来 的 魅力 ， 因为 是 这 独特 的 身份 ” 在 主人公 的 心 里面 产生 了 心理 上 的 复杂 的 矛盾 。
黑泽明 描写 了 这样 的 人们 的 心理 状态 的 大师 ， 他 为了 表现 这样 的 心理 上 的 矛盾 ， 用 长 镜头 和 ‘ Blocking ’ 表演 。
这 电影 的 主要 内容 就 是 主人公 的 心理 状态 的 变化 ， 在 另外 的 看法 上 这样 的 主人公 的 心理 状态 也 可以 说 对 武田 信玄 的 态度 的 变化 。
本来 主人公 不 太 喜欢 武田信玄 ， 因为 主人 公认 为 武田 信玄 是 一 个 “ 恶人 ” ， 但是 面对 武田 信玄 的 尊敬 心 越来越 大 ， 不过 改变 已经 在 自己 的 身上 的 习惯 是 很 难 的 课程 ，
武田信廉 就 是 在 电影 里面 唯一 的 理解 这样 的 困难 的 人物 ， 所以 他 一直 在 主人公 的 周围 帮助 主人公 助力 着 。
我 个人 认为 这样 的 将 两 个 人 比较 的 就 是 在 这 部 电影 里面 最 有 魅力 的 部分 ， 也 是 最 有 意思 。
去年 是 2012 年 ， 特点 是 现在 几乎 到 了 玛雅人 预言 到 世界 末日 的 2012 年 的 尽头 。
这 部 电影 讲述 的 是 一 种 可能性 ， 地球 会 不 会 在 2012 年 迎来 它 的 终点 。
电影 《 2012 》 是 古 玛雅人 的 世界 末日 预言 ， 大师级 导演 罗兰•艾默里奇 拍摄 的 一 片 关于 全球 毁灭 的 灾难片 的 电影 。
这 部 电影 使用 的 多 次 的 特技 摄影 和 影片 的 题材 使 我 感到 视觉 震撼 、 心 里 震撼 。
但是 ， 作为 像 木兰 这样 性格 活泼 、 开朗 的 女孩儿 当 被 什么 三从四德 束缚 住 的 时候 ， 我们 还 能 看到 真正 的 木兰 呢 ？
我 个人 觉得 ， 这 部 电影 很 好 一点 就 是 很 善于 描写 人物 的 心理 变化 。
影片 自己 而 有趣 地 描写 了 信廉 这 个 人物 转变 的 整个 过程 。
但是 ， 通过 波普 先生 父亲 的 遗产 拉近 了 孩子 和 前妻 的 关系 ， 懂得 了 家庭 的 温暖 ， 意识 到 了 作为 父亲 ， 该 如何 去 做 一 个 好 父亲 ， 好 丈夫 。
看 了 这 部 电影 之后 ， 深深 感到 了 一 种 命运 的 哲学 : 死亡 和 生命 之间 并 不 是 对 此 对立 的 ， 而 是 一 种 延续 ， 一 种 爱 的 延伸 和 希望 的 延续 ， 从而 展现 出 影片 人性 关怀 的 人文 主题 。
使 我 眼泪 流出 的 这 个 故事 ， 导演 可能 告诉 我们 父子 之间 的 真实 感情 交流 ， 也 是 生者 与 逝者 的 交流 。
List ， 不但 能 回忆 自己 的 人生 ， 而且 能 准备 未来 。
这 部 电影 是 从 两 个 老人 突然 发病 后 ， 住院 的 情况 开始 的 。
但 两 个 老 人 的 性格 完全 相反 ， 但是 他们 的 共同点 就 是 他们 对 自己 的 人生 有 了 后悔 。
而 M 为
Lest 是 从 他们 出院 起 开始 被 他们 一 个 一 个 实现 了 。
没有 勇气 的 人生 ， 人生 的 小 部分 也 不 能 组成 。
List 是 给 我 留下 了 这样 的 教训 ， 我们 要 勇敢 的 与 他人 享受 自己 的 人生 ， 从此 我们 人生 的 幸福 会 增加 两 倍 。
在 南霸天 的 家里 偶然 遇到 了 一 位 华侨 巨商 洪 常青 ， 她 作为 礼品 转到 了 洪 常青 的 手 中 。
还是 先 看 张艺谋 的 《 活 着 》 以后 再 看 余 华 的 “ 活 着 ” 会 更 好 的 。
一般 的 故事 总是 让 好 学生 跟 坏 学生 在一起 的 ， 而 这 部 电影 只是 。
那 天 之后 她们 俩 成为 好 朋友 ， 后来 他们 的 关系 发展 到 谈恋爱 。
但 很 不幸 地 ， 上天 给 它 的 绳子 是 腐朽 的 ， 因此 老虎 还 没 到 天上 ， 就 死 了 。
然而 ， 我 认识 了 : “ 一百 个 话 不 胜于 一 次 。 ”
他 的 那 个 小小 的 房间 改变 成 天堂 般 的 人物 ， 我 也 能 做到 吗 ？
他 在 我 身边 的 时间 已 很 长 ， 我 在 他 的 身边 上学 到 了 很多 东西 ， 又 从 他 的 身边 上 我 感受 到 人生 的 “ 愉快 ” ， 我 感谢 给 他 。
“ 这样 的 生活 哪 有 意义 呢 ？ ” 他 默默 地 喊 了 一 声 ， 他 洗完 澡 才 次 再 设定 了 明天 的 闹钟 。
真正 的 大学生 不 能 像 他们 便利 。
当时 他 的 脑子 里 一 片 空白 ， 一 想 放弃 一切
泰国 西部 地区 的 森林 总 有 着 一些 传说 ， 因为 这里 的 老虎们 出没 ， 不少 猎人 都 会 到 这 非法 狩猎 。
某 日 ， 五 名 来自 不同 国家 的 猎人 来到 这 ， 他们 雇佣 一 名 当地 山民 作为 导游 ， 意气风发 地 进入 山林 中 。
猎人们 和 山民 恐惧 地 看到 两 名 警方 露出 了 虎牙 ， 脸上 浮现 了 虎纹 … …
他 才 知道 ， 原来 ， 宿舍 里 的 电 都 是 要 花 钱 充电 的 ！
这 件 事 让 我 忘不了 的 一 天 。
哥哥 很 贪婪 的 人 和 弟弟 是 很 善良 。
弟弟 有 很多 孩子 ， 生 话 很 困难 ， 就 去 哥哥 请 给 他 食物 。
弟弟 的 帮助 下 恢复 以后 ， 会 燕子 回家 。
商人 听到 后 慌张 了 ， 所以 商人 对 他 说 : “ 那 只 为 你 打折 啊 ！ ” 小 李 大声 笑 后 一 个 也 不 买 回家 。
他 妈妈 真正 的 包包裹 后 ， 在 星期一 送 了 说 大概 两 三 天 就 到 。
到 星期四 ， 他 开始 了 一点 担心 ， 所以 他 给 了 中国 邮局 打 了 电话 。
到 了 下午 他 开始 生气 了 一点 。
他 安慰 了 自己 ， 觉得 这么 辛苦 的 时间 一定 会 让 受到 包裹 的 瞬间 更 高兴 。
在 星期六 ， 他 早上 去 散步 在 路上 遇到 了 一 位 邮递 人 。
但是 沈瞎子 本来 很 穷 ， 更 不 容易 一 个 人 养 孩子 。
当时 ， 他们 俩 才 知道 了 昨天 晚上 他们 互相 带给 稻谷 ， 他们 才 知道 为什么 稻谷 无 减少 。
再 确定 两 个 人 的 友爱 ， 以后 兄弟 俩 更 珍贵 幸福 地 生活 。
很 久 以前 ， 在 某 深山 上 住 有 了 一 位 善良 的 兄妹 和 妈妈 。
后来 ， 每 次 风吹 过 山 茱萸林 ， 仍然 听 得到 近似 的 喊声 。
因为 他 总是 觉得 他 的 电动车 对 他 太 小 了 。
可是 比较 大 的 电动 比 他 觉得 的 更贵 。
西院 伽蓝 是 世界 上 最 古 的 木构 建筑 。
作为 多 地震 国家 ， 在 古代 建造 高塔 又 要 做到 防震 抗风 极为 是 不 易 。
充足 的 木材 资 及 中国 古代 木构 建筑 的 榫卯 结构 本身 起到 了 抗震 抗 风 的 作用 ， 是 日本 古代 建筑 及 结构 和 装修 上 ， 始终 使用 木 结构 的 原因 之一 。
很 久 以前 的 人们 已经 知道 使用 微积分 的 原理 了 ， 浮于 地面 的 柱子 则 由于 共震 ， 也 将 力对身 的 破坏 将 到 最低 。
日式 土豆 炖 牛肉 是 日本 最 常见 的 特别 有名 的 家庭 料理 ， 一般 每 个 主妇 都 会 做 。
今天 ， 我 来 介绍 一下 我 最 喜欢 吃 的 日本 料理 ， 也 有 世界 上 很 有名 的 日本 火锅 一一 寿 喜烧 。
关东 地区 和 关西 地区 ， 它 的 味道 和 作法 不 完全 一样 。
牛内微热 后 ， 把 白糖 和 盐撒 在 牛肉 上 ， 把 酱油 和 料理 酒浇 在 牛肉 上 。
如果 刚刚 煮完 的 肉 马上 放 进口 里 ， 会 受伤 。
最好 把 牛肉 跟 蒟蒻 丝分 放 在 锅 里 ， 避免 牛肉 变成 硬 。
大殿 里 有 一 座 阿弥陀佛 的 。 佛像 是 木制 的 ， 涂 了 漆 ， 镀 了 金 ， 还 有 被 金色 环 围绕 着 。
在 日本 今天 在 流通 的 10 圆 硬币 和 10000 圆 纸钞 背后 也 写 为 平等 院 凤凰堂 。
在 加强 柱子 的 上面 ， 造 上 门框 上 的 装饰 的 质木 ， 叫 “ 长 押 ” 。
由于 顾滤 到 中国 学生 和 留学生 所 在 中文 基础 和 学习 能力 方面 存在 差异 ， 中文 系 分别 为 留学生 和 中国 学生 设定 了 两 个 不同 的 班级 。
刚 我 来到 这里 的 住宿 ， 我 觉得 这里 的 环境 很 好 。
因此 ， 安全 对 每 个 人 来说 都 是 第一 件 的 事 。
一旦 被 抢劫 地 说 ， 难道 不 就 完蛋 了 吗 ？
安全 确实 是 一 件 要紧 的 事 ， 我 希望 您 能 紧 快 把 问题 解决 ， 为了 大家 的 利益 。
过 了 几 年 ， 他 的 工作 环境 和 经济 状况 稳定 之后 ， 我们 一家人 也 都 来到 了 中国 。
但是 由 我 自己 的 努力 和 老师们 、 朋友们 的 帮助 下 ， 现在 在 生活 中 与 人 用 汉语 交流 不 困难 。
我 刚 到 中国 ， 开始 学习 汉语 ， 是 与 一 位 朝鲜族 老师 学习 的 。
只有 我 和 其他 几 个 同学 是 外国 学生 ， 全 都 是 中国 学生 。
因此 我 在 这 所 学校 读书 时 ， 经常 跟 中国 学生 交流 沟通 ， 我 的 汉语 水平 提高 了 很多 。
从 我 学习 汉语 的 经历 中 ， 我 觉得 学习 汉语 要 主动 去 中国 朋友 交流 沟通 。
上学 、 逛街 和 看 电视 等 ， 生活 中 来自 做 的 一切 事情 都 是 在 学习 汉语 的 延长 。
与 中国 同学 生活 一起 ， 对 学习 汉语 很 有 帮助 。
此后 ， 新 的 世界 展现 了 我 的 眼前 。
天天 向 我 问 了 东方 神起 ， 神话 等 的 韩国 明星 。
与 男 同学们 刚 开始 交道 的 时候 ， 没 必要 很多 对话 了 。
但 惟一 的 缺点 是 做 提 靠 感觉 ， 因此 ， 可以 答对 ， 但 不 能 讲 理由 。
现在 ， 服 了 两 年 的 宾役 后 复学 了 没多久 ， 感觉 、 发音 和 写作 等 整 个 汉语 水平 不 如上 高中 的 其间 。
在 向 北京 的 飞机 上 ， 我 很 紧张 ， 但 我 有 了 目标 ， 所以 很快 就 平定 了 我 的 心里 。
不 有 我 当上 了 班长 ， 在 学校 过 得 很 喻快
到 北京 后 ， 我 在 学校 宿舍 里 整理 好 我 带来 的 东西 。
我 读到 这 个 材料 就 想起 了 这 篇 短 话 了 。
我 家人 有 五 口 人 。
我们 的 家人 的 几 口 都 不 一样 。
这 不 是 爸爸 感到 的 味道 错 ， 也 不 是 妈妈 感到 的 味道 错 ， 这 是 相对 的 。
可是 大部分 全 世界 人 喜欢 牛肉 。
所以 印度 对 全 世界 人 都 没有 说服 不 要 吃 牛肉 。
在 文章 里 说 ， 在 小岛 居民 的 生活 十分 原始 ， 不 穿 衣服 。
这 现象 是 相对 的 ， 不 能 说 是 谁 错 的 。
后来 被 发现 时 人们 非常 惊讶 与 小岛 上 的 居民 生活 。
那时 我 正在 写 论文 ， 在 网 上 看 过 一 篇 话 。
看 了 我 这 段 话 我 领悟 了 我 的 错误 。
人 ， 从此 到 死亡 ， 用 各种各样 的 衣料 把 自己 包 起来 自己 。
通过 人类 的 进化 ， 跟随 进化 的 智力 发展 ， 人类 得到 进化 ， 渐渐 地 具备 了 走向 文明 之 路 的 力量 。
而且 进一步 ， 我们 还 能够 推测 未来 人类 文明 的 面貌 。
人 和 人 之间 会 出现 坚硬 的 墙 ， 会 出 很 美 对 障碍 。
只要 掌握 好 沟通 的 技巧 ， 我们 才 能够 更 好 地 在 这 个 社会 好好 地 活 下去 。
把 这 把 钥匙 来 轻轻 地 插入 锁扣 ， 一 扭 ， 铁锁 就 能 开 。
只要 我们 打开 心灵 的 窗口 ， 与 他人 沟通 ， 我们 才 能 走进 到 他人 的 世界 里 。
我们 应 理解 别人 ， 才 能 放开 心结 ， 人生 更加 美丽 。
只有 心理 种 一 个 “ 理解 ” 之 心 ， 才 能 有 接受 和 我 不同 人 的 勇气 。
在 我们 所 居住 的 世界 里 是 多么 丰富多彩 的 。
因为 世界 的 多元化 ， 不 想 引起 人们 产生 了 兴趣 。
当 我们 发现 太平洋 上 有 一 座 小岛 以后 ， 因为 上面 居住 着 与 世 隔绝 的 一 群 人 ， 他们 过 着 很 原始 的 生活 ， 不 穿 衣服 ， 只 用 树叶 遮盖 身体 ， 使得 我们 都 惊讶 。
从 这 个 材料 里 的 短短 文字 ， 让 我 领悟 到 一 种 原理 。
在 任何 情况 下 ， 我们 不 应该 以 自己 的 所作所为 为主 ， 然后 把 自己 规定 的 原则 去 判断 别人 的 行为 。
我们 所 的 经验 没有 什么 永远 可以 用 “ 对 ” 来 概括 的 ， 也 没有 什么 永远 可以 用 “ 错 ” 来 概括 的 。
如今 ， 在 海尔 科技 管理 的 那 把 “ 闻名 遐迩 ” 的 大 铁锤 ， 向 人们 诉说 了 质量 与 品牌 的 故事 。
之所以 大自然 是 家 ， 所以 他们 爱 这 个 人 如 命 。
喜欢 自己 的 是 人 的 本能 ， 那样 你 的 不 会 说错 了 。
日常 生活 中 也 比较 容易 看到 因为 是 两 者 之间 的 不同 而 发生 的 问题 。
从 古 至今 社会 中文化 的 不同 ， 就 发生 文化 · 民族 · 国家 之间 的 矛盾 。
年龄 差 的 问题 发生 社会 秩序 的 混乱 了 。
其实 在 现实 上 很 难 找到 具体 的 方法 ， 因为 这 个 问题 跟 人 的 本性 有关 的 问题 。
现在 不同 的 文化 之间 的 矛盾 比 刚 开始 ， 世界化 时代 的 时候 的 矛盾 比较 缓和 多 了 。
通过 科学 技术 地 发达 ， 人际 关系 的 方法 越来越 多样 ， 越来越 容易 ， 互相 了解 的 机会 越来越 多 。
所以 解决 这 个 问题 不 是 一 年 两 年 后 就 能 解决 的 问题 。
我 认为 在 这样 的 情况 下 ， 世界 上 所有 的 人 对待 异域 文化 的 时候 ， 应当 具有 的 一 种 态度 。
因此 ， 以 以 自 国 文化 的 价值 标准 来 批评 别 的 文化 是 不 合理 的 ， 而且 应当 抛弃 的 一 种 痴 想 。
无论 如何 ， “ 文化 相对 主义 ” 这 观念 是 对 现代 人 更 应 具有 的 观念 。
根据 这样 的 现象 ， 不禁 让 我 自问 : 中国 的 传统 文化 为什么 会 遭到 了 冷落 ？
人们 看 土著人 原始 ， 土著人 看 外人 也 很 奇怪 。
我们 要 了解 互相 的 想法 ， 如果 跟 自己 不同 的话 ， 别 以为 奇怪 ， 就 要 接受 对方 的 价值观 与 想法 。
我 有 的 时候 跟 朋友 之间 发生 冲突 的 时候 ， 我 自己 总是 觉得 我 的 行为 没有 错误 的 ， 而 是 完美无缺 的 ， 而 是 朋友 做到 的 事情 都 对 不 起 我 。
我 很 固执 ， 遇到 什么 事情 就 都 怪 朋友 。
所有 的 错误 都 是 别人犯 的 ， 我 觉得 跟 我 是 没有 什么 关系 的 。
父母 总是 对 我们 说 唠叨 ， 与 我们 说 的 很多 。
但是 对 我们 来说 ， 父母 的 话 都 是 不 想 听 的 唠叨 。
他们 的 生活 ， 我们 不 应该 以 我们 的 标准 来 评论 他们 。
我们 没有 通过 其他 文明 比较 研究 、 验证 的 过程 ， 错误 地 把 我们 的 文明 当成 历史 上 现存 的 最 重 达 的 文明 。
自己 的 文明 社会 标准 ， 从而 排斥 其他 文明 。
土著 社会 只 有 一 个 另外 个 社会 ， 原始人 对 世界 的 经验 有 自身 的 完整 体系 。
我 认知 了 我 为了 自己 在 中国 的 生活 更 舒服 ， 要 学好 汉语 。
过 了 一 年 ， 当 我 毕业 那 所 小学 时 ， 没有 一 个 中国 同学 嘲笑 我 ， 我们 都 成为 了 好 朋友 。
我 九 岁 时 第一 次 来到 中国 ， 对于 汉语 可以 说 是 一窍不通 。
寿光 方言 当 了 我 跟 同学们 之间 的 桥 ， 因此 我 越来越 被 诱惑 他 方言 的 魅力 。
之前 没 读懂 、 死记 硬 背 的 古文 ， 现在 来 讲 ， 不仅 懂得 容易 背诵 ， 也 能 感受 到 文章 里 的 趣味 。
虽然 我 在 中国 北京 ， 可是 我 没有 觉得 我 在 中国 文化圈 里面 ， 而 是 我 在 多 文化圈 里面 生活 。
他们 不 在 家们 前 上 我 教会 ， 有时候 不管 我 平时 去 不 去 教会 ， 要 带 我 去 自己 所 去 的 教会 。
我 已经 说到 我 在 多 文化圈 里面 生活 ， 我 喜欢 我 所 接触 的 文化 ， 觉得 很 新颖 。
我 希望 这个 文化 都 要 发展 ， 发展 到 极点 ， 文化 的 花开绽 ， 发出 隐隐然 的 香 。
对于 异国 他乡 的 留学生 ， 不仅 是 学习 一 门 外语 ， 而 是 学习 外国 的 文化 以及 他们 的 人生观 。
可是 当 我 每 次 回想起 这些 事情 时 ， 我 就 不知不觉 地 充满 着 一 种 幸福感 。
那时 我 才 高一 ， 分到 高一 七 班 ， 在 班 里 唯一 的 一 个 我 是 韩国 学生 。
我 一 开始 几 天 都 不 能够 完全 融入 到 他们 上 ， 但 一 天 一 天 过去 不仅 我 的 汉语 水平 提高 了 ， 得到 了 这些 无比 珍贵 的 朋友 。
从 那时候 我 对 汉语 漫漫 地 失去 了 其 兴趣 。
第二 天 早上 ， 我 决定 从 小小 开始 学习 提高 我 的 汉语 水平 能力 。
这样 ， 我 的 舒舍 被 几十 张 黄色 的 卡 都 贴满 了 。
我 相信 自己 一定 能够 在 黑暗 中 走 出来 ， 热情 地 学习 ， 努力 奋斗 ， 才 能够 是 柳暗花明 又 一 村 。
学习 汉语 的 经历 以后 ， 在 我 的 人生路 途中 一定 能够 坚实 的 垫底 作用 。
